SHARE
TWEET

error in svn 1.6.17 against 2.3

a guest Jul 18th, 2011 102 Never
Not a member of Pastebin yet? Sign Up, it unlocks many cool features!
  1. 1>------ Build started: Project: zlib, Configuration: Release Win32 ------
  2. 1>Performing Makefile project actions
  3. 1>nmake /f win32\Makefile.msc LOC="-DASMV -DASMINF -I." OBJA="inffas32.obj match686.obj" CFLAGS="/nologo /W3 /FD /GX /DWIN32 /D_WINDOWS /MD /O2 /Zi $(LOC)" STATICLIB=zlibstat.lib  zlibstat.lib
  4. 1>'zlibstat.lib' is up-to-date
  5. 1>Build log was saved at "file://C:\build\subversion-1.6.17-apache23\zlib\Release\BuildLog.htm"
  6. 1>zlib - 0 error(s), 0 warning(s)
  7. 2>------ Build started: Project: neon, Configuration: Release Win32 ------
  8. 3>------ Build started: Project: libsvn_subr_dll, Configuration: Release Win32 ------
  9. 2>Performing Makefile project actions
  10. 3>Linking...
  11. 2>Build log was saved at "file://c:\build\subversion-1.6.17-apache23\neon\Release\BuildLog.htm"
  12. 2>neon - 0 error(s), 0 warning(s)
  13. 3>LINK : fatal error LNK1181: cannot open input file 'libapr-1.lib'
  14. 3>Build log was saved at "file://c:\build\subversion-1.6.17-apache23\Release\subversion\libsvn_subr\BuildLog.htm"
  15. 3>libsvn_subr_dll - 1 error(s), 0 warning(s)
  16. 4>------ Build started: Project: libsvn_delta_dll, Configuration: Release Win32 ------
  17. 5>------ Build started: Project: libsvn_diff_dll, Configuration: Release Win32 ------
  18. 5>Linking...
  19. 4>Linking...
  20. 4>LINK : fatal error LNK1181: cannot open input file 'libapr-1.lib'
  21. 5>LINK : fatal error LNK1181: cannot open input file 'libapr-1.lib'
  22. 5>Build log was saved at "file://c:\build\subversion-1.6.17-apache23\Release\subversion\libsvn_diff\BuildLog.htm"
  23. 5>libsvn_diff_dll - 1 error(s), 0 warning(s)
  24. 4>Build log was saved at "file://c:\build\subversion-1.6.17-apache23\Release\subversion\libsvn_delta\BuildLog.htm"
  25. 4>libsvn_delta_dll - 1 error(s), 0 warning(s)
  26. 6>------ Build started: Project: libsvn_fs_dll, Configuration: Release Win32 ------
  27. 7>------ Build started: Project: libsvn_wc_dll, Configuration: Release Win32 ------
  28. 7>Linking...
  29. 6>Linking...
  30. 7>LINK : fatal error LNK1181: cannot open input file 'libapr-1.lib'
  31. 6>LINK : fatal error LNK1181: cannot open input file 'libapr-1.lib'
  32. 6>Build log was saved at "file://c:\build\subversion-1.6.17-apache23\Release\subversion\libsvn_fs\BuildLog.htm"
  33. 6>libsvn_fs_dll - 1 error(s), 0 warning(s)
  34. 7>Build log was saved at "file://c:\build\subversion-1.6.17-apache23\Release\subversion\libsvn_wc\BuildLog.htm"
  35. 7>libsvn_wc_dll - 1 error(s), 0 warning(s)
  36. 8>------ Build started: Project: libsvn_repos_dll, Configuration: Release Win32 ------
  37. 8>Linking...
  38. 9>------ Build started: Project: svnversion, Configuration: Release Win32 ------
  39. 8>LINK : fatal error LNK1181: cannot open input file 'libapr-1.lib'
  40. 9>Linking...
  41. 8>Build log was saved at "file://c:\build\subversion-1.6.17-apache23\Release\subversion\libsvn_repos\BuildLog.htm"
  42. 8>libsvn_repos_dll - 1 error(s), 0 warning(s)
  43. 9>LINK : fatal error LNK1181: cannot open input file 'libapr-1.lib'
  44. 9>Build log was saved at "file://c:\build\subversion-1.6.17-apache23\Release\subversion\svnversion\BuildLog.htm"
  45. 9>svnversion - 1 error(s), 0 warning(s)
  46. 10>------ Build started: Project: libsvn_ra_dll, Configuration: Release Win32 ------
  47. 10>Linking...
  48. 10>LINK : fatal error LNK1181: cannot open input file 'libapr-1.lib'
  49. 10>Build log was saved at "file://c:\build\subversion-1.6.17-apache23\Release\subversion\libsvn_ra\BuildLog.htm"
  50. 10>libsvn_ra_dll - 1 error(s), 0 warning(s)
  51. 11>------ Build started: Project: mod_dav_svn, Configuration: Release Win32 ------
  52. 11>Compiling...
  53. 12>------ Build started: Project: libsvn_client_dll, Configuration: Release Win32 ------
  54. 11>version.c
  55. 12>Linking...
  56. 12>LINK : fatal error LNK1181: cannot open input file 'libapr-1.lib'
  57. 12>Build log was saved at "file://c:\build\subversion-1.6.17-apache23\Release\subversion\libsvn_client\BuildLog.htm"
  58. 12>libsvn_client_dll - 1 error(s), 0 warning(s)
  59. 11>c:\build\httpd-2.3.12-beta\include\ap_config.h(140) : fatal error C1083: Cannot open include file: 'ap_config_layout.h': No such file or directory
  60. 11>util.c
  61. 13>------ Build started: Project: svndumpfilter, Configuration: Release Win32 ------
  62. 13>Linking...
  63. 13>LINK : fatal error LNK1181: cannot open input file 'libapr-1.lib'
  64. 13>Build log was saved at "file://c:\build\subversion-1.6.17-apache23\Release\subversion\svndumpfilter\BuildLog.htm"
  65. 13>svndumpfilter - 1 error(s), 0 warning(s)
  66. 11>c:\build\httpd-2.3.12-beta\include\ap_config.h(140) : fatal error C1083: Cannot open include file: 'ap_config_layout.h': No such file or directory
  67. 11>repos.c
  68. 14>------ Build started: Project: svnlook, Configuration: Release Win32 ------
  69. 14>Linking...
  70. 11>c:\build\httpd-2.3.12-beta\include\ap_config.h(140) : fatal error C1083: Cannot open include file: 'ap_config_layout.h': No such file or directory
  71. 14>LINK : fatal error LNK1181: cannot open input file 'libapr-1.lib'
  72. 11>mod_dav_svn.c
  73. 14>Build log was saved at "file://c:\build\subversion-1.6.17-apache23\Release\subversion\svnlook\BuildLog.htm"
  74. 14>svnlook - 1 error(s), 0 warning(s)
  75. 15>------ Build started: Project: svnserve, Configuration: Release Win32 ------
  76. 15>Linking...
  77. 15>LINK : fatal error LNK1181: cannot open input file 'libapr-1.lib'
  78. 11>c:\build\httpd-2.3.12-beta\include\ap_config.h(140) : fatal error C1083: Cannot open include file: 'ap_config_layout.h': No such file or directory
  79. 11>mirror.c
  80. 15>Build log was saved at "file://c:\build\subversion-1.6.17-apache23\Release\subversion\svnserve\BuildLog.htm"
  81. 15>svnserve - 1 error(s), 0 warning(s)
  82. 11>c:\build\httpd-2.3.12-beta\include\ap_config.h(140) : fatal error C1083: Cannot open include file: 'ap_config_layout.h': No such file or directory
  83. 11>merge.c
  84. 16>------ Build started: Project: svnsync, Configuration: Release Win32 ------
  85. 16>Linking...
  86. 11>c:\build\httpd-2.3.12-beta\include\ap_config.h(140) : fatal error C1083: Cannot open include file: 'ap_config_layout.h': No such file or directory
  87. 11>lock.c
  88. 16>LINK : fatal error LNK1181: cannot open input file 'libapr-1.lib'
  89. 16>Build log was saved at "file://c:\build\subversion-1.6.17-apache23\Release\subversion\svnsync\BuildLog.htm"
  90. 16>svnsync - 1 error(s), 0 warning(s)
  91. 17>------ Build started: Project: svnadmin, Configuration: Release Win32 ------
  92. 17>Linking...
  93. 17>LINK : fatal error LNK1181: cannot open input file 'libapr-1.lib'
  94. 17>Build log was saved at "file://c:\build\subversion-1.6.17-apache23\Release\subversion\svnadmin\BuildLog.htm"
  95. 17>svnadmin - 1 error(s), 0 warning(s)
  96. 18>------ Build started: Project: svn, Configuration: Release Win32 ------
  97. 11>c:\build\httpd-2.3.12-beta\include\ap_config.h(140) : fatal error C1083: Cannot open include file: 'ap_config_layout.h': No such file or directory
  98. 11>liveprops.c
  99. 18>Linking...
  100. 18>LINK : fatal error LNK1181: cannot open input file 'libapr-1.lib'
  101. 18>Build log was saved at "file://c:\build\subversion-1.6.17-apache23\Release\subversion\svn\BuildLog.htm"
  102. 18>svn - 1 error(s), 0 warning(s)
  103. 11>c:\build\httpd-2.3.12-beta\include\ap_config.h(140) : fatal error C1083: Cannot open include file: 'ap_config_layout.h': No such file or directory
  104. 11>deadprops.c
  105. 11>c:\build\httpd-2.3.12-beta\include\ap_config.h(140) : fatal error C1083: Cannot open include file: 'ap_config_layout.h': No such file or directory
  106. 11>authz.c
  107. 11>c:\build\httpd-2.3.12-beta\include\ap_config.h(140) : fatal error C1083: Cannot open include file: 'ap_config_layout.h': No such file or directory
  108. 11>activity.c
  109. 11>c:\build\httpd-2.3.12-beta\include\ap_config.h(140) : fatal error C1083: Cannot open include file: 'ap_config_layout.h': No such file or directory
  110. 11>Generating Code...
  111. 11>Build log was saved at "file://c:\build\subversion-1.6.17-apache23\Release\subversion\mod_dav_svn\BuildLog.htm"
  112. 11>mod_dav_svn - 11 error(s), 0 warning(s)
  113. 19>------ Build started: Project: mod_authz_svn, Configuration: Release Win32 ------
  114. 19>Compiling...
  115. 19>mod_authz_svn.c
  116. 19>c:\build\httpd-2.3.12-beta\include\ap_config.h(140) : fatal error C1083: Cannot open include file: 'ap_config_layout.h': No such file or directory
  117. 19>Build log was saved at "file://c:\build\subversion-1.6.17-apache23\Release\subversion\mod_authz_svn\BuildLog.htm"
  118. 19>mod_authz_svn - 1 error(s), 0 warning(s)
  119. ========== Build: 17 succeeded, 17 failed, 0 up-to-date, 0 skipped ==========
RAW Paste Data
We use cookies for various purposes including analytics. By continuing to use Pastebin, you agree to our use of cookies as described in the Cookies Policy. OK, I Understand
 
Top