Krog

samba 4 errors on gentoo

Apr 10th, 2016
260
Never
Not a member of Pastebin yet? Sign Up, it unlocks many cool features!
  1. [ebuild N ] net-fs/samba-4.2.9::gentoo USE="acl client cups fam ldap pam system-mitkrb5 -addc -addns -ads -aio -avahi -cluster -dmapi -gnutls -iprint -quota (-selinux) -syslog -systemd {-test} -winbind" ABI_X86="32 (64) -x32" PYTHON_TARGETS="python2_7" 0 KiB
  2.  
  3. Total: 1 package (1 new), Size of downloads: 0 KiB
  4.  
  5.  
  6. >>> Verifying ebuild manifests
  7.  
  8. >>> Emerging (1 of 1) net-fs/samba-4.2.9::gentoo
  9. * samba-4.2.9.tar.gz SHA256 SHA512 WHIRLPOOL size ;-) ... [ ok ]
  10. * samba-disable-python-patches-4.2.9.tar.xz SHA256 SHA512 WHIRLPOOL size ;-) ... [ ok ]
  11. >>> Unpacking source...
  12. >>> Unpacking samba-4.2.9.tar.gz to /var/tmp/portage/net-fs/samba-4.2.9/work
  13. >>> Unpacking samba-disable-python-patches-4.2.9.tar.xz to /var/tmp/portage/net-fs/samba-4.2.9/work
  14. >>> Source unpacked in /var/tmp/portage/net-fs/samba-4.2.9/work
  15. >>> Preparing source in /var/tmp/portage/net-fs/samba-4.2.9/work/samba-4.2.9 ...
  16. * Applying samba-4.2.3-heimdal_compilefix.patch ... [ ok ]
  17. * Applying samba-4.2.7-pam.patch ... [ ok ]
  18. * Applying various patches (bugfixes/updates) ...
  19. * 4.2.7-nopython-auth_credentials_wscript_build.patch ... [ ok ]
  20. * 4.2.7-nopython-libcli_echo_tests_wscript_build.patch ... [ ok ]
  21. * 4.2.7-nopython-libcli_nbt_wscript_build.patch ... [ ok ]
  22. * 4.2.7-nopython-libcli_security_wscript_build.patch ... [ ok ]
  23. * 4.2.7-nopython-lib_ldb-samba_wscript_build.patch ... [ ok ]
  24. * 4.2.7-nopython-lib_talloc_wscript.patch ... [ ok ]
  25. * 4.2.7-nopython-lib_tevent_wscript.patch ... [ ok ]
  26. * 4.2.7-nopython-python_wscript_build.patch ... [ ok ]
  27. * 4.2.7-nopython-source3_param_wscript_build.patch ... [ ok ]
  28. * 4.2.7-nopython-source3_wscript_build.patch ... [ ok ]
  29. * 4.2.7-nopython-source4_auth_gensec_wscript_build.patch ... [ ok ]
  30. * 4.2.7-nopython-source4_auth_wscript_build.patch ... [ ok ]
  31. * 4.2.7-nopython-source4_dsdb_wscript_build.patch ... [ ok ]
  32. * 4.2.7-nopython-source4_libcli_wscript_build.patch ... [ ok ]
  33. * 4.2.7-nopython-source4_lib_com_wscript_build.patch ... [ ok ]
  34. * 4.2.7-nopython-source4_lib_messaging_wscript_build.patch ... [ ok ]
  35. * 4.2.7-nopython-source4_libnet_wscript_build.patch ... [ ok ]
  36. * 4.2.7-nopython-source4_lib_policy_wscript_build.patch ... [ ok ]
  37. * 4.2.7-nopython-source4_lib_wmi_wscript_build.patch ... [ ok ]
  38. * 4.2.7-nopython-source4_param_wscript_build.patch ... [ ok ]
  39. * 4.2.7-nopython-wscript_build.patch ... [ ok ]
  40. * 4.2.9-nopython-lib_ldb_wscript.patch ... [ ok ]
  41. * 4.2.9-nopython-source4_librpc_wscript_build.patch ... [ ok ]
  42. * 4.2.9-nopython-source4_ntvfs_posix_wscript_build.patch ... [ ok ]
  43. * 4.2.9-nopython-wscript.patch ... [ ok ]
  44. * 4.3.3-nopython-lib_tdb_wscript.patch ... [ ok ]
  45. * 4.3.3-nopython-source3_passdb_wscript_build.patch ... [ ok ]
  46. * 4.3.3-nopython-source4_lib_registry_wscript_build.patch ... [ ok ]
  47. * Done with patching
  48. * Will copy sources from /var/tmp/portage/net-fs/samba-4.2.9/work/samba-4.2.9
  49. * abi_x86_32.x86: copying to /var/tmp/portage/net-fs/samba-4.2.9/work/samba-4.2.9-abi_x86_32.x86
  50. * abi_x86_64.amd64: copying to /var/tmp/portage/net-fs/samba-4.2.9/work/samba-4.2.9-abi_x86_64.amd64
  51. >>> Source prepared.
  52. >>> Configuring source in /var/tmp/portage/net-fs/samba-4.2.9/work/samba-4.2.9 ...
  53. * abi_x86_32.x86: running multilib-minimal_abi_src_configure
  54. CCFLAGS="-march=native -Os -pipe -fomit-frame-pointer" LINKFLAGS="-march=native -Os -pipe -fomit-frame-pointer -Wl,-O1 -Wl,--as-needed" "/var/tmp/portage/net-fs/samba-4.2.9/work/samba-4.2.9/buildtools/bin/waf" --prefix=/usr --libdir=/usr/lib32 --enable-fhs --sysconfdir=/etc --localstatedir=/var --with-modulesdir=/usr/lib32/samba --with-piddir=/var/run/samba --bundled-libraries=NONE --builtin-libraries=NONE --disable-rpath --disable-rpath-install --nopyc --nopyo --without-acl-support --without-ad-dc --without-dnsupdate --without-ads --without-aio-support --disable-avahi --without-cluster-support --disable-cups --without-dmapi --without-fam --disable-gnutls --disable-iprint --with-ldap --without-pam --without-pam_smbpass --without-quotas --without-syslog --without-systemd --with-system-mitkrb5 --without-winbind --disable-python configure
  55. Checking for program gcc or cc : ['x86_64-pc-linux-gnu-gcc', '-m32']
  56. Checking for program ar : ar
  57. Checking for program ranlib : ranlib
  58. Checking for gcc : ok
  59. Checking for program git : /usr/bin/git
  60. Check for -MD : yes
  61. Checking for program gdb : not found
  62. Checking build system : Linux krogpc 4.1.15-gentoo-r1-krog #1 SMP Thu Feb 18 17:51:31 CET 2016 x86_64 Intel(R) Core(TM) i7 CPU 920 @ 2.67GHz GenuineIntel GNU/Linux
  63. Checking for header sys/utsname.h : yes
  64. Checking uname sysname type : Linux
  65. Checking uname machine type : x86_64
  66. Checking uname release type : 4.1.15-gentoo-r1-krog
  67. Checking uname version type : #1 SMP Thu Feb 18 17:51:31 CET 2016
  68. Checking for header stdio.h : yes
  69. Checking simple C program : ok
  70. Checking compiler accepts ['-Werror'] : yes
  71. Checking linker accepts ['-Wl,-rpath,.'] : yes
  72. Checking for rpath library support : ok
  73. Checking for -Wl,--version-script support : ok
  74. Checking compiler accepts ['-fvisibility=hidden', '-Werror'] : yes
  75. Checking for HAVE_VISIBILITY_ATTR : ok
  76. Checking compiler accepts -fPIC : yes
  77. Checking for inline : inline
  78. Checking for pkg-config version >= 0.0.0 : yes
  79. Checking compiler accepts [''] : yes
  80. Checking for header sys/types.h : yes
  81. Checking for header sys/stat.h : yes
  82. Checking for header stdlib.h : yes
  83. Checking for header stddef.h : yes
  84. Checking for header memory.h : yes
  85. Checking for header string.h : yes
  86. Checking for header strings.h : yes
  87. Checking for header inttypes.h : yes
  88. Checking for header stdint.h : yes
  89. Checking for header unistd.h : yes
  90. Checking for header minix/config.h : no
  91. Checking for header ctype.h : yes
  92. Checking for header standards.h : no
  93. Checking for header stdbool.h : yes
  94. Checking for header stdarg.h : yes
  95. Checking for header vararg.h : no
  96. Checking for header limits.h : yes
  97. Checking for header assert.h : yes
  98. Checking getconf LFS_CFLAGS : not found
  99. Checking getconf large file support flags work : not found
  100. Checking for large file support without additional flags : not found
  101. Checking for -D_FILE_OFFSET_BITS=64 : ok
  102. Checking for header sys/time.h : yes
  103. Checking for header time.h : yes
  104. Checking for header endian.h : yes
  105. Checking for header sys/endian.h : no
  106. Checking for HAVE_LITTLE_ENDIAN : ok
  107. Checking for HAVE_BIG_ENDIAN : not found
  108. Checking for header signal.h : yes
  109. Checking if signal handlers return int : not found
  110. Checking for variable __FUNCTION__ : ok
  111. Checking for va_copy : ok
  112. Checking for HAVE__VA_ARGS__MACRO : ok
  113. Checking for header linux/types.h : yes
  114. Checking for header crypt.h : yes
  115. Checking for header locale.h : yes
  116. Checking for header acl/libacl.h : yes
  117. Checking for header compat.h : no
  118. Checking for header attr/xattr.h : yes
  119. Checking for header dustat.h : no
  120. Checking for header fcntl.h : yes
  121. Checking for header fnmatch.h : yes
  122. Checking for header glob.h : yes
  123. Checking for header history.h : no
  124. Checking for header krb5.h : yes
  125. Checking for header langinfo.h : yes
  126. Checking for header libaio.h : yes
  127. Checking for header ndir.h : no
  128. Checking for header pwd.h : yes
  129. Checking for header shadow.h : yes
  130. Checking for header sys/acl.h : yes
  131. Checking for header sys/attributes.h : no
  132. Checking for header attr/attributes.h : yes
  133. Checking for header sys/capability.h : yes
  134. Checking for header sys/dir.h : yes
  135. Checking for header sys/epoll.h : yes
  136. Checking for header port.h : no
  137. Checking for header sys/fcntl.h : yes
  138. Checking for header sys/filio.h : no
  139. Checking for header sys/filsys.h : no
  140. Checking for header sys/fs/s5param.h : no
  141. Checking for header sys/fs/vx/quota.h : no
  142. Checking for header sys/id.h : no
  143. Checking for header sys/ioctl.h : yes
  144. Checking for header sys/ipc.h : yes
  145. Checking for header sys/mman.h : yes
  146. Checking for header sys/mode.h : no
  147. Checking for header sys/ndir.h : no
  148. Checking for header sys/priv.h : no
  149. Checking for header sys/resource.h : yes
  150. Checking for header sys/security.h : no
  151. Checking for header sys/shm.h : yes
  152. Checking for header sys/statfs.h : yes
  153. Checking for header sys/statvfs.h : yes
  154. Checking for header sys/termio.h : no
  155. Checking for header sys/vfs.h : yes
  156. Checking for header sys/xattr.h : yes
  157. Checking for header termio.h : yes
  158. Checking for header termios.h : yes
  159. Checking for header sys/file.h : yes
  160. Checking for header sys/ucontext.h : yes
  161. Checking for header sys/wait.h : yes
  162. Checking for header malloc.h : yes
  163. Checking for header grp.h : yes
  164. Checking for header sys/select.h : yes
  165. Checking for header setjmp.h : yes
  166. Checking for header utime.h : yes
  167. Checking for header sys/syslog.h : yes
  168. Checking for header syslog.h : yes
  169. Checking for header sys/mount.h : yes
  170. Checking for header mntent.h : yes
  171. Checking for header stropts.h : yes
  172. Checking for header unix.h : no
  173. Checking for header sys/param.h : yes
  174. Checking for header sys/socket.h : yes
  175. Checking for header netinet/in.h : yes
  176. Checking for header netdb.h : yes
  177. Checking for header arpa/inet.h : yes
  178. Checking for header netinet/in_systm.h : yes
  179. Checking for header netinet/ip.h : yes
  180. Checking for header netinet/tcp.h : yes
  181. Checking for header netinet/in_ip.h : no
  182. Checking for header sys/sockio.h : no
  183. Checking for header sys/un.h : yes
  184. Checking for header sys/uio.h : yes
  185. Checking for header ifaddrs.h : yes
  186. Checking for header direct.h : no
  187. Checking for header dirent.h : yes
  188. Checking for header windows.h : no
  189. Checking for header winsock2.h : no
  190. Checking for header ws2tcpip.h : no
  191. Checking for header errno.h : yes
  192. Checking for header getopt.h : yes
  193. Checking for header iconv.h : yes
  194. Checking for header nss.h : yes
  195. Checking for header sasl/sasl.h : yes
  196. Checking for inotify_init : ok
  197. Checking for header security/pam_appl.h : yes
  198. Checking for header zlib.h : yes
  199. Checking for header asm/unistd.h : yes
  200. Checking for header aio.h : yes
  201. Checking for header sys/unistd.h : yes
  202. Checking for header rpc/rpc.h : yes
  203. Checking for header rpc/nettype.h : no
  204. Checking for header alloca.h : yes
  205. Checking for header float.h : yes
  206. Checking for header rpcsvc/nis.h : yes
  207. Checking for header rpcsvc/ypclnt.h : yes
  208. Checking for header sys/sysctl.h : yes
  209. Checking for header sys/fileio.h : no
  210. Checking for header sys/filesys.h : no
  211. Checking for header sys/dustat.h : no
  212. Checking for header sys/sysmacros.h : yes
  213. Checking for header xfs/libxfs.h : no
  214. Checking for header netgroup.h : no
  215. Checking for header rpcsvc/yp_prot.h : yes
  216. Checking for HAVE_RPCSVC_YP_PROT_H : ok
  217. Checking for header valgrind.h : no
  218. Checking for header valgrind/valgrind.h : no
  219. Checking for header valgrind/memcheck.h : no
  220. Checking for header nss_common.h : no
  221. Checking for header nsswitch.h : no
  222. Checking for header ns_api.h : no
  223. Checking for header sys/extattr.h : no
  224. Checking for header sys/ea.h : no
  225. Checking for header sys/proplist.h : no
  226. Checking for header sys/cdefs.h : yes
  227. Checking for header utmp.h : yes
  228. Checking for header utmpx.h : yes
  229. Checking for header lastlog.h : yes
  230. Checking for header syscall.h : yes
  231. Checking for header sys/syscall.h : yes
  232. Checking for header sys/atomic.h : no
  233. Checking for header sys/prctl.h : yes
  234. Checking for prctl syscall : ok
  235. Checking for O_DIRECT flag to open(2) : ok
  236. Checking for long long : ok
  237. Checking for intptr_t : ok
  238. Checking for uintptr_t : ok
  239. Checking for ptrdiff_t : ok
  240. Checking for comparison_fn_t : ok
  241. Checking for _Bool : ok
  242. Checking for bool : ok
  243. Checking for int8_t : ok
  244. Checking for uint8_t : ok
  245. Checking for int16_t : ok
  246. Checking for uint16_t : ok
  247. Checking for int32_t : ok
  248. Checking for uint32_t : ok
  249. Checking for int64_t : ok
  250. Checking for uint64_t : ok
  251. Checking for size_t : ok
  252. Checking for ssize_t : ok
  253. Checking for ino_t : ok
  254. Checking for loff_t : ok
  255. Checking for offset_t : not found
  256. Checking for volatile int : ok
  257. Checking for uint_t : not found
  258. Checking for blksize_t : ok
  259. Checking for blkcnt_t : ok
  260. Checking if size of bool == 1 : ok
  261. Checking if size of char == 1 : ok
  262. Checking if size of int == 1 : not found
  263. Checking if size of int == 2 : not found
  264. Checking if size of int == 4 : ok
  265. Checking if size of long long == 1 : not found
  266. Checking if size of long long == 2 : not found
  267. Checking if size of long long == 4 : not found
  268. Checking if size of long long == 8 : ok
  269. Checking if size of long == 1 : not found
  270. Checking if size of long == 2 : not found
  271. Checking if size of long == 4 : ok
  272. Checking if size of short == 1 : not found
  273. Checking if size of short == 2 : ok
  274. Checking if size of size_t == 1 : not found
  275. Checking if size of size_t == 2 : not found
  276. Checking if size of size_t == 4 : ok
  277. Checking if size of ssize_t == 1 : not found
  278. Checking if size of ssize_t == 2 : not found
  279. Checking if size of ssize_t == 4 : ok
  280. Checking if size of int8_t == 1 : ok
  281. Checking if size of uint8_t == 1 : ok
  282. Checking if size of int16_t == 1 : not found
  283. Checking if size of int16_t == 2 : ok
  284. Checking if size of uint16_t == 1 : not found
  285. Checking if size of uint16_t == 2 : ok
  286. Checking if size of int32_t == 1 : not found
  287. Checking if size of int32_t == 2 : not found
  288. Checking if size of int32_t == 4 : ok
  289. Checking if size of uint32_t == 1 : not found
  290. Checking if size of uint32_t == 2 : not found
  291. Checking if size of uint32_t == 4 : ok
  292. Checking if size of int64_t == 1 : not found
  293. Checking if size of int64_t == 2 : not found
  294. Checking if size of int64_t == 4 : not found
  295. Checking if size of int64_t == 8 : ok
  296. Checking if size of uint64_t == 1 : not found
  297. Checking if size of uint64_t == 2 : not found
  298. Checking if size of uint64_t == 4 : not found
  299. Checking if size of uint64_t == 8 : ok
  300. Checking if size of void* == 1 : not found
  301. Checking if size of void* == 2 : not found
  302. Checking if size of void* == 4 : ok
  303. Checking if size of off_t == 1 : not found
  304. Checking if size of off_t == 2 : not found
  305. Checking if size of off_t == 4 : not found
  306. Checking if size of off_t == 8 : ok
  307. Checking if size of dev_t == 1 : not found
  308. Checking if size of dev_t == 2 : not found
  309. Checking if size of dev_t == 4 : not found
  310. Checking if size of dev_t == 8 : ok
  311. Checking if size of ino_t == 1 : not found
  312. Checking if size of ino_t == 2 : not found
  313. Checking if size of ino_t == 4 : not found
  314. Checking if size of ino_t == 8 : ok
  315. Checking if size of time_t == 1 : not found
  316. Checking if size of time_t == 2 : not found
  317. Checking if size of time_t == 4 : ok
  318. Checking for socklen_t : ok
  319. Checking for struct ifaddrs : ok
  320. Checking for struct addrinfo : ok
  321. Checking for struct sockaddr : ok
  322. Checking for HAVE_STRUCT_SOCKADDR_IN6 : ok
  323. Checking for struct sockaddr_storage : ok
  324. Checking for sa_family_t : ok
  325. Checking for sig_atomic_t : ok
  326. Checking for sigsetmask : ok
  327. Checking for siggetmask : ok
  328. Checking for sigprocmask : ok
  329. Checking for sigblock : ok
  330. Checking for sigaction : ok
  331. Checking for sigset : ok
  332. Checking for inet_ntoa : ok
  333. Checking for inet_aton : ok
  334. Checking for inet_ntop : ok
  335. Checking for inet_pton : ok
  336. Checking for connect : ok
  337. Checking for gethostbyname : ok
  338. Checking for getaddrinfo : ok
  339. Checking for getnameinfo : ok
  340. Checking for freeaddrinfo : ok
  341. Checking for gai_strerror : ok
  342. Checking for socketpair : ok
  343. Checking for variable IPV6_V6ONLY : ok
  344. Checking for HAVE_IPV6 : ok
  345. Checking whether we have ucontext_t : ok
  346. Checking for __sync_fetch_and_add compiler builtin : ok
  347. Checking for atomic_add_32 compiler builtin : not found
  348. Checking for strdup : ok
  349. Checking for memmem : ok
  350. Checking for printf : ok
  351. Checking for memset : ok
  352. Checking for memcpy : ok
  353. Checking for memmove : ok
  354. Checking for strcpy : ok
  355. Checking for strncpy : ok
  356. Checking for bzero : ok
  357. Checking for shl_load : not found
  358. Checking for shl_unload : not found
  359. Checking for shl_findsym : not found
  360. Checking for pipe : ok
  361. Checking for strftime : ok
  362. Checking for srandom : ok
  363. Checking for random : ok
  364. Checking for srand : ok
  365. Checking for rand : ok
  366. Checking for usleep : ok
  367. Checking for setbuffer : ok
  368. Checking for lstat : ok
  369. Checking for getpgrp : ok
  370. Checking for utime : ok
  371. Checking for utimes : ok
  372. Checking for setuid : ok
  373. Checking for seteuid : ok
  374. Checking for setreuid : ok
  375. Checking for setresuid : ok
  376. Checking for setgid : ok
  377. Checking for setegid : ok
  378. Checking for setregid : ok
  379. Checking for setresgid : ok
  380. Checking for chroot : ok
  381. Checking for strerror : ok
  382. Checking for vsyslog : ok
  383. Checking for setlinebuf : ok
  384. Checking for mktime : ok
  385. Checking for ftruncate : ok
  386. Checking for chsize : not found
  387. Checking for rename : ok
  388. Checking for waitpid : ok
  389. Checking for wait4 : ok
  390. Checking for initgroups : ok
  391. Checking for pread : ok
  392. Checking for pwrite : ok
  393. Checking for strndup : ok
  394. Checking for strcasestr : ok
  395. Checking for strsep : ok
  396. Checking for strtok_r : ok
  397. Checking for mkdtemp : ok
  398. Checking for dup2 : ok
  399. Checking for dprintf : ok
  400. Checking for vdprintf : ok
  401. Checking for isatty : ok
  402. Checking for chown : ok
  403. Checking for lchown : ok
  404. Checking for link : ok
  405. Checking for readlink : ok
  406. Checking for symlink : ok
  407. Checking for realpath : ok
  408. Checking for snprintf : ok
  409. Checking for vsnprintf : ok
  410. Checking for asprintf : ok
  411. Checking for vasprintf : ok
  412. Checking for setenv : ok
  413. Checking for unsetenv : ok
  414. Checking for strnlen : ok
  415. Checking for strtoull : ok
  416. Checking for __strtoull : not found
  417. Checking for strtouq : ok
  418. Checking for strtoll : ok
  419. Checking for __strtoll : not found
  420. Checking for strtoq : ok
  421. Checking for memalign : ok
  422. Checking for posix_memalign : ok
  423. Checking for prctl : ok
  424. Checking for strlcpy : not found
  425. Checking for strlcat : not found
  426. Checking for strlcpy : not found
  427. Checking for strlcat : not found
  428. Checking for library bsd : yes
  429. Checking for strlcpy : ok
  430. Checking for strlcat : ok
  431. Checking for getpeereid : not found
  432. Checking for getpeereid : ok
  433. Checking for library setproctitle : not found
  434. Checking for setproctitle : not found
  435. Checking for setproctitle : ok
  436. Checking whether we can use SO_PEERCRED to get socket credentials : ok
  437. Checking correct behavior of strtoll : not found
  438. Checking for if_nametoindex : ok
  439. Checking for strerror_r : ok
  440. Checking for getdirentries : ok
  441. Checking for getdents : not found
  442. Checking for syslog : ok
  443. Checking for gai_strerror : ok
  444. Checking for get_current_dir_name : ok
  445. Checking for timegm : ok
  446. Checking for getifaddrs : ok
  447. Checking for freeifaddrs : ok
  448. Checking for mmap : ok
  449. Checking for setgroups : ok
  450. Checking for syscall : ok
  451. Checking for setsid : ok
  452. Checking for getgrent_r : ok
  453. Checking for getgrgid_r : ok
  454. Checking for getgrnam_r : ok
  455. Checking for getgrouplist : ok
  456. Checking for getpagesize : ok
  457. Checking for getpwent_r : ok
  458. Checking for getpwnam_r : ok
  459. Checking for getpwuid_r : ok
  460. Checking for epoll_create : ok
  461. Checking for port_create : not found
  462. Checking for fgetxattr : ok
  463. Checking for flistea : not found
  464. Checking for flistxattr : ok
  465. Checking for fremovexattr : ok
  466. Checking for fsetxattr : ok
  467. Checking for getxattr : ok
  468. Checking for listxattr : ok
  469. Checking for removexattr : ok
  470. Checking for setxattr : ok
  471. Checking for library attr : yes
  472. Checking for flistea : not found
  473. Checking whether xattr interface takes additional options : not found
  474. Checking for dlopen : not found
  475. Checking for dlsym : not found
  476. Checking for dlerror : not found
  477. Checking for dlclose : not found
  478. Checking for library dl : yes
  479. Checking for dlopen : ok
  480. Checking for dlsym : ok
  481. Checking for dlerror : ok
  482. Checking for dlclose : ok
  483. Checking for declaration of dlopen : ok
  484. Checking C prototype for dlopen : not found
  485. Checking for fdatasync : ok
  486. Checking for declaration of fdatasync : ok
  487. Checking for clock_gettime : ok
  488. Checking whether the clock_gettime clock ID CLOCK_MONOTONIC is available : ok
  489. Checking whether the clock_gettime clock ID CLOCK_PROCESS_CPUTIME_ID is available : ok
  490. Checking whether the clock_gettime clock ID CLOCK_REALTIME is available : ok
  491. Checking for struct timespec : ok
  492. Checking for header net/if.h : yes
  493. Checking for header arpa/nameser.h : yes
  494. Checking for header resolv.h : yes
  495. Checking for res_search : not found
  496. Checking for library resolv : yes
  497. Checking for res_search : ok
  498. Checking for header libintl.h : yes
  499. Checking for library intl : not found
  500. Checking for declaration of dgettext : ok
  501. Checking for declaration of gettext : ok
  502. Checking for declaration of bindtextdomain : ok
  503. Checking for declaration of textdomain : ok
  504. Checking for declaration of bind_textdomain_codeset : ok
  505. Checking for bindtextdomain : ok
  506. Checking for textdomain : ok
  507. Checking for bind_textdomain_codeset : ok
  508. Checking for dgettext : ok
  509. Checking for gettext : ok
  510. Checking for pthread_create : not found
  511. Checking for library pthread : yes
  512. Checking for pthread_create : ok
  513. Checking for pthread_attr_init : ok
  514. Checking for pthread_mutexattr_setrobust : ok
  515. Checking for declaration of PTHREAD_MUTEX_ROBUST : not found
  516. Checking for declaration of PTHREAD_MUTEX_ROBUST (as enum) : ok
  517. Checking for pthread_mutex_consistent : ok
  518. Checking for crypt : not found
  519. Checking for library crypt : yes
  520. Checking for crypt : ok
  521. Checking for header readline.h : no
  522. Checking for header readline/readline.h : yes
  523. Checking for header readline/history.h : yes
  524. Checking for variable rl_event_hook : ok
  525. Checking for declaration of snprintf : ok
  526. Checking for declaration of vsnprintf : ok
  527. Checking for declaration of asprintf : ok
  528. Checking for declaration of vasprintf : ok
  529. Checking for declaration of errno : ok
  530. Checking for declaration of EWOULDBLOCK : ok
  531. Checking for declaration of environ : ok
  532. Checking for declaration of getgrent_r : ok
  533. Checking for declaration of getpwent_r : ok
  534. Checking for declaration of pread : ok
  535. Checking for declaration of pwrite : ok
  536. Checking for declaration of setenv : ok
  537. Checking for declaration of setresgid : ok
  538. Checking for declaration of setresuid : ok
  539. Checking for header poll.h : yes
  540. Checking for poll : ok
  541. Checking for strptime : ok
  542. Checking for declaration of strptime : ok
  543. Checking for working strptime : ok
  544. Checking for HAVE_GETTIMEOFDAY_TZ : ok
  545. Checking for C99 vsnprintf : ok
  546. Checking for HAVE_SHARED_MMAP : ok
  547. Checking for HAVE_MREMAP : ok
  548. Checking for HAVE_INCOHERENT_MMAP : not found
  549. Checking for HAVE_IMMEDIATE_STRUCTURES : ok
  550. Checking for HAVE_MKDIR_MODE : ok
  551. Checking for member st_mtim.tv_nsec in struct stat : ok
  552. Checking for member st_rdev in struct stat : ok
  553. Checking for member st_rdev in struct stat : ok
  554. Checking for member ss_family in struct sockaddr_storage : ok
  555. Checking for member __ss_family in struct sockaddr_storage : not found
  556. Checking for member sa_len in struct sockaddr : not found
  557. Checking for member sin_len in struct sockaddr_in : not found
  558. Checking for HAVE_UNIXSOCKET : ok
  559. Checking for HAVE_SECURE_MKSTEMP : ok
  560. Checking for HAVE_IFACE_GETIFADDRS : ok
  561. Checking for getpwnam_r : ok
  562. Checking for getpwuid_r : ok
  563. Checking for getpwent_r : ok
  564. Checking for declaration of getpwent_r : ok
  565. Checking C prototype for getpwent_r : not found
  566. Checking for declaration of getgrent_r : ok
  567. Checking C prototype for getgrent_r : not found
  568. Checking C prototype for getpwent_r : not found
  569. Checking C prototype for getgrent_r : not found
  570. Checking for getgrouplist : ok
  571. Checking for program perl : /usr/bin/perl
  572. Checking for program perl : /usr/bin/perl
  573. Checking for program perl : /usr/bin/perl
  574. Checking for perl 5.0.0 : ok 5.20.2
  575. Checking for perl $Config{vendorprefix}: : '/usr'
  576. Checking for perl $Config{vendorarch}: : '/usr/lib64/perl5/vendor_perl/5.20.2/x86_64-linux'
  577. PERL_ARCH_INSTALL_DIR: : '/usr/lib64/perl5/vendor_perl/5.20.2/x86_64-linux'
  578. Checking for perl $Config{vendorlib}: : '/usr/lib64/perl5/vendor_perl/5.20.2'
  579. PERL_LIB_INSTALL_DIR: : '/usr/lib64/perl5/vendor_perl/5.20.2'
  580. PERL_INC: : ['/etc/perl', '/usr/local/lib64/perl5/5.20.2/x86_64-linux', '/usr/local/lib64/perl5/5.20.2', '/usr/lib64/perl5/vendor_perl/5.20.2/x86_64-linux', '/usr/lib64/perl5/vendor_perl/5.20.2', '/usr/local/lib64/perl5', '/usr/lib64/perl5/vendor_perl/5.20.1/x86_64-linux', '/usr/lib64/perl5/vendor_perl/5.20.1', '/usr/lib64/perl5/vendor_perl', '/usr/lib64/perl5/5.20.2/x86_64-linux', '/usr/lib64/perl5/5.20.2']
  581. Checking for program xsltproc : /usr/bin/xsltproc
  582. Checking for program python : /usr/bin/python2.7
  583. Checking for program python : /usr/bin/python2.7
  584. Checking for program python : /var/tmp/portage/net-fs/samba-4.2.9/temp/python2.7/bin/python
  585. Checking for Python version >= 2.5.0 : ok 2.7.10
  586. Checking for library python2.7 : not found
  587. Checking for library python2.7 : not found
  588. Checking for library python27 : not found
  589. Checking for program python2.7-config : /usr/bin/python2.7-config
  590. Checking for custom code : Could not find the python development headers
  591. Dynconfig[STATEDIR]: : '/var/lib/samba'
  592. Dynconfig[SCRIPTSBINDIR]: : '/usr/sbin'
  593. Dynconfig[PAMMODULESDIR]: : '/usr/lib32/security'
  594. Dynconfig[WINBINDD_SOCKET_DIR]: : '/var/run/samba/winbindd'
  595. Dynconfig[PRIVATE_DIR]: : '/var/lib/samba/private'
  596. Dynconfig[SETUPDIR]: : '/usr/share/samba/setup'
  597. Dynconfig[PIDDIR]: : '/var/run/samba'
  598. Dynconfig[PKGCONFIGDIR]: : '/usr/lib32/pkgconfig'
  599. Dynconfig[DATADIR]: : '/usr/share'
  600. Dynconfig[CACHEDIR]: : '/var/cache/samba'
  601. Dynconfig[SBINDIR]: : '/usr/sbin'
  602. Dynconfig[NCALRPCDIR]: : '/var/run/samba/ncalrpc'
  603. Dynconfig[LMHOSTSFILE]: : '/etc/samba/lmhosts'
  604. Dynconfig[LOCKDIR]: : '/var/lock/samba'
  605. Dynconfig[PYTHONARCHDIR]: : '/usr/lib64/python2.7/site-packages'
  606. Dynconfig[PERL_LIB_INSTALL_DIR]: : '/usr/lib64/perl5/vendor_perl/5.20.2'
  607. Dynconfig[LOGFILEBASE]: : '/var/log/samba'
  608. Dynconfig[PYTHONDIR]: : '/usr/lib64/python2.7/site-packages'
  609. Dynconfig[PERL_ARCH_INSTALL_DIR]: : '/usr/lib64/perl5/vendor_perl/5.20.2/x86_64-linux'
  610. Dynconfig[NTP_SIGND_SOCKET_DIR]: : '/var/lib/samba/ntp_signd'
  611. Dynconfig[CONFIGFILE]: : '/etc/samba/smb.conf'
  612. Dynconfig[SOCKET_DIR]: : '/var/run/samba'
  613. Dynconfig[MODULESDIR]: : '/usr/lib32/samba'
  614. Dynconfig[WINBINDD_PRIVILEGED_SOCKET_DIR]: : '/var/lib/samba/winbindd_privileged'
  615. Dynconfig[LIBDIR]: : '/usr/lib32'
  616. Dynconfig[LOCALEDIR]: : '/usr/share/locale'
  617. Dynconfig[NMBDSOCKETDIR]: : '/var/run/samba/nmbd'
  618. Dynconfig[INCLUDEDIR]: : '/usr/include/samba-4.0'
  619. Dynconfig[CODEPAGEDIR]: : '/usr/share/samba/codepages'
  620. Dynconfig[PRIVATELIBDIR]: : '/usr/lib32/samba'
  621. Dynconfig[PRIVILEGED_SOCKET_DIR]: : '/var/lib/samba'
  622. Dynconfig[LIBEXECDIR]: : '/usr/libexec'
  623. Dynconfig[SMB_PASSWD_FILE]: : '/var/lib/samba/private/smbpasswd'
  624. Dynconfig[BINDIR]: : '/usr/bin'
  625. Dynconfig[CONFIGDIR]: : '/etc/samba'
  626. Checking for system z >= 1.2.3 : yes
  627. Checking for library z : yes
  628. Checking for zlibVersion : ok
  629. Checking for system z >= 1.2.3 : ok
  630. Checking for system popt : yes
  631. Checking for header popt.h : yes
  632. Checking for library popt : yes
  633. Checking for poptGetContext : ok
  634. Checking for system tdb >= 1.3.6 : yes
  635. Checking for stylesheet http://docbook.sourceforge.net/release/xsl/current/manpages/docbook.xsl : ok
  636. Checking linker accepts -Wl,-no-undefined : yes
  637. Checking linker accepts ['-undefined', 'dynamic_lookup'] : no
  638. Checking for system talloc >= 2.1.2 : yes
  639. Checking for stylesheet http://docbook.sourceforge.net/release/xsl/current/manpages/docbook.xsl : ok
  640. Checking linker accepts -Wl,-no-undefined : yes
  641. Checking linker accepts ['-undefined', 'dynamic_lookup'] : no
  642. Checking for system tevent >= 0.9.25 : yes
  643. Checking for epoll_create : ok
  644. Checking value of NSIG : 65
  645. Checking value of _NSIG : 65
  646. Checking value of SIGRTMAX : 64
  647. Checking value of SIGRTMIN : 34
  648. Checking linker accepts -Wl,-no-undefined : yes
  649. Checking linker accepts ['-undefined', 'dynamic_lookup'] : no
  650. Checking for program python : /usr/bin/python2.7
  651. Checking for program xsltproc : /usr/bin/xsltproc
  652. Checking for Python version >= 2.4.2 : ok 2.7.10
  653. Checking for system ldb >= 1.1.24 : yes
  654. Checking linker accepts -Wl,-no-undefined : yes
  655. Checking linker accepts ['-undefined', 'dynamic_lookup'] : no
  656. Looking for kerberos features
  657. Checking for program krb5-config.heimdal : not found
  658. Checking for program krb5-config : /usr/bin/krb5-config
  659. Checking for /usr/bin/krb5-config : yes
  660. Checking for gssapi : yes
  661. Kerberos 5 release 1.14.1 is detected, MIT krb5 build can proceed
  662. Checking for com_err : yes
  663. Checking for library com_err : yes
  664. Checking for _et_list : ok
  665. Checking for header com_err.h : yes
  666. Checking for header krb5/locate_plugin.h : yes
  667. Checking for header gssapi.h : yes
  668. Checking for header gssapi/gssapi_generic.h : yes
  669. Checking for header gssapi/gssapi.h : yes
  670. Checking for header gssapi/gssapi_ext.h : yes
  671. Checking for header gssapi/gssapi_krb5.h : yes
  672. Checking for library k5crypto : yes
  673. Checking for krb5_encrypt_data : ok
  674. Checking for library crypto : yes
  675. Checking for des_set_key : not found
  676. Checking for library asn1 : not found
  677. Checking for copy_Authenticator : not found
  678. Checking for library roken : not found
  679. Checking for roken_getaddrinfo_hostspec : not found
  680. Checking for header profile.h : yes
  681. Checking for gss_display_status : ok
  682. Checking for gss_wrap_iov : ok
  683. Checking for gss_krb5_import_cred : ok
  684. Checking for gss_get_name_attribute : ok
  685. Checking for gss_mech_krb5 : ok
  686. Checking for gss_oid_equal : ok
  687. Checking for gss_inquire_sec_context_by_oid : ok
  688. Checking for gsskrb5_extract_authz_data_from_sec_context : ok
  689. Checking for gss_krb5_export_lucid_sec_context : ok
  690. Checking for gss_import_cred : ok
  691. Checking for gss_export_cred : ok
  692. Checking for krb5_mk_req_extended : ok
  693. Checking for krb5_kt_compare : not found
  694. Checking for krb5_set_default_in_tkt_etypes : not found
  695. Checking for krb5_set_default_tgs_enctypes : ok
  696. Checking for krb5_set_default_tgs_ktypes : ok
  697. Checking for krb5_principal2salt : ok
  698. Checking for krb5_c_string_to_key : ok
  699. Checking for krb5_get_pw_salt : not found
  700. Checking for krb5_string_to_key_salt : not found
  701. Checking for krb5_auth_con_setkey : not found
  702. Checking for krb5_auth_con_setuseruserkey : ok
  703. Checking for krb5_get_permitted_enctypes : ok
  704. Checking for krb5_get_default_in_tkt_etypes : not found
  705. Checking for krb5_free_data_contents : ok
  706. Checking for krb5_principal_get_comp_string : not found
  707. Checking for krb5_free_unparsed_name : ok
  708. Checking for krb5_free_keytab_entry_contents : ok
  709. Checking for krb5_kt_free_entry : ok
  710. Checking for krb5_krbhst_init : not found
  711. Checking for krb5_krbhst_get_addrinfo : not found
  712. Checking for krb5_crypto_init : not found
  713. Checking for krb5_crypto_destroy : not found
  714. Checking for krb5_c_verify_checksum : ok
  715. Checking for krb5_principal_compare_any_realm : ok
  716. Checking for krb5_parse_name_norealm : not found
  717. Checking for krb5_princ_size : not found
  718. Checking for krb5_get_init_creds_opt_set_pac_request : not found
  719. Checking for krb5_get_renewed_creds : ok
  720. Checking for krb5_free_error_contents : not found
  721. Checking for initialize_krb5_error_table : ok
  722. Checking for krb5_get_init_creds_opt_alloc : ok
  723. Checking for krb5_get_init_creds_opt_free : ok
  724. Checking for krb5_get_init_creds_opt_get_error : not found
  725. Checking for krb5_enctype_to_string : ok
  726. Checking for krb5_fwd_tgt_creds : ok
  727. Checking for krb5_auth_con_set_req_cksumtype : ok
  728. Checking for krb5_get_creds_opt_alloc : not found
  729. Checking for krb5_get_creds_opt_set_impersonate : not found
  730. Checking for krb5_get_creds : not found
  731. Checking for krb5_get_credentials_for_user : ok
  732. Checking for krb5_get_host_realm : ok
  733. Checking for krb5_free_host_realm : ok
  734. Checking for krb5_get_init_creds_keyblock : not found
  735. Checking for krb5_get_init_creds_keytab : ok
  736. Checking for krb5_make_principal : not found
  737. Checking for krb5_build_principal_alloc_va : ok
  738. Checking for krb5_cc_get_lifetime : not found
  739. Checking for krb5_cc_retrieve_cred : ok
  740. Checking for krb5_free_checksum_contents : ok
  741. Checking for krb5_c_make_checksum : ok
  742. Checking for krb5_create_checksum : not found
  743. Checking for krb5_config_get_bool_default : not found
  744. Checking for krb5_get_profile : ok
  745. Checking for krb5_data_copy : not found
  746. Checking for krb5_keyblock_init : not found
  747. Checking for krb5_principal_set_realm : not found
  748. Checking for krb5_principal_get_type : not found
  749. Checking for krb5_warnx : not found
  750. Checking for declaration of krb5_get_credentials_for_user : not found
  751. Checking for declaration of krb5_auth_con_set_req_cksumtype : ok
  752. Checking for variable AP_OPTS_USE_SUBKEY : ok
  753. Checking for variable KV5M_KEYTAB : ok
  754. Checking for variable KRB5_KU_OTHER_CKSUM : not found
  755. Checking for variable KRB5_KEYUSAGE_APP_DATA_CKSUM : ok
  756. Checking for variable ENCTYPE_AES128_CTS_HMAC_SHA1_96 : ok
  757. Checking for variable ENCTYPE_AES256_CTS_HMAC_SHA1_96 : ok
  758. Checking for declaration of KRB5_PDU_NONE : not found
  759. Checking for declaration of KRB5_PDU_NONE (as enum) : not found
  760. Checking for member key in krb5_keytab_entry : ok
  761. Checking for member keyblock in krb5_keytab_entry : not found
  762. Checking for member magic in krb5_address : ok
  763. Checking for member addrtype in krb5_address : ok
  764. Checking for member ticket in krb5_ap_req : ok
  765. Checking for member type in krb5_prompt : not found
  766. Checking for krb5_encrypt_block : ok
  767. Checking whether krb5_get_init_creds_opt_free takes a context argument : ok
  768. Checking whether krb5_princ_component is available : ok
  769. Checking whether krb5_enctype_to_string takes size_t argument : ok
  770. Checking whether krb5_enctype_to_string takes krb5_context argument : not found
  771. Checking whether the macro krb5_princ_realm is defined : ok
  772. Checking whether krb5_principal_get_realm is defined : not found
  773. Checking whether the ENCTYPE_ARCFOUR_HMAC_MD5 key type definition is available : not found
  774. Checking whether the ENCTYPE_ARCFOUR_HMAC_MD5_56 key type definition is available : not found
  775. Checking whether the HAVE_KEYTYPE_ARCFOUR_56 key type definition is available : not found
  776. Checking whether the ENCTYPE_ARCFOUR_HMAC key type definition is available : ok
  777. Checking whether the ENCTYPE_ARCFOUR_HMAC_EXP key type definition is available : ok
  778. Checking whether the WRFILE:-keytab is supported : ok
  779. Checking for KRB5_DEPRECATED define taking an identifier : ok
  780. Checking whether krb5_creds have flags property : not found
  781. Checking for header linux/fcntl.h : yes
  782. Checking for declaration of F_SETLEASE : ok
  783. Checking for declaration of SA_SIGINFO : ok
  784. Checking for backtrace : ok
  785. Checking for backtrace_symbols : ok
  786. Checking for member f_frsize in struct statvfs : ok
  787. Checking for statvfs (SVR4) : ok
  788. Checking for *bsd style statfs with statfs.f_iosize : not found
  789. Checking if f_fsid is an integer : ok
  790. Checking whether statvfs.f_flag exists : ok
  791. Checking whether statvfs.f_flags exists : not found
  792. Checking for header err.h : yes
  793. Checking for header byteswap.h : yes
  794. Checking for bswap_64 : ok
  795. Checking for HAVE_ATTRIBUTE_COLD : ok
  796. Checking for HAVE_ATTRIBUTE_CONST : ok
  797. Checking for HAVE_ATTRIBUTE_NORETURN : ok
  798. Checking for HAVE_ATTRIBUTE_PRINTF : ok
  799. Checking for HAVE_ATTRIBUTE_UNUSED : ok
  800. Checking for HAVE_ATTRIBUTE_USED : ok
  801. Checking for HAVE_BUILTIN_CHOOSE_EXPR : ok
  802. Checking for HAVE_BUILTIN_CLZ : ok
  803. Checking for HAVE_BUILTIN_CLZL : ok
  804. Checking for HAVE_BUILTIN_CLZLL : ok
  805. Checking for HAVE_BUILTIN_CONSTANT_P : ok
  806. Checking for HAVE_BUILTIN_EXPECT : ok
  807. Checking for HAVE_BUILTIN_POPCOUNTL : ok
  808. Checking for HAVE_BUILTIN_TYPES_COMPATIBLE_P : ok
  809. Checking for HAVE_COMPOUND_LITERALS : ok
  810. Checking for HAVE_FLEXIBLE_ARRAY_MEMBER : ok
  811. Checking for HAVE_ISBLANK : ok
  812. Checking for HAVE_TYPEOF : ok
  813. Checking for HAVE_WARN_UNUSED_RESULT : ok
  814. Checking for small off_t : yes
  815. Checking for -D_FILE_OFFSET_BITS=64 : yes
  816. Checking for system ntdb >= 1.0 : yes
  817. Checking for stylesheet http://docbook.sourceforge.net/release/xsl/current/manpages/docbook.xsl : ok
  818. Checking for library iconv : no
  819. Checking for library iconv : not found
  820. Checking for iconv_open : ok
  821. Checking for pam_start : not found
  822. Checking for library pam : yes
  823. Checking for pam_start : ok
  824. Checking for library sasl2 : yes
  825. Checking for sasl_client_init : ok
  826. Checking for system nss_wrapper >= 1.0.2 : yes
  827. Checking for header security/pam_modules.h : yes
  828. Checking for header pam/pam_modules.h : no
  829. Checking for header nss_dbdefs.h : no
  830. Checking for member ipnode.af_family in union nss_XbyY_key : not found
  831. Checking for member pw_comment in struct passwd : not found
  832. Checking for member pw_age in struct passwd : not found
  833. Checking for system socket_wrapper >= 1.1.2 : yes
  834. Checking for system uid_wrapper >= 1.0.1 : yes
  835. Checking for system subunit : yes
  836. Checking for library ncurses : yes
  837. Checking for tgetent : ok
  838. Checking for rl_completion_t : not found
  839. Checking for CPPFunction : ok
  840. Checking for library readline : yes
  841. Checking for rl_completion_matches : ok
  842. Checking for history_list : ok
  843. Checking for MD5Init : not found
  844. Checking for MD5Init : ok
  845. Checking for CC_MD5_Init : not found
  846. Checking for CC_MD5_Init : not found
  847. Checking for perl module Parse::Yapp::Driver 1.05 : not found
  848. perl manpage generation : ok
  849. perl man1 extension : 1
  850. perl man3 extension : 3pm
  851. Checking for program yapp : not found
  852. Checking for program pod2man : /usr/bin/pod2man
  853. Checking linker accepts -Wl,--export-dynamic : yes
  854. Checking for header libexc.h : no
  855. Checking for header libunwind.h : no
  856. Checking for header linux/falloc.h : yes
  857. Checking for header linux/ioctl.h : yes
  858. Checking for getcwd : ok
  859. Checking for fchown : ok
  860. Checking for chmod : ok
  861. Checking for fchmod : ok
  862. Checking for mknod : ok
  863. Checking for strtol : ok
  864. Checking for strchr : ok
  865. Checking for strupr : not found
  866. Checking for chflags : not found
  867. Checking for getrlimit : ok
  868. Checking for fsync : ok
  869. Checking for fdatasync : ok
  870. Checking for setpgid : ok
  871. Checking for setsid : ok
  872. Checking for glob : ok
  873. Checking for strpbrk : ok
  874. Checking for crypt16 : not found
  875. Checking for getauthuid : not found
  876. Checking for innetgr : ok
  877. Checking for initgroups : ok
  878. Checking for select : ok
  879. Checking for poll : ok
  880. Checking for rdchk : not found
  881. Checking for getgrnam : ok
  882. Checking for getgrent : ok
  883. Checking for pathconf : ok
  884. Checking for setpriv : not found
  885. Checking for setgidx : not found
  886. Checking for setuidx : not found
  887. Checking for setgroups : ok
  888. Checking for syscall : ok
  889. Checking for sysconf : ok
  890. Checking for atexit : ok
  891. Checking for grantpt : ok
  892. Checking for posix_openpt : ok
  893. Checking for fallocate : ok
  894. Checking for posix_fallocate : ok
  895. Checking for fseeko : ok
  896. Checking for setluid : not found
  897. Checking for getpwnam : ok
  898. Checking for fdopendir : ok
  899. Checking for fstatat : ok
  900. Checking for getpwent_r : ok
  901. Checking for setenv : ok
  902. Checking for strcasecmp : ok
  903. Checking for fcvt : ok
  904. Checking for fcvtl : not found
  905. Checking for syslog : ok
  906. Checking for vsyslog : ok
  907. Checking for timegm : ok
  908. Checking for setlocale : ok
  909. Checking for library rt : yes
  910. Checking for nanosleep : ok
  911. Checking for lutimes : ok
  912. Checking for futimes : ok
  913. Checking for utimensat : ok
  914. Checking for futimens : ok
  915. Checking for mlock : ok
  916. Checking for munlock : ok
  917. Checking for mlockall : ok
  918. Checking for munlockall : ok
  919. Checking for memalign : ok
  920. Checking for posix_memalign : ok
  921. Checking for hstrerror : ok
  922. Checking for shmget : ok
  923. Checking for shm_open : not found
  924. Checking for shm_open : ok
  925. Checking for library nsl : yes
  926. Checking for yp_get_default_domain : ok
  927. Checking for dn_expand : ok
  928. Checking for _dn_expand : not found
  929. Checking for __dn_expand : ok
  930. Checking for declaration of fdatasync : ok
  931. Checking for declaration of readahead : ok
  932. Checking for HAVE_LINUX_SPLICE : ok
  933. Checking for declaration of splice : ok
  934. Checking for kernel change notify support : ok
  935. Checking for Linux kernel oplocks : ok
  936. Checking for IRIX kernel oplock types : not found
  937. Checking for kernel share modes : ok
  938. Checking for libarchive existence
  939. Checking for system libarchive >= 3.1.2 : yes
  940. Building without DMAPI support (--without-dmapi).
  941. Checking for member st_blocks in struct stat : ok
  942. Checking for member st_blksize in struct stat : ok
  943. Checking for member st_flags in struct stat : not found
  944. Checking for header replace.h : no
  945. Checking whether blkcnt_t is 32 bit : not found
  946. Checking whether blkcnt_t is 64 bit : ok
  947. Checking for library cap : yes
  948. Checking for cap_get_proc : ok
  949. Checking whether POSIX capabilities are available : ok
  950. Checking for int16 typedef included by rpc/rpc.h : not found
  951. Checking for uint16 typedef included by rpc/rpc.h : not found
  952. Checking for int32 typedef included by rpc/rpc.h : not found
  953. Checking for uint32 typedef included by rpc/rpc.h : not found
  954. Checking for broken nisplus include files : ok
  955. Checking if the compiler will optimize out functions : ok
  956. Checking for LL suffix on long long integers : ok
  957. Checking for _acl : not found
  958. Checking for __acl : not found
  959. Checking for atexit : ok
  960. Checking for _chdir : not found
  961. Checking for __chdir : not found
  962. Checking for chflags : not found
  963. Checking for chmod : ok
  964. Checking for _close : not found
  965. Checking for __close : ok
  966. Checking for _closedir : not found
  967. Checking for __closedir : not found
  968. Checking for crypt16 : not found
  969. Checking for devnm : not found
  970. Checking for dirfd : ok
  971. Checking for DNSServiceRegister : not found
  972. Checking for _dup : not found
  973. Checking for __dup : not found
  974. Checking for _dup2 : not found
  975. Checking for __dup2 : ok
  976. Checking for endmntent : ok
  977. Checking for execl : ok
  978. Checking for _facl : not found
  979. Checking for __facl : not found
  980. Checking for _fchdir : not found
  981. Checking for __fchdir : not found
  982. Checking for fchmod : ok
  983. Checking for fchown : ok
  984. Checking for _fcntl : not found
  985. Checking for __fcntl : ok
  986. Checking for fcvt : ok
  987. Checking for fcvtl : not found
  988. Checking for fdatasync : ok
  989. Checking for _fork : not found
  990. Checking for __fork : ok
  991. Checking for fseeko : ok
  992. Checking for fsetxattr : ok
  993. Checking for _fstat : not found
  994. Checking for __fstat : ok
  995. Checking for fsync : ok
  996. Checking for futimens : ok
  997. Checking for futimes : ok
  998. Checking for __fxstat : ok
  999. Checking for getauthuid : not found
  1000. Checking for getcwd : ok
  1001. Checking for _getcwd : not found
  1002. Checking for __getcwd : not found
  1003. Checking for getdents : not found
  1004. Checking for __getdents : not found
  1005. Checking for getdirentries : ok
  1006. Checking for getgrent : ok
  1007. Checking for getgrnam : ok
  1008. Checking for getgrouplist : ok
  1009. Checking for getgrset : not found
  1010. Checking for getmntent : ok
  1011. Checking for getpagesize : ok
  1012. Checking for getpwanam : not found
  1013. Checking for getpwent_r : ok
  1014. Checking for getrlimit : ok
  1015. Checking for glob : ok
  1016. Checking for grantpt : ok
  1017. Checking for hstrerror : ok
  1018. Checking for initgroups : ok
  1019. Checking for innetgr : ok
  1020. Checking for llseek : ok
  1021. Checking for _llseek : not found
  1022. Checking for __llseek : not found
  1023. Checking for _lseek : not found
  1024. Checking for __lseek : ok
  1025. Checking for _lstat : not found
  1026. Checking for __lstat : ok
  1027. Checking for lutimes : ok
  1028. Checking for __lxstat : ok
  1029. Checking for memalign : ok
  1030. Checking for mknod : ok
  1031. Checking for mlock : ok
  1032. Checking for mlockall : ok
  1033. Checking for munlock : ok
  1034. Checking for munlockall : ok
  1035. Checking for _open : not found
  1036. Checking for __open : ok
  1037. Checking for _opendir : not found
  1038. Checking for __opendir : not found
  1039. Checking for pathconf : ok
  1040. Checking for poll : ok
  1041. Checking for posix_fallocate : ok
  1042. Checking for posix_memalign : ok
  1043. Checking for pread : ok
  1044. Checking for _pread : not found
  1045. Checking for __pread : not found
  1046. Checking for pwrite : ok
  1047. Checking for _pwrite : not found
  1048. Checking for __pwrite : not found
  1049. Checking for rdchk : not found
  1050. Checking for _read : not found
  1051. Checking for __read : ok
  1052. Checking for _readdir : not found
  1053. Checking for __readdir : not found
  1054. Checking for _seekdir : not found
  1055. Checking for __seekdir : not found
  1056. Checking for select : ok
  1057. Checking for setenv : ok
  1058. Checking for setgidx : not found
  1059. Checking for setgroups : ok
  1060. Checking for setlocale : ok
  1061. Checking for setluid : not found
  1062. Checking for setmntent : ok
  1063. Checking for setpgid : ok
  1064. Checking for setpriv : not found
  1065. Checking for setsid : ok
  1066. Checking for setuidx : not found
  1067. Checking for shmget : ok
  1068. Checking for shm_open : ok
  1069. Checking for _stat : not found
  1070. Checking for __stat : ok
  1071. Checking for statvfs : ok
  1072. Checking for strcasecmp : ok
  1073. Checking for strchr : ok
  1074. Checking for strpbrk : ok
  1075. Checking for strsignal : ok
  1076. Checking for strtol : ok
  1077. Checking for strupr : not found
  1078. Checking for sysconf : ok
  1079. Checking for sysctl : ok
  1080. Checking for sysctlbyname : not found
  1081. Checking for __sys_llseek : not found
  1082. Checking for syslog : ok
  1083. Checking for _telldir : not found
  1084. Checking for __telldir : not found
  1085. Checking for timegm : ok
  1086. Checking for utimensat : ok
  1087. Checking for vsyslog : ok
  1088. Checking for _write : not found
  1089. Checking for __write : ok
  1090. Checking for __xstat : ok
  1091. Checking if can we convert from CP850 to UCS-2LE : ok
  1092. Checking if can we convert from UTF-8 to UCS-2LE : ok
  1093. building on linux2
  1094. Checking for dirfd : ok
  1095. vfs_fileid checking for statfs() and struct statfs.f_fsid : ok
  1096. Checking whether the Linux 'fallocate' function is available : ok
  1097. Checking whether Linux readahead is available : ok
  1098. Checking for declaration of readahead : ok
  1099. Checking for openat : ok
  1100. Checking for library aio : yes
  1101. Checking for io_submit : ok
  1102. Checking for header sys/eventfd.h : yes
  1103. Checking for linux kernel asynchronous io support : ok
  1104. Checking if we can use msg_control for passing file descriptors : ok
  1105. Checking if we can use msg_accrights for passing file descriptors : not found
  1106. Checking for program awk : /usr/bin/awk
  1107. Checking for header asm/types.h : yes
  1108. Checking for major macro : ok
  1109. Checking for minor macro : ok
  1110. Checking for member d_off in struct dirent : ok
  1111. Checking for setnetgrent : ok
  1112. Checking for getnetgrent : ok
  1113. Checking for endnetgrent : ok
  1114. Checking compiler accepts -Werror-implicit-function-declaration : yes
  1115. Checking for setnetgrent prototype : ok
  1116. Checking for getnetgrent prototype : ok
  1117. Checking for endnetgrent prototype : ok
  1118. Checking for header ldap.h : yes
  1119. Checking for header lber.h : yes
  1120. Checking for header ldap_pvt.h : no
  1121. Checking for ber_tag_t : ok
  1122. Checking for library lber : yes
  1123. Checking for ber_scanf : ok
  1124. Checking for ber_sockbuf_add_io : ok
  1125. Checking for variable LDAP_OPT_SOCKBUF : ok
  1126. Checking for variable LBER_OPT_LOG_PRINT_FN : ok
  1127. Checking for library ldap : yes
  1128. Checking for ldap_init : ok
  1129. Checking for ldap_init_fd : ok
  1130. Checking for ldap_initialize : ok
  1131. Checking for ldap_set_rebind_proc : ok
  1132. Checking for ldap_add_result_entry : ok
  1133. Checking whether ldap_set_rebind_proc takes 3 arguments : ok
  1134. Building without Active Directory support (--without-ads).
  1135. Checking for pututline : ok
  1136. Checking for pututxline : ok
  1137. Checking for updwtmp : ok
  1138. Checking for updwtmpx : ok
  1139. Checking for getutmpx : ok
  1140. Checking for getutxent : ok
  1141. Checking for member ut_name in struct utmp : ok
  1142. Checking for member ut_user in struct utmp : ok
  1143. Checking for member ut_id in struct utmp : ok
  1144. Checking for member ut_host in struct utmp : ok
  1145. Checking for member ut_time in struct utmp : ok
  1146. Checking for member ut_tv in struct utmp : ok
  1147. Checking for member ut_type in struct utmp : ok
  1148. Checking for member ut_pid in struct utmp : ok
  1149. Checking for member ut_exit.e_exit in struct utmp : ok
  1150. Checking for member ut_syslen in struct utmpx : not found
  1151. Checking whether pututline returns pointer : ok
  1152. Checking if size of ((struct utmp *)NULL)->ut_line == 1 : not found
  1153. Checking if size of ((struct utmp *)NULL)->ut_line == 2 : not found
  1154. Checking if size of ((struct utmp *)NULL)->ut_line == 4 : not found
  1155. Checking if size of ((struct utmp *)NULL)->ut_line == 8 : not found
  1156. Checking if size of ((struct utmp *)NULL)->ut_line == 16 : not found
  1157. Checking if size of ((struct utmp *)NULL)->ut_line == 32 : ok
  1158. PAM disabled
  1159. Checking whether Linux should use 32-bit credential calls : ok
  1160. Checking whether we can use Linux thread-specific credentials with 32-bit system calls : ok
  1161. Checking whether Linux netlink is available : ok
  1162. Checking whether Linux rtnetlink is available : ok
  1163. Checking whether fcntl locking is available : ok
  1164. Checking for broken posix_fallocate : ok
  1165. Checking for member st_mtim.tv_nsec in struct stat : ok
  1166. Checking for member st_mtimensec in struct stat : not found
  1167. Checking for member st_mtimespec.tv_nsec in struct stat : not found
  1168. Checking for member st_mtime_n in struct stat : not found
  1169. Checking for member st_umtime in struct stat : not found
  1170. Checking for member st_birthtime in struct stat : not found
  1171. Checking for member st_birthtimespec.tv_nsec in struct stat : not found
  1172. Checking for member st_birthtimensec in struct stat : not found
  1173. Checking whether posix_fadvise is available : ok
  1174. Checking whether sysconf(_SC_NGROUPS_MAX) is available : ok
  1175. Checking whether sysconf(_SC_NPROC_ONLN) is available : not found
  1176. Checking whether sysconf(_SC_NPROCESSORS_ONLN) is available : ok
  1177. Checking whether sysconf(_SC_PAGESIZE) is available : ok
  1178. Checking whether to use the Darwin-specific initgroups system call : not found
  1179. Checking whether struct utimbuf is available : ok
  1180. Checking whether we have the struct sigevent : ok
  1181. Checking for member sigev_value.sival_ptr in struct sigevent : ok
  1182. Checking for member sigev_value.sigval_ptr in struct sigevent : not found
  1183. Checking for the maximum value of the 'time_t' type : not found
  1184. Checking whether the macro for makedev is available : ok
  1185. Checking whether the realpath function allows a NULL argument : ok
  1186. Checking for ftruncate extend : ok
  1187. Checking for header sys/sendfile.h : yes
  1188. Checking for linux sendfile support : ok
  1189. getcwd takes a NULL argument : ok
  1190. Checking for library gen : not found
  1191. Checking for getspnam : ok
  1192. building without cluster support (--without-cluster-support)
  1193. Checking whether we can compile with __attribute__((destructor)) : ok
  1194. Checking whether seekdir returns void : ok
  1195. Checking for header gpfs_gpl.h : no
  1196. Checking for header linux/fs.h : yes
  1197. Checking for declaration of FS_IOC_GETFLAGS : ok
  1198. Checking for declaration of FS_COMPR_FL : ok
  1199. Checking for header cephfs/libcephfs.h : no
  1200. Checking for glusterfs-api >= 4 : not found
  1201. Checking for header api/glfs.h : no
  1202. Checking for library gfapi : no
  1203. Checking for dbus : yes
  1204. Checking for header dbus/dbus.h : yes
  1205. Checking for library dbus-1 : yes
  1206. Looking for ncurses features
  1207. Checking for program ncurses5-config : /usr/bin/ncurses5-config
  1208. Checking for /usr/bin/ncurses5-config : yes
  1209. Checking for header ncurses.h : yes
  1210. Checking for header menu.h : yes
  1211. Checking for header panel.h : yes
  1212. Checking for header form.h : yes
  1213. Checking for initscr : ok
  1214. Checking for library menu : yes
  1215. Checking for set_menu_items : ok
  1216. Checking for item_count : ok
  1217. Checking for library panel : yes
  1218. Checking for new_panel : ok
  1219. Checking for show_panel : ok
  1220. Checking for library form : yes
  1221. Checking for new_field : ok
  1222. Checking for new_form : ok
  1223. building regedit
  1224. Checking for DES_pcbc_encrypt : ok
  1225. Checking for openpty : not found
  1226. Checking for library util : yes
  1227. Checking for openpty : ok
  1228. Checking linker accepts -Wl,-no-undefined : yes
  1229. Checking linker accepts ['-undefined', 'dynamic_lookup'] : no
  1230. Checking linker accepts -Wl,--as-needed : yes
  1231. Checking for -lc not needed : ok
  1232. Checking configure summary : ok
  1233. Checking compiler for PIE support : yes
  1234. Checking compiler for full RELRO support : yes
  1235. Checking compiler accepts ['-fstack-protector'] : yes
  1236. Checking linker accepts ['-fstack-protector'] : yes
  1237. 'configure' finished successfully (1m17.611s)
  1238. * abi_x86_64.amd64: running multilib-minimal_abi_src_configure
  1239. CCFLAGS="-march=native -Os -pipe -fomit-frame-pointer" LINKFLAGS="-march=native -Os -pipe -fomit-frame-pointer -Wl,-O1 -Wl,--as-needed" "/var/tmp/portage/net-fs/samba-4.2.9/work/samba-4.2.9/buildtools/bin/waf" --prefix=/usr --libdir=/usr/lib64 --enable-fhs --sysconfdir=/etc --localstatedir=/var --with-modulesdir=/usr/lib64/samba --with-piddir=/var/run/samba --bundled-libraries=NONE --builtin-libraries=NONE --disable-rpath --disable-rpath-install --nopyc --nopyo --with-acl-support --without-ad-dc --without-dnsupdate --without-ads --without-aio-support --disable-avahi --without-cluster-support --enable-cups --without-dmapi --with-fam --disable-gnutls --disable-iprint --with-ldap --with-pam --with-pam_smbpass --with-pammodulesdir=/lib64/security --without-quotas --without-syslog --without-systemd --with-system-mitkrb5 --without-winbind --with-shared-modules= configure
  1240. Checking for program gcc or cc : x86_64-pc-linux-gnu-gcc
  1241. Checking for program ar : ar
  1242. Checking for program ranlib : ranlib
  1243. Checking for gcc : ok
  1244. Checking for program git : /usr/bin/git
  1245. Check for -MD : yes
  1246. Checking for program gdb : not found
  1247. Checking build system : Linux krogpc 4.1.15-gentoo-r1-krog #1 SMP Thu Feb 18 17:51:31 CET 2016 x86_64 Intel(R) Core(TM) i7 CPU 920 @ 2.67GHz GenuineIntel GNU/Linux
  1248. Checking for header sys/utsname.h : yes
  1249. Checking uname sysname type : Linux
  1250. Checking uname machine type : x86_64
  1251. Checking uname release type : 4.1.15-gentoo-r1-krog
  1252. Checking uname version type : #1 SMP Thu Feb 18 17:51:31 CET 2016
  1253. Checking for header stdio.h : yes
  1254. Checking simple C program : ok
  1255. Checking compiler accepts ['-Werror'] : yes
  1256. Checking linker accepts ['-Wl,-rpath,.'] : yes
  1257. Checking for rpath library support : ok
  1258. Checking for -Wl,--version-script support : ok
  1259. Checking compiler accepts ['-fvisibility=hidden', '-Werror'] : yes
  1260. Checking for HAVE_VISIBILITY_ATTR : ok
  1261. Checking compiler accepts -fPIC : yes
  1262. Checking for inline : inline
  1263. Checking for pkg-config version >= 0.0.0 : yes
  1264. Checking compiler accepts [''] : yes
  1265. Checking for header sys/types.h : yes
  1266. Checking for header sys/stat.h : yes
  1267. Checking for header stdlib.h : yes
  1268. Checking for header stddef.h : yes
  1269. Checking for header memory.h : yes
  1270. Checking for header string.h : yes
  1271. Checking for header strings.h : yes
  1272. Checking for header inttypes.h : yes
  1273. Checking for header stdint.h : yes
  1274. Checking for header unistd.h : yes
  1275. Checking for header minix/config.h : no
  1276. Checking for header ctype.h : yes
  1277. Checking for header standards.h : no
  1278. Checking for header stdbool.h : yes
  1279. Checking for header stdarg.h : yes
  1280. Checking for header vararg.h : no
  1281. Checking for header limits.h : yes
  1282. Checking for header assert.h : yes
  1283. Checking getconf LFS_CFLAGS : not found
  1284. Checking getconf large file support flags work : ok
  1285. Checking for large file support without additional flags : ok
  1286. Checking for header sys/time.h : yes
  1287. Checking for header time.h : yes
  1288. Checking for header endian.h : yes
  1289. Checking for header sys/endian.h : no
  1290. Checking for HAVE_LITTLE_ENDIAN : ok
  1291. Checking for HAVE_BIG_ENDIAN : not found
  1292. Checking for header signal.h : yes
  1293. Checking if signal handlers return int : not found
  1294. Checking for variable __FUNCTION__ : ok
  1295. Checking for va_copy : ok
  1296. Checking for HAVE__VA_ARGS__MACRO : ok
  1297. Checking for header linux/types.h : yes
  1298. Checking for header crypt.h : yes
  1299. Checking for header locale.h : yes
  1300. Checking for header acl/libacl.h : yes
  1301. Checking for header compat.h : no
  1302. Checking for header attr/xattr.h : yes
  1303. Checking for header dustat.h : no
  1304. Checking for header fcntl.h : yes
  1305. Checking for header fnmatch.h : yes
  1306. Checking for header glob.h : yes
  1307. Checking for header history.h : no
  1308. Checking for header krb5.h : yes
  1309. Checking for header langinfo.h : yes
  1310. Checking for header libaio.h : yes
  1311. Checking for header ndir.h : no
  1312. Checking for header pwd.h : yes
  1313. Checking for header shadow.h : yes
  1314. Checking for header sys/acl.h : yes
  1315. Checking for header sys/attributes.h : no
  1316. Checking for header attr/attributes.h : yes
  1317. Checking for header sys/capability.h : yes
  1318. Checking for header sys/dir.h : yes
  1319. Checking for header sys/epoll.h : yes
  1320. Checking for header port.h : no
  1321. Checking for header sys/fcntl.h : yes
  1322. Checking for header sys/filio.h : no
  1323. Checking for header sys/filsys.h : no
  1324. Checking for header sys/fs/s5param.h : no
  1325. Checking for header sys/fs/vx/quota.h : no
  1326. Checking for header sys/id.h : no
  1327. Checking for header sys/ioctl.h : yes
  1328. Checking for header sys/ipc.h : yes
  1329. Checking for header sys/mman.h : yes
  1330. Checking for header sys/mode.h : no
  1331. Checking for header sys/ndir.h : no
  1332. Checking for header sys/priv.h : no
  1333. Checking for header sys/resource.h : yes
  1334. Checking for header sys/security.h : no
  1335. Checking for header sys/shm.h : yes
  1336. Checking for header sys/statfs.h : yes
  1337. Checking for header sys/statvfs.h : yes
  1338. Checking for header sys/termio.h : no
  1339. Checking for header sys/vfs.h : yes
  1340. Checking for header sys/xattr.h : yes
  1341. Checking for header termio.h : yes
  1342. Checking for header termios.h : yes
  1343. Checking for header sys/file.h : yes
  1344. Checking for header sys/ucontext.h : yes
  1345. Checking for header sys/wait.h : yes
  1346. Checking for header malloc.h : yes
  1347. Checking for header grp.h : yes
  1348. Checking for header sys/select.h : yes
  1349. Checking for header setjmp.h : yes
  1350. Checking for header utime.h : yes
  1351. Checking for header sys/syslog.h : yes
  1352. Checking for header syslog.h : yes
  1353. Checking for header sys/mount.h : yes
  1354. Checking for header mntent.h : yes
  1355. Checking for header stropts.h : yes
  1356. Checking for header unix.h : no
  1357. Checking for header sys/param.h : yes
  1358. Checking for header sys/socket.h : yes
  1359. Checking for header netinet/in.h : yes
  1360. Checking for header netdb.h : yes
  1361. Checking for header arpa/inet.h : yes
  1362. Checking for header netinet/in_systm.h : yes
  1363. Checking for header netinet/ip.h : yes
  1364. Checking for header netinet/tcp.h : yes
  1365. Checking for header netinet/in_ip.h : no
  1366. Checking for header sys/sockio.h : no
  1367. Checking for header sys/un.h : yes
  1368. Checking for header sys/uio.h : yes
  1369. Checking for header ifaddrs.h : yes
  1370. Checking for header direct.h : no
  1371. Checking for header dirent.h : yes
  1372. Checking for header windows.h : no
  1373. Checking for header winsock2.h : no
  1374. Checking for header ws2tcpip.h : no
  1375. Checking for header errno.h : yes
  1376. Checking for header getopt.h : yes
  1377. Checking for header iconv.h : yes
  1378. Checking for header nss.h : yes
  1379. Checking for header sasl/sasl.h : yes
  1380. Checking for inotify_init : ok
  1381. Checking for header security/pam_appl.h : yes
  1382. Checking for header zlib.h : yes
  1383. Checking for header asm/unistd.h : yes
  1384. Checking for header aio.h : yes
  1385. Checking for header sys/unistd.h : yes
  1386. Checking for header rpc/rpc.h : yes
  1387. Checking for header rpc/nettype.h : no
  1388. Checking for header alloca.h : yes
  1389. Checking for header float.h : yes
  1390. Checking for header rpcsvc/nis.h : yes
  1391. Checking for header rpcsvc/ypclnt.h : yes
  1392. Checking for header sys/sysctl.h : yes
  1393. Checking for header sys/fileio.h : no
  1394. Checking for header sys/filesys.h : no
  1395. Checking for header sys/dustat.h : no
  1396. Checking for header sys/sysmacros.h : yes
  1397. Checking for header xfs/libxfs.h : no
  1398. Checking for header netgroup.h : no
  1399. Checking for header rpcsvc/yp_prot.h : yes
  1400. Checking for HAVE_RPCSVC_YP_PROT_H : ok
  1401. Checking for header valgrind.h : no
  1402. Checking for header valgrind/valgrind.h : no
  1403. Checking for header valgrind/memcheck.h : no
  1404. Checking for header nss_common.h : no
  1405. Checking for header nsswitch.h : no
  1406. Checking for header ns_api.h : no
  1407. Checking for header sys/extattr.h : no
  1408. Checking for header sys/ea.h : no
  1409. Checking for header sys/proplist.h : no
  1410. Checking for header sys/cdefs.h : yes
  1411. Checking for header utmp.h : yes
  1412. Checking for header utmpx.h : yes
  1413. Checking for header lastlog.h : yes
  1414. Checking for header syscall.h : yes
  1415. Checking for header sys/syscall.h : yes
  1416. Checking for header sys/atomic.h : no
  1417. Checking for header sys/prctl.h : yes
  1418. Checking for prctl syscall : ok
  1419. Checking for O_DIRECT flag to open(2) : ok
  1420. Checking for long long : ok
  1421. Checking for intptr_t : ok
  1422. Checking for uintptr_t : ok
  1423. Checking for ptrdiff_t : ok
  1424. Checking for comparison_fn_t : ok
  1425. Checking for _Bool : ok
  1426. Checking for bool : ok
  1427. Checking for int8_t : ok
  1428. Checking for uint8_t : ok
  1429. Checking for int16_t : ok
  1430. Checking for uint16_t : ok
  1431. Checking for int32_t : ok
  1432. Checking for uint32_t : ok
  1433. Checking for int64_t : ok
  1434. Checking for uint64_t : ok
  1435. Checking for size_t : ok
  1436. Checking for ssize_t : ok
  1437. Checking for ino_t : ok
  1438. Checking for loff_t : ok
  1439. Checking for offset_t : not found
  1440. Checking for volatile int : ok
  1441. Checking for uint_t : not found
  1442. Checking for blksize_t : ok
  1443. Checking for blkcnt_t : ok
  1444. Checking if size of bool == 1 : ok
  1445. Checking if size of char == 1 : ok
  1446. Checking if size of int == 1 : not found
  1447. Checking if size of int == 2 : not found
  1448. Checking if size of int == 4 : ok
  1449. Checking if size of long long == 1 : not found
  1450. Checking if size of long long == 2 : not found
  1451. Checking if size of long long == 4 : not found
  1452. Checking if size of long long == 8 : ok
  1453. Checking if size of long == 1 : not found
  1454. Checking if size of long == 2 : not found
  1455. Checking if size of long == 4 : not found
  1456. Checking if size of long == 8 : ok
  1457. Checking if size of short == 1 : not found
  1458. Checking if size of short == 2 : ok
  1459. Checking if size of size_t == 1 : not found
  1460. Checking if size of size_t == 2 : not found
  1461. Checking if size of size_t == 4 : not found
  1462. Checking if size of size_t == 8 : ok
  1463. Checking if size of ssize_t == 1 : not found
  1464. Checking if size of ssize_t == 2 : not found
  1465. Checking if size of ssize_t == 4 : not found
  1466. Checking if size of ssize_t == 8 : ok
  1467. Checking if size of int8_t == 1 : ok
  1468. Checking if size of uint8_t == 1 : ok
  1469. Checking if size of int16_t == 1 : not found
  1470. Checking if size of int16_t == 2 : ok
  1471. Checking if size of uint16_t == 1 : not found
  1472. Checking if size of uint16_t == 2 : ok
  1473. Checking if size of int32_t == 1 : not found
  1474. Checking if size of int32_t == 2 : not found
  1475. Checking if size of int32_t == 4 : ok
  1476. Checking if size of uint32_t == 1 : not found
  1477. Checking if size of uint32_t == 2 : not found
  1478. Checking if size of uint32_t == 4 : ok
  1479. Checking if size of int64_t == 1 : not found
  1480. Checking if size of int64_t == 2 : not found
  1481. Checking if size of int64_t == 4 : not found
  1482. Checking if size of int64_t == 8 : ok
  1483. Checking if size of uint64_t == 1 : not found
  1484. Checking if size of uint64_t == 2 : not found
  1485. Checking if size of uint64_t == 4 : not found
  1486. Checking if size of uint64_t == 8 : ok
  1487. Checking if size of void* == 1 : not found
  1488. Checking if size of void* == 2 : not found
  1489. Checking if size of void* == 4 : not found
  1490. Checking if size of void* == 8 : ok
  1491. Checking if size of off_t == 1 : not found
  1492. Checking if size of off_t == 2 : not found
  1493. Checking if size of off_t == 4 : not found
  1494. Checking if size of off_t == 8 : ok
  1495. Checking if size of dev_t == 1 : not found
  1496. Checking if size of dev_t == 2 : not found
  1497. Checking if size of dev_t == 4 : not found
  1498. Checking if size of dev_t == 8 : ok
  1499. Checking if size of ino_t == 1 : not found
  1500. Checking if size of ino_t == 2 : not found
  1501. Checking if size of ino_t == 4 : not found
  1502. Checking if size of ino_t == 8 : ok
  1503. Checking if size of time_t == 1 : not found
  1504. Checking if size of time_t == 2 : not found
  1505. Checking if size of time_t == 4 : not found
  1506. Checking if size of time_t == 8 : ok
  1507. Checking for socklen_t : ok
  1508. Checking for struct ifaddrs : ok
  1509. Checking for struct addrinfo : ok
  1510. Checking for struct sockaddr : ok
  1511. Checking for HAVE_STRUCT_SOCKADDR_IN6 : ok
  1512. Checking for struct sockaddr_storage : ok
  1513. Checking for sa_family_t : ok
  1514. Checking for sig_atomic_t : ok
  1515. Checking for sigsetmask : ok
  1516. Checking for siggetmask : ok
  1517. Checking for sigprocmask : ok
  1518. Checking for sigblock : ok
  1519. Checking for sigaction : ok
  1520. Checking for sigset : ok
  1521. Checking for inet_ntoa : ok
  1522. Checking for inet_aton : ok
  1523. Checking for inet_ntop : ok
  1524. Checking for inet_pton : ok
  1525. Checking for connect : ok
  1526. Checking for gethostbyname : ok
  1527. Checking for getaddrinfo : ok
  1528. Checking for getnameinfo : ok
  1529. Checking for freeaddrinfo : ok
  1530. Checking for gai_strerror : ok
  1531. Checking for socketpair : ok
  1532. Checking for variable IPV6_V6ONLY : ok
  1533. Checking for HAVE_IPV6 : ok
  1534. Checking whether we have ucontext_t : ok
  1535. Checking for __sync_fetch_and_add compiler builtin : ok
  1536. Checking for atomic_add_32 compiler builtin : not found
  1537. Checking for strdup : ok
  1538. Checking for memmem : ok
  1539. Checking for printf : ok
  1540. Checking for memset : ok
  1541. Checking for memcpy : ok
  1542. Checking for memmove : ok
  1543. Checking for strcpy : ok
  1544. Checking for strncpy : ok
  1545. Checking for bzero : ok
  1546. Checking for shl_load : not found
  1547. Checking for shl_unload : not found
  1548. Checking for shl_findsym : not found
  1549. Checking for pipe : ok
  1550. Checking for strftime : ok
  1551. Checking for srandom : ok
  1552. Checking for random : ok
  1553. Checking for srand : ok
  1554. Checking for rand : ok
  1555. Checking for usleep : ok
  1556. Checking for setbuffer : ok
  1557. Checking for lstat : ok
  1558. Checking for getpgrp : ok
  1559. Checking for utime : ok
  1560. Checking for utimes : ok
  1561. Checking for setuid : ok
  1562. Checking for seteuid : ok
  1563. Checking for setreuid : ok
  1564. Checking for setresuid : ok
  1565. Checking for setgid : ok
  1566. Checking for setegid : ok
  1567. Checking for setregid : ok
  1568. Checking for setresgid : ok
  1569. Checking for chroot : ok
  1570. Checking for strerror : ok
  1571. Checking for vsyslog : ok
  1572. Checking for setlinebuf : ok
  1573. Checking for mktime : ok
  1574. Checking for ftruncate : ok
  1575. Checking for chsize : not found
  1576. Checking for rename : ok
  1577. Checking for waitpid : ok
  1578. Checking for wait4 : ok
  1579. Checking for initgroups : ok
  1580. Checking for pread : ok
  1581. Checking for pwrite : ok
  1582. Checking for strndup : ok
  1583. Checking for strcasestr : ok
  1584. Checking for strsep : ok
  1585. Checking for strtok_r : ok
  1586. Checking for mkdtemp : ok
  1587. Checking for dup2 : ok
  1588. Checking for dprintf : ok
  1589. Checking for vdprintf : ok
  1590. Checking for isatty : ok
  1591. Checking for chown : ok
  1592. Checking for lchown : ok
  1593. Checking for link : ok
  1594. Checking for readlink : ok
  1595. Checking for symlink : ok
  1596. Checking for realpath : ok
  1597. Checking for snprintf : ok
  1598. Checking for vsnprintf : ok
  1599. Checking for asprintf : ok
  1600. Checking for vasprintf : ok
  1601. Checking for setenv : ok
  1602. Checking for unsetenv : ok
  1603. Checking for strnlen : ok
  1604. Checking for strtoull : ok
  1605. Checking for __strtoull : not found
  1606. Checking for strtouq : ok
  1607. Checking for strtoll : ok
  1608. Checking for __strtoll : not found
  1609. Checking for strtoq : ok
  1610. Checking for memalign : ok
  1611. Checking for posix_memalign : ok
  1612. Checking for prctl : ok
  1613. Checking for strlcpy : not found
  1614. Checking for strlcat : not found
  1615. Checking for strlcpy : not found
  1616. Checking for strlcat : not found
  1617. Checking for library bsd : yes
  1618. Checking for strlcpy : ok
  1619. Checking for strlcat : ok
  1620. Checking for getpeereid : not found
  1621. Checking for getpeereid : ok
  1622. Checking for library setproctitle : not found
  1623. Checking for setproctitle : not found
  1624. Checking for setproctitle : ok
  1625. Checking whether we can use SO_PEERCRED to get socket credentials : ok
  1626. Checking correct behavior of strtoll : not found
  1627. Checking for if_nametoindex : ok
  1628. Checking for strerror_r : ok
  1629. Checking for getdirentries : ok
  1630. Checking for getdents : not found
  1631. Checking for syslog : ok
  1632. Checking for gai_strerror : ok
  1633. Checking for get_current_dir_name : ok
  1634. Checking for timegm : ok
  1635. Checking for getifaddrs : ok
  1636. Checking for freeifaddrs : ok
  1637. Checking for mmap : ok
  1638. Checking for setgroups : ok
  1639. Checking for syscall : ok
  1640. Checking for setsid : ok
  1641. Checking for getgrent_r : ok
  1642. Checking for getgrgid_r : ok
  1643. Checking for getgrnam_r : ok
  1644. Checking for getgrouplist : ok
  1645. Checking for getpagesize : ok
  1646. Checking for getpwent_r : ok
  1647. Checking for getpwnam_r : ok
  1648. Checking for getpwuid_r : ok
  1649. Checking for epoll_create : ok
  1650. Checking for port_create : not found
  1651. Checking for fgetxattr : ok
  1652. Checking for flistea : not found
  1653. Checking for flistxattr : ok
  1654. Checking for fremovexattr : ok
  1655. Checking for fsetxattr : ok
  1656. Checking for getxattr : ok
  1657. Checking for listxattr : ok
  1658. Checking for removexattr : ok
  1659. Checking for setxattr : ok
  1660. Checking for library attr : yes
  1661. Checking for flistea : not found
  1662. Checking whether xattr interface takes additional options : not found
  1663. Checking for dlopen : not found
  1664. Checking for dlsym : not found
  1665. Checking for dlerror : not found
  1666. Checking for dlclose : not found
  1667. Checking for library dl : yes
  1668. Checking for dlopen : ok
  1669. Checking for dlsym : ok
  1670. Checking for dlerror : ok
  1671. Checking for dlclose : ok
  1672. Checking for declaration of dlopen : ok
  1673. Checking C prototype for dlopen : not found
  1674. Checking for fdatasync : ok
  1675. Checking for declaration of fdatasync : ok
  1676. Checking for clock_gettime : ok
  1677. Checking whether the clock_gettime clock ID CLOCK_MONOTONIC is available : ok
  1678. Checking whether the clock_gettime clock ID CLOCK_PROCESS_CPUTIME_ID is available : ok
  1679. Checking whether the clock_gettime clock ID CLOCK_REALTIME is available : ok
  1680. Checking for struct timespec : ok
  1681. Checking for header net/if.h : yes
  1682. Checking for header arpa/nameser.h : yes
  1683. Checking for header resolv.h : yes
  1684. Checking for res_search : not found
  1685. Checking for library resolv : yes
  1686. Checking for res_search : ok
  1687. Checking for header libintl.h : yes
  1688. Checking for library intl : not found
  1689. Checking for declaration of dgettext : ok
  1690. Checking for declaration of gettext : ok
  1691. Checking for declaration of bindtextdomain : ok
  1692. Checking for declaration of textdomain : ok
  1693. Checking for declaration of bind_textdomain_codeset : ok
  1694. Checking for bindtextdomain : ok
  1695. Checking for textdomain : ok
  1696. Checking for bind_textdomain_codeset : ok
  1697. Checking for dgettext : ok
  1698. Checking for gettext : ok
  1699. Checking for pthread_create : not found
  1700. Checking for library pthread : yes
  1701. Checking for pthread_create : ok
  1702. Checking for pthread_attr_init : ok
  1703. Checking for pthread_mutexattr_setrobust : ok
  1704. Checking for declaration of PTHREAD_MUTEX_ROBUST : not found
  1705. Checking for declaration of PTHREAD_MUTEX_ROBUST (as enum) : ok
  1706. Checking for pthread_mutex_consistent : ok
  1707. Checking for crypt : not found
  1708. Checking for library crypt : yes
  1709. Checking for crypt : ok
  1710. Checking for header readline.h : no
  1711. Checking for header readline/readline.h : yes
  1712. Checking for header readline/history.h : yes
  1713. Checking for variable rl_event_hook : ok
  1714. Checking for declaration of snprintf : ok
  1715. Checking for declaration of vsnprintf : ok
  1716. Checking for declaration of asprintf : ok
  1717. Checking for declaration of vasprintf : ok
  1718. Checking for declaration of errno : ok
  1719. Checking for declaration of EWOULDBLOCK : ok
  1720. Checking for declaration of environ : ok
  1721. Checking for declaration of getgrent_r : ok
  1722. Checking for declaration of getpwent_r : ok
  1723. Checking for declaration of pread : ok
  1724. Checking for declaration of pwrite : ok
  1725. Checking for declaration of setenv : ok
  1726. Checking for declaration of setresgid : ok
  1727. Checking for declaration of setresuid : ok
  1728. Checking for header poll.h : yes
  1729. Checking for poll : ok
  1730. Checking for strptime : ok
  1731. Checking for declaration of strptime : ok
  1732. Checking for working strptime : ok
  1733. Checking for HAVE_GETTIMEOFDAY_TZ : ok
  1734. Checking for C99 vsnprintf : ok
  1735. Checking for HAVE_SHARED_MMAP : ok
  1736. Checking for HAVE_MREMAP : ok
  1737. Checking for HAVE_INCOHERENT_MMAP : not found
  1738. Checking for HAVE_IMMEDIATE_STRUCTURES : ok
  1739. Checking for HAVE_MKDIR_MODE : ok
  1740. Checking for member st_mtim.tv_nsec in struct stat : ok
  1741. Checking for member st_rdev in struct stat : ok
  1742. Checking for member st_rdev in struct stat : ok
  1743. Checking for member ss_family in struct sockaddr_storage : ok
  1744. Checking for member __ss_family in struct sockaddr_storage : not found
  1745. Checking for member sa_len in struct sockaddr : not found
  1746. Checking for member sin_len in struct sockaddr_in : not found
  1747. Checking for HAVE_UNIXSOCKET : ok
  1748. Checking for HAVE_SECURE_MKSTEMP : ok
  1749. Checking for HAVE_IFACE_GETIFADDRS : ok
  1750. Checking for getpwnam_r : ok
  1751. Checking for getpwuid_r : ok
  1752. Checking for getpwent_r : ok
  1753. Checking for declaration of getpwent_r : ok
  1754. Checking C prototype for getpwent_r : not found
  1755. Checking for declaration of getgrent_r : ok
  1756. Checking C prototype for getgrent_r : not found
  1757. Checking C prototype for getpwent_r : not found
  1758. Checking C prototype for getgrent_r : not found
  1759. Checking for getgrouplist : ok
  1760. Checking for program perl : /usr/bin/perl
  1761. Checking for program perl : /usr/bin/perl
  1762. Checking for program perl : /usr/bin/perl
  1763. Checking for perl 5.0.0 : ok 5.20.2
  1764. Checking for perl $Config{vendorprefix}: : '/usr'
  1765. Checking for perl $Config{vendorarch}: : '/usr/lib64/perl5/vendor_perl/5.20.2/x86_64-linux'
  1766. PERL_ARCH_INSTALL_DIR: : '/usr/lib64/perl5/vendor_perl/5.20.2/x86_64-linux'
  1767. Checking for perl $Config{vendorlib}: : '/usr/lib64/perl5/vendor_perl/5.20.2'
  1768. PERL_LIB_INSTALL_DIR: : '/usr/lib64/perl5/vendor_perl/5.20.2'
  1769. PERL_INC: : ['/etc/perl', '/usr/local/lib64/perl5/5.20.2/x86_64-linux', '/usr/local/lib64/perl5/5.20.2', '/usr/lib64/perl5/vendor_perl/5.20.2/x86_64-linux', '/usr/lib64/perl5/vendor_perl/5.20.2', '/usr/local/lib64/perl5', '/usr/lib64/perl5/vendor_perl/5.20.1/x86_64-linux', '/usr/lib64/perl5/vendor_perl/5.20.1', '/usr/lib64/perl5/vendor_perl', '/usr/lib64/perl5/5.20.2/x86_64-linux', '/usr/lib64/perl5/5.20.2']
  1770. Checking for program xsltproc : /usr/bin/xsltproc
  1771. Checking for program python : /usr/bin/python2.7
  1772. Checking for program python : /usr/bin/python2.7
  1773. Checking for program python : /var/tmp/portage/net-fs/samba-4.2.9/temp/python2.7/bin/python
  1774. Checking for Python version >= 2.5.0 : ok 2.7.10
  1775. Checking for library python2.7 : yes
  1776. Checking for program python2.7-config : /usr/bin/python2.7-config
  1777. Checking for custom code : yes
  1778. Dynconfig[STATEDIR]: : '/var/lib/samba'
  1779. Dynconfig[SCRIPTSBINDIR]: : '/usr/sbin'
  1780. Dynconfig[PAMMODULESDIR]: : '/lib64/security'
  1781. Dynconfig[WINBINDD_SOCKET_DIR]: : '/var/run/samba/winbindd'
  1782. Dynconfig[PRIVATE_DIR]: : '/var/lib/samba/private'
  1783. Dynconfig[SETUPDIR]: : '/usr/share/samba/setup'
  1784. Dynconfig[PIDDIR]: : '/var/run/samba'
  1785. Dynconfig[PKGCONFIGDIR]: : '/usr/lib64/pkgconfig'
  1786. Dynconfig[DATADIR]: : '/usr/share'
  1787. Dynconfig[CACHEDIR]: : '/var/cache/samba'
  1788. Dynconfig[SBINDIR]: : '/usr/sbin'
  1789. Dynconfig[NCALRPCDIR]: : '/var/run/samba/ncalrpc'
  1790. Dynconfig[LMHOSTSFILE]: : '/etc/samba/lmhosts'
  1791. Dynconfig[LOCKDIR]: : '/var/lock/samba'
  1792. Dynconfig[PYTHONARCHDIR]: : '/usr/lib64/python2.7/site-packages'
  1793. Dynconfig[PERL_LIB_INSTALL_DIR]: : '/usr/lib64/perl5/vendor_perl/5.20.2'
  1794. Dynconfig[LOGFILEBASE]: : '/var/log/samba'
  1795. Dynconfig[PYTHONDIR]: : '/usr/lib64/python2.7/site-packages'
  1796. Dynconfig[PERL_ARCH_INSTALL_DIR]: : '/usr/lib64/perl5/vendor_perl/5.20.2/x86_64-linux'
  1797. Dynconfig[NTP_SIGND_SOCKET_DIR]: : '/var/lib/samba/ntp_signd'
  1798. Dynconfig[CONFIGFILE]: : '/etc/samba/smb.conf'
  1799. Dynconfig[SOCKET_DIR]: : '/var/run/samba'
  1800. Dynconfig[MODULESDIR]: : '/usr/lib64/samba'
  1801. Dynconfig[WINBINDD_PRIVILEGED_SOCKET_DIR]: : '/var/lib/samba/winbindd_privileged'
  1802. Dynconfig[LIBDIR]: : '/usr/lib64'
  1803. Dynconfig[LOCALEDIR]: : '/usr/share/locale'
  1804. Dynconfig[NMBDSOCKETDIR]: : '/var/run/samba/nmbd'
  1805. Dynconfig[INCLUDEDIR]: : '/usr/include/samba-4.0'
  1806. Dynconfig[CODEPAGEDIR]: : '/usr/share/samba/codepages'
  1807. Dynconfig[PRIVATELIBDIR]: : '/usr/lib64/samba'
  1808. Dynconfig[PRIVILEGED_SOCKET_DIR]: : '/var/lib/samba'
  1809. Dynconfig[LIBEXECDIR]: : '/usr/libexec'
  1810. Dynconfig[SMB_PASSWD_FILE]: : '/var/lib/samba/private/smbpasswd'
  1811. Dynconfig[BINDIR]: : '/usr/bin'
  1812. Dynconfig[CONFIGDIR]: : '/etc/samba'
  1813. Checking for system z >= 1.2.3 : yes
  1814. Checking for library z : yes
  1815. Checking for zlibVersion : ok
  1816. Checking for system z >= 1.2.3 : ok
  1817. Checking for system popt : yes
  1818. Checking for header popt.h : yes
  1819. Checking for library popt : yes
  1820. Checking for poptGetContext : ok
  1821. Checking for system tdb >= 1.3.6 : yes
  1822. Checking for stylesheet http://docbook.sourceforge.net/release/xsl/current/manpages/docbook.xsl : ok
  1823. Checking for program python : /usr/bin/python2.7
  1824. Checking for Python version >= 2.4.2 : ok 2.7.10
  1825. Checking for python headers : using cache
  1826. Checking linker accepts -Wl,-no-undefined : yes
  1827. Checking linker accepts ['-undefined', 'dynamic_lookup'] : no
  1828. Checking for system talloc >= 2.1.2 : yes
  1829. Checking for system pytalloc-util >= 2.1.2 : yes
  1830. Checking for stylesheet http://docbook.sourceforge.net/release/xsl/current/manpages/docbook.xsl : ok
  1831. Checking for program python : /usr/bin/python2.7
  1832. Checking for Python version >= 2.4.2 : ok 2.7.10
  1833. Checking for python headers : using cache
  1834. Checking linker accepts -Wl,-no-undefined : yes
  1835. Checking linker accepts ['-undefined', 'dynamic_lookup'] : no
  1836. Checking for system tevent >= 0.9.25 : yes
  1837. Checking for epoll_create : ok
  1838. Checking value of NSIG : 65
  1839. Checking value of _NSIG : 65
  1840. Checking value of SIGRTMAX : 64
  1841. Checking value of SIGRTMIN : 34
  1842. Checking for program python : /usr/bin/python2.7
  1843. Checking for Python version >= 2.4.2 : ok 2.7.10
  1844. Checking for python headers : using cache
  1845. Checking linker accepts -Wl,-no-undefined : yes
  1846. Checking linker accepts ['-undefined', 'dynamic_lookup'] : no
  1847. Checking for program python : /usr/bin/python2.7
  1848. Checking for program xsltproc : /usr/bin/xsltproc
  1849. Checking for Python version >= 2.4.2 : ok 2.7.10
  1850. Checking for python headers : using cache
  1851. Checking for system ldb >= 1.1.24 : yes
  1852. Checking for system pyldb-util >= 1.1.24 : yes
  1853. Checking linker accepts -Wl,-no-undefined : yes
  1854. Checking linker accepts ['-undefined', 'dynamic_lookup'] : no
  1855. Looking for kerberos features
  1856. Checking for program krb5-config.heimdal : not found
  1857. Checking for program krb5-config : /usr/bin/krb5-config
  1858. Checking for /usr/bin/krb5-config : yes
  1859. Checking for gssapi : yes
  1860. Kerberos 5 release 1.14.1 is detected, MIT krb5 build can proceed
  1861. Checking for com_err : yes
  1862. Checking for library com_err : yes
  1863. Checking for _et_list : ok
  1864. Checking for header com_err.h : yes
  1865. Checking for header krb5/locate_plugin.h : yes
  1866. Checking for header gssapi.h : yes
  1867. Checking for header gssapi/gssapi_generic.h : yes
  1868. Checking for header gssapi/gssapi.h : yes
  1869. Checking for header gssapi/gssapi_ext.h : yes
  1870. Checking for header gssapi/gssapi_krb5.h : yes
  1871. Checking for library k5crypto : yes
  1872. Checking for krb5_encrypt_data : ok
  1873. Checking for library crypto : yes
  1874. Checking for des_set_key : not found
  1875. Checking for library asn1 : not found
  1876. Checking for copy_Authenticator : not found
  1877. Checking for library roken : not found
  1878. Checking for roken_getaddrinfo_hostspec : not found
  1879. Checking for header profile.h : yes
  1880. Checking for gss_display_status : ok
  1881. Checking for gss_wrap_iov : ok
  1882. Checking for gss_krb5_import_cred : ok
  1883. Checking for gss_get_name_attribute : ok
  1884. Checking for gss_mech_krb5 : ok
  1885. Checking for gss_oid_equal : ok
  1886. Checking for gss_inquire_sec_context_by_oid : ok
  1887. Checking for gsskrb5_extract_authz_data_from_sec_context : ok
  1888. Checking for gss_krb5_export_lucid_sec_context : ok
  1889. Checking for gss_import_cred : ok
  1890. Checking for gss_export_cred : ok
  1891. Checking for krb5_mk_req_extended : ok
  1892. Checking for krb5_kt_compare : not found
  1893. Checking for krb5_set_default_in_tkt_etypes : not found
  1894. Checking for krb5_set_default_tgs_enctypes : ok
  1895. Checking for krb5_set_default_tgs_ktypes : ok
  1896. Checking for krb5_principal2salt : ok
  1897. Checking for krb5_c_string_to_key : ok
  1898. Checking for krb5_get_pw_salt : not found
  1899. Checking for krb5_string_to_key_salt : not found
  1900. Checking for krb5_auth_con_setkey : not found
  1901. Checking for krb5_auth_con_setuseruserkey : ok
  1902. Checking for krb5_get_permitted_enctypes : ok
  1903. Checking for krb5_get_default_in_tkt_etypes : not found
  1904. Checking for krb5_free_data_contents : ok
  1905. Checking for krb5_principal_get_comp_string : not found
  1906. Checking for krb5_free_unparsed_name : ok
  1907. Checking for krb5_free_keytab_entry_contents : ok
  1908. Checking for krb5_kt_free_entry : ok
  1909. Checking for krb5_krbhst_init : not found
  1910. Checking for krb5_krbhst_get_addrinfo : not found
  1911. Checking for krb5_crypto_init : not found
  1912. Checking for krb5_crypto_destroy : not found
  1913. Checking for krb5_c_verify_checksum : ok
  1914. Checking for krb5_principal_compare_any_realm : ok
  1915. Checking for krb5_parse_name_norealm : not found
  1916. Checking for krb5_princ_size : not found
  1917. Checking for krb5_get_init_creds_opt_set_pac_request : not found
  1918. Checking for krb5_get_renewed_creds : ok
  1919. Checking for krb5_free_error_contents : not found
  1920. Checking for initialize_krb5_error_table : ok
  1921. Checking for krb5_get_init_creds_opt_alloc : ok
  1922. Checking for krb5_get_init_creds_opt_free : ok
  1923. Checking for krb5_get_init_creds_opt_get_error : not found
  1924. Checking for krb5_enctype_to_string : ok
  1925. Checking for krb5_fwd_tgt_creds : ok
  1926. Checking for krb5_auth_con_set_req_cksumtype : ok
  1927. Checking for krb5_get_creds_opt_alloc : not found
  1928. Checking for krb5_get_creds_opt_set_impersonate : not found
  1929. Checking for krb5_get_creds : not found
  1930. Checking for krb5_get_credentials_for_user : ok
  1931. Checking for krb5_get_host_realm : ok
  1932. Checking for krb5_free_host_realm : ok
  1933. Checking for krb5_get_init_creds_keyblock : not found
  1934. Checking for krb5_get_init_creds_keytab : ok
  1935. Checking for krb5_make_principal : not found
  1936. Checking for krb5_build_principal_alloc_va : ok
  1937. Checking for krb5_cc_get_lifetime : not found
  1938. Checking for krb5_cc_retrieve_cred : ok
  1939. Checking for krb5_free_checksum_contents : ok
  1940. Checking for krb5_c_make_checksum : ok
  1941. Checking for krb5_create_checksum : not found
  1942. Checking for krb5_config_get_bool_default : not found
  1943. Checking for krb5_get_profile : ok
  1944. Checking for krb5_data_copy : not found
  1945. Checking for krb5_keyblock_init : not found
  1946. Checking for krb5_principal_set_realm : not found
  1947. Checking for krb5_principal_get_type : not found
  1948. Checking for krb5_warnx : not found
  1949. Checking for declaration of krb5_get_credentials_for_user : not found
  1950. Checking for declaration of krb5_auth_con_set_req_cksumtype : ok
  1951. Checking for variable AP_OPTS_USE_SUBKEY : ok
  1952. Checking for variable KV5M_KEYTAB : ok
  1953. Checking for variable KRB5_KU_OTHER_CKSUM : not found
  1954. Checking for variable KRB5_KEYUSAGE_APP_DATA_CKSUM : ok
  1955. Checking for variable ENCTYPE_AES128_CTS_HMAC_SHA1_96 : ok
  1956. Checking for variable ENCTYPE_AES256_CTS_HMAC_SHA1_96 : ok
  1957. Checking for declaration of KRB5_PDU_NONE : not found
  1958. Checking for declaration of KRB5_PDU_NONE (as enum) : not found
  1959. Checking for member key in krb5_keytab_entry : ok
  1960. Checking for member keyblock in krb5_keytab_entry : not found
  1961. Checking for member magic in krb5_address : ok
  1962. Checking for member addrtype in krb5_address : ok
  1963. Checking for member ticket in krb5_ap_req : ok
  1964. Checking for member type in krb5_prompt : not found
  1965. Checking for krb5_encrypt_block : ok
  1966. Checking whether krb5_get_init_creds_opt_free takes a context argument : ok
  1967. Checking whether krb5_princ_component is available : ok
  1968. Checking whether krb5_enctype_to_string takes size_t argument : ok
  1969. Checking whether krb5_enctype_to_string takes krb5_context argument : not found
  1970. Checking whether the macro krb5_princ_realm is defined : ok
  1971. Checking whether krb5_principal_get_realm is defined : not found
  1972. Checking whether the ENCTYPE_ARCFOUR_HMAC_MD5 key type definition is available : not found
  1973. Checking whether the ENCTYPE_ARCFOUR_HMAC_MD5_56 key type definition is available : not found
  1974. Checking whether the HAVE_KEYTYPE_ARCFOUR_56 key type definition is available : not found
  1975. Checking whether the ENCTYPE_ARCFOUR_HMAC key type definition is available : ok
  1976. Checking whether the ENCTYPE_ARCFOUR_HMAC_EXP key type definition is available : ok
  1977. Checking whether the WRFILE:-keytab is supported : ok
  1978. Checking for KRB5_DEPRECATED define taking an identifier : ok
  1979. Checking whether krb5_creds have flags property : not found
  1980. Checking for header linux/fcntl.h : yes
  1981. Checking for declaration of F_SETLEASE : ok
  1982. Checking for declaration of SA_SIGINFO : ok
  1983. Checking for backtrace : ok
  1984. Checking for backtrace_symbols : ok
  1985. Checking for member f_frsize in struct statvfs : ok
  1986. Checking for statvfs (SVR4) : ok
  1987. Checking for *bsd style statfs with statfs.f_iosize : not found
  1988. Checking if f_fsid is an integer : ok
  1989. Checking whether statvfs.f_flag exists : ok
  1990. Checking whether statvfs.f_flags exists : not found
  1991. Checking for header err.h : yes
  1992. Checking for header byteswap.h : yes
  1993. Checking for bswap_64 : ok
  1994. Checking for HAVE_ATTRIBUTE_COLD : ok
  1995. Checking for HAVE_ATTRIBUTE_CONST : ok
  1996. Checking for HAVE_ATTRIBUTE_NORETURN : ok
  1997. Checking for HAVE_ATTRIBUTE_PRINTF : ok
  1998. Checking for HAVE_ATTRIBUTE_UNUSED : ok
  1999. Checking for HAVE_ATTRIBUTE_USED : ok
  2000. Checking for HAVE_BUILTIN_CHOOSE_EXPR : ok
  2001. Checking for HAVE_BUILTIN_CLZ : ok
  2002. Checking for HAVE_BUILTIN_CLZL : ok
  2003. Checking for HAVE_BUILTIN_CLZLL : ok
  2004. Checking for HAVE_BUILTIN_CONSTANT_P : ok
  2005. Checking for HAVE_BUILTIN_EXPECT : ok
  2006. Checking for HAVE_BUILTIN_POPCOUNTL : ok
  2007. Checking for HAVE_BUILTIN_TYPES_COMPATIBLE_P : ok
  2008. Checking for HAVE_COMPOUND_LITERALS : ok
  2009. Checking for HAVE_FLEXIBLE_ARRAY_MEMBER : ok
  2010. Checking for HAVE_ISBLANK : ok
  2011. Checking for HAVE_TYPEOF : ok
  2012. Checking for HAVE_WARN_UNUSED_RESULT : ok
  2013. Checking for small off_t : no
  2014. Checking for system ntdb >= 1.0 : yes
  2015. Checking for program python : /usr/bin/python2.7
  2016. Checking for Python version >= 2.4.2 : ok 2.7.10
  2017. Checking for python headers : using cache
  2018. Checking for stylesheet http://docbook.sourceforge.net/release/xsl/current/manpages/docbook.xsl : ok
  2019. Checking for library iconv : no
  2020. Checking for library iconv : not found
  2021. Checking for iconv_open : ok
  2022. Checking for pam_start : not found
  2023. Checking for library pam : yes
  2024. Checking for pam_start : ok
  2025. Checking for library sasl2 : yes
  2026. Checking for sasl_client_init : ok
  2027. Checking for system nss_wrapper >= 1.0.2 : yes
  2028. Checking for header security/pam_modules.h : yes
  2029. Checking for header pam/pam_modules.h : no
  2030. Checking for header nss_dbdefs.h : no
  2031. Checking for member ipnode.af_family in union nss_XbyY_key : not found
  2032. Checking for member pw_comment in struct passwd : not found
  2033. Checking for member pw_age in struct passwd : not found
  2034. Checking for system socket_wrapper >= 1.1.2 : yes
  2035. Checking for system uid_wrapper >= 1.0.1 : yes
  2036. Checking for system subunit : yes
  2037. Checking for library ncurses : yes
  2038. Checking for tgetent : ok
  2039. Checking for rl_completion_t : not found
  2040. Checking for CPPFunction : ok
  2041. Checking for library readline : yes
  2042. Checking for rl_completion_matches : ok
  2043. Checking for history_list : ok
  2044. Checking for MD5Init : not found
  2045. Checking for MD5Init : ok
  2046. Checking for CC_MD5_Init : not found
  2047. Checking for CC_MD5_Init : not found
  2048. Checking for perl module Parse::Yapp::Driver 1.05 : not found
  2049. perl manpage generation : ok
  2050. perl man1 extension : 1
  2051. perl man3 extension : 3pm
  2052. Checking for program yapp : not found
  2053. Checking for program pod2man : /usr/bin/pod2man
  2054. Checking linker accepts -Wl,--export-dynamic : yes
  2055. Checking for header libexc.h : no
  2056. Checking for header libunwind.h : no
  2057. Checking for header linux/falloc.h : yes
  2058. Checking for header linux/ioctl.h : yes
  2059. Checking for getcwd : ok
  2060. Checking for fchown : ok
  2061. Checking for chmod : ok
  2062. Checking for fchmod : ok
  2063. Checking for mknod : ok
  2064. Checking for strtol : ok
  2065. Checking for strchr : ok
  2066. Checking for strupr : not found
  2067. Checking for chflags : not found
  2068. Checking for getrlimit : ok
  2069. Checking for fsync : ok
  2070. Checking for fdatasync : ok
  2071. Checking for setpgid : ok
  2072. Checking for setsid : ok
  2073. Checking for glob : ok
  2074. Checking for strpbrk : ok
  2075. Checking for crypt16 : not found
  2076. Checking for getauthuid : not found
  2077. Checking for innetgr : ok
  2078. Checking for initgroups : ok
  2079. Checking for select : ok
  2080. Checking for poll : ok
  2081. Checking for rdchk : not found
  2082. Checking for getgrnam : ok
  2083. Checking for getgrent : ok
  2084. Checking for pathconf : ok
  2085. Checking for setpriv : not found
  2086. Checking for setgidx : not found
  2087. Checking for setuidx : not found
  2088. Checking for setgroups : ok
  2089. Checking for syscall : ok
  2090. Checking for sysconf : ok
  2091. Checking for atexit : ok
  2092. Checking for grantpt : ok
  2093. Checking for posix_openpt : ok
  2094. Checking for fallocate : ok
  2095. Checking for posix_fallocate : ok
  2096. Checking for fseeko : ok
  2097. Checking for setluid : not found
  2098. Checking for getpwnam : ok
  2099. Checking for fdopendir : ok
  2100. Checking for fstatat : ok
  2101. Checking for getpwent_r : ok
  2102. Checking for setenv : ok
  2103. Checking for strcasecmp : ok
  2104. Checking for fcvt : ok
  2105. Checking for fcvtl : not found
  2106. Checking for syslog : ok
  2107. Checking for vsyslog : ok
  2108. Checking for timegm : ok
  2109. Checking for setlocale : ok
  2110. Checking for library rt : yes
  2111. Checking for nanosleep : ok
  2112. Checking for lutimes : ok
  2113. Checking for futimes : ok
  2114. Checking for utimensat : ok
  2115. Checking for futimens : ok
  2116. Checking for mlock : ok
  2117. Checking for munlock : ok
  2118. Checking for mlockall : ok
  2119. Checking for munlockall : ok
  2120. Checking for memalign : ok
  2121. Checking for posix_memalign : ok
  2122. Checking for hstrerror : ok
  2123. Checking for shmget : ok
  2124. Checking for shm_open : not found
  2125. Checking for shm_open : ok
  2126. Checking for library nsl : yes
  2127. Checking for yp_get_default_domain : ok
  2128. Checking for dn_expand : not found
  2129. Checking for _dn_expand : not found
  2130. Checking for __dn_expand : ok
  2131. Checking for library inet : not found
  2132. Checking for dn_expand : not found
  2133. Checking for declaration of fdatasync : ok
  2134. Checking for declaration of readahead : ok
  2135. Checking for HAVE_LINUX_SPLICE : ok
  2136. Checking for declaration of splice : ok
  2137. Checking for kernel change notify support : ok
  2138. Checking for Linux kernel oplocks : ok
  2139. Checking for IRIX kernel oplock types : not found
  2140. Checking for kernel share modes : ok
  2141. Checking for header fam.h : yes
  2142. Checking for library fam : yes
  2143. Checking for FAMOpen2 : ok
  2144. Checking whether enum FAMCodes is available : ok
  2145. Checking for FAMNoExists : ok
  2146. Checking for libarchive existence
  2147. Checking for system libarchive >= 3.1.2 : yes
  2148. Building without DMAPI support (--without-dmapi).
  2149. Checking for member st_blocks in struct stat : ok
  2150. Checking for member st_blksize in struct stat : ok
  2151. Checking for member st_flags in struct stat : not found
  2152. Checking for header replace.h : no
  2153. Checking whether blkcnt_t is 32 bit : not found
  2154. Checking whether blkcnt_t is 64 bit : ok
  2155. Checking for library cap : yes
  2156. Checking for cap_get_proc : ok
  2157. Checking whether POSIX capabilities are available : ok
  2158. Checking for int16 typedef included by rpc/rpc.h : not found
  2159. Checking for uint16 typedef included by rpc/rpc.h : not found
  2160. Checking for int32 typedef included by rpc/rpc.h : not found
  2161. Checking for uint32 typedef included by rpc/rpc.h : not found
  2162. Checking for broken nisplus include files : ok
  2163. Checking if the compiler will optimize out functions : ok
  2164. Checking for LL suffix on long long integers : ok
  2165. Checking for _acl : not found
  2166. Checking for __acl : not found
  2167. Checking for atexit : ok
  2168. Checking for _chdir : not found
  2169. Checking for __chdir : not found
  2170. Checking for chflags : not found
  2171. Checking for chmod : ok
  2172. Checking for _close : not found
  2173. Checking for __close : ok
  2174. Checking for _closedir : not found
  2175. Checking for __closedir : not found
  2176. Checking for crypt16 : not found
  2177. Checking for devnm : not found
  2178. Checking for dirfd : ok
  2179. Checking for DNSServiceRegister : not found
  2180. Checking for _dup : not found
  2181. Checking for __dup : not found
  2182. Checking for _dup2 : not found
  2183. Checking for __dup2 : ok
  2184. Checking for endmntent : ok
  2185. Checking for execl : ok
  2186. Checking for _facl : not found
  2187. Checking for __facl : not found
  2188. Checking for _fchdir : not found
  2189. Checking for __fchdir : not found
  2190. Checking for fchmod : ok
  2191. Checking for fchown : ok
  2192. Checking for _fcntl : not found
  2193. Checking for __fcntl : ok
  2194. Checking for fcvt : ok
  2195. Checking for fcvtl : not found
  2196. Checking for fdatasync : ok
  2197. Checking for _fork : not found
  2198. Checking for __fork : ok
  2199. Checking for fseeko : ok
  2200. Checking for fsetxattr : ok
  2201. Checking for _fstat : not found
  2202. Checking for __fstat : ok
  2203. Checking for fsync : ok
  2204. Checking for futimens : ok
  2205. Checking for futimes : ok
  2206. Checking for __fxstat : ok
  2207. Checking for getauthuid : not found
  2208. Checking for getcwd : ok
  2209. Checking for _getcwd : not found
  2210. Checking for __getcwd : not found
  2211. Checking for getdents : not found
  2212. Checking for __getdents : not found
  2213. Checking for getdirentries : ok
  2214. Checking for getgrent : ok
  2215. Checking for getgrnam : ok
  2216. Checking for getgrouplist : ok
  2217. Checking for getgrset : not found
  2218. Checking for getmntent : ok
  2219. Checking for getpagesize : ok
  2220. Checking for getpwanam : not found
  2221. Checking for getpwent_r : ok
  2222. Checking for getrlimit : ok
  2223. Checking for glob : ok
  2224. Checking for grantpt : ok
  2225. Checking for hstrerror : ok
  2226. Checking for initgroups : ok
  2227. Checking for innetgr : ok
  2228. Checking for llseek : ok
  2229. Checking for _llseek : not found
  2230. Checking for __llseek : not found
  2231. Checking for _lseek : not found
  2232. Checking for __lseek : ok
  2233. Checking for _lstat : not found
  2234. Checking for __lstat : ok
  2235. Checking for lutimes : ok
  2236. Checking for __lxstat : ok
  2237. Checking for memalign : ok
  2238. Checking for mknod : ok
  2239. Checking for mlock : ok
  2240. Checking for mlockall : ok
  2241. Checking for munlock : ok
  2242. Checking for munlockall : ok
  2243. Checking for _open : not found
  2244. Checking for __open : ok
  2245. Checking for _opendir : not found
  2246. Checking for __opendir : not found
  2247. Checking for pathconf : ok
  2248. Checking for poll : ok
  2249. Checking for posix_fallocate : ok
  2250. Checking for posix_memalign : ok
  2251. Checking for pread : ok
  2252. Checking for _pread : not found
  2253. Checking for __pread : not found
  2254. Checking for pwrite : ok
  2255. Checking for _pwrite : not found
  2256. Checking for __pwrite : not found
  2257. Checking for rdchk : not found
  2258. Checking for _read : not found
  2259. Checking for __read : ok
  2260. Checking for _readdir : not found
  2261. Checking for __readdir : not found
  2262. Checking for _seekdir : not found
  2263. Checking for __seekdir : not found
  2264. Checking for select : ok
  2265. Checking for setenv : ok
  2266. Checking for setgidx : not found
  2267. Checking for setgroups : ok
  2268. Checking for setlocale : ok
  2269. Checking for setluid : not found
  2270. Checking for setmntent : ok
  2271. Checking for setpgid : ok
  2272. Checking for setpriv : not found
  2273. Checking for setsid : ok
  2274. Checking for setuidx : not found
  2275. Checking for shmget : ok
  2276. Checking for shm_open : ok
  2277. Checking for _stat : not found
  2278. Checking for __stat : ok
  2279. Checking for statvfs : ok
  2280. Checking for strcasecmp : ok
  2281. Checking for strchr : ok
  2282. Checking for strpbrk : ok
  2283. Checking for strsignal : ok
  2284. Checking for strtol : ok
  2285. Checking for strupr : not found
  2286. Checking for sysconf : ok
  2287. Checking for sysctl : ok
  2288. Checking for sysctlbyname : not found
  2289. Checking for __sys_llseek : not found
  2290. Checking for syslog : ok
  2291. Checking for _telldir : not found
  2292. Checking for __telldir : not found
  2293. Checking for timegm : ok
  2294. Checking for utimensat : ok
  2295. Checking for vsyslog : ok
  2296. Checking for _write : not found
  2297. Checking for __write : ok
  2298. Checking for __xstat : ok
  2299. Checking if can we convert from CP850 to UCS-2LE : ok
  2300. Checking if can we convert from UTF-8 to UCS-2LE : ok
  2301. building on linux2
  2302. Checking for library acl : yes
  2303. Checking for acl_get_file : ok
  2304. Checking for POSIX ACL support : ok
  2305. Checking whether acl_get_perm_np() is available : not found
  2306. Checking for dirfd : ok
  2307. vfs_fileid checking for statfs() and struct statfs.f_fsid : ok
  2308. Checking whether the Linux 'fallocate' function is available : ok
  2309. Checking whether Linux readahead is available : ok
  2310. Checking for declaration of readahead : ok
  2311. Checking for openat : ok
  2312. Checking for library aio : yes
  2313. Checking for io_submit : ok
  2314. Checking for header sys/eventfd.h : yes
  2315. Checking for linux kernel asynchronous io support : ok
  2316. Checking if we can use msg_control for passing file descriptors : ok
  2317. Checking if we can use msg_accrights for passing file descriptors : not found
  2318. Checking for program awk : /usr/bin/awk
  2319. Checking for header asm/types.h : yes
  2320. Checking for major macro : ok
  2321. Checking for minor macro : ok
  2322. Checking for member d_off in struct dirent : ok
  2323. Checking for setnetgrent : ok
  2324. Checking for getnetgrent : ok
  2325. Checking for endnetgrent : ok
  2326. Checking compiler accepts -Werror-implicit-function-declaration : yes
  2327. Checking for setnetgrent prototype : ok
  2328. Checking for getnetgrent prototype : ok
  2329. Checking for endnetgrent prototype : ok
  2330. Checking for program cups-config : /usr/bin/cups-config
  2331. Checking for /usr/bin/cups-config : yes
  2332. Checking for header cups/cups.h : yes
  2333. Checking for header cups/language.h : yes
  2334. Checking for library cups : yes
  2335. Checking for httpConnect : ok
  2336. Checking for httpConnectEncrypt : ok
  2337. Checking for header ldap.h : yes
  2338. Checking for header lber.h : yes
  2339. Checking for header ldap_pvt.h : no
  2340. Checking for ber_tag_t : ok
  2341. Checking for library lber : yes
  2342. Checking for ber_scanf : ok
  2343. Checking for ber_sockbuf_add_io : ok
  2344. Checking for variable LDAP_OPT_SOCKBUF : ok
  2345. Checking for variable LBER_OPT_LOG_PRINT_FN : ok
  2346. Checking for library ldap : yes
  2347. Checking for ldap_init : ok
  2348. Checking for ldap_init_fd : ok
  2349. Checking for ldap_initialize : ok
  2350. Checking for ldap_set_rebind_proc : ok
  2351. Checking for ldap_add_result_entry : ok
  2352. Checking whether ldap_set_rebind_proc takes 3 arguments : ok
  2353. Building without Active Directory support (--without-ads).
  2354. Checking for pututline : ok
  2355. Checking for pututxline : ok
  2356. Checking for updwtmp : ok
  2357. Checking for updwtmpx : ok
  2358. Checking for getutmpx : ok
  2359. Checking for getutxent : ok
  2360. Checking for member ut_name in struct utmp : ok
  2361. Checking for member ut_user in struct utmp : ok
  2362. Checking for member ut_id in struct utmp : ok
  2363. Checking for member ut_host in struct utmp : ok
  2364. Checking for member ut_time in struct utmp : ok
  2365. Checking for member ut_tv in struct utmp : ok
  2366. Checking for member ut_type in struct utmp : ok
  2367. Checking for member ut_pid in struct utmp : ok
  2368. Checking for member ut_exit.e_exit in struct utmp : ok
  2369. Checking for member ut_syslen in struct utmpx : not found
  2370. Checking whether pututline returns pointer : ok
  2371. Checking if size of ((struct utmp *)NULL)->ut_line == 1 : not found
  2372. Checking if size of ((struct utmp *)NULL)->ut_line == 2 : not found
  2373. Checking if size of ((struct utmp *)NULL)->ut_line == 4 : not found
  2374. Checking if size of ((struct utmp *)NULL)->ut_line == 8 : not found
  2375. Checking if size of ((struct utmp *)NULL)->ut_line == 16 : not found
  2376. Checking if size of ((struct utmp *)NULL)->ut_line == 32 : ok
  2377. Checking for header pam/pam_appl.h : no
  2378. Checking for pam_get_data : ok
  2379. Checking for header security/pam_ext.h : yes
  2380. Checking for header security/_pam_macros.h : yes
  2381. Checking for header pam/pam_ext.h : no
  2382. Checking for header pam/_pam_macros.h : no
  2383. Checking for pam_vsyslog : ok
  2384. Checking whether PAM_RHOST is available : ok
  2385. Checking whether PAM_TTY is available : ok
  2386. Checking whether PAM_RADIO_TYPE is available : ok
  2387. Checking whether Linux should use 32-bit credential calls : not found
  2388. Checking whether we can use Linux thread-specific credentials : ok
  2389. Checking whether Linux netlink is available : ok
  2390. Checking whether Linux rtnetlink is available : ok
  2391. Checking whether fcntl locking is available : ok
  2392. Checking for broken posix_fallocate : ok
  2393. Checking for member st_mtim.tv_nsec in struct stat : ok
  2394. Checking for member st_mtimensec in struct stat : not found
  2395. Checking for member st_mtimespec.tv_nsec in struct stat : not found
  2396. Checking for member st_mtime_n in struct stat : not found
  2397. Checking for member st_umtime in struct stat : not found
  2398. Checking for member st_birthtime in struct stat : not found
  2399. Checking for member st_birthtimespec.tv_nsec in struct stat : not found
  2400. Checking for member st_birthtimensec in struct stat : not found
  2401. Checking whether posix_fadvise is available : ok
  2402. Checking whether sysconf(_SC_NGROUPS_MAX) is available : ok
  2403. Checking whether sysconf(_SC_NPROC_ONLN) is available : not found
  2404. Checking whether sysconf(_SC_NPROCESSORS_ONLN) is available : ok
  2405. Checking whether sysconf(_SC_PAGESIZE) is available : ok
  2406. Checking whether to use the Darwin-specific initgroups system call : not found
  2407. Checking whether struct utimbuf is available : ok
  2408. Checking whether we have the struct sigevent : ok
  2409. Checking for member sigev_value.sival_ptr in struct sigevent : ok
  2410. Checking for member sigev_value.sigval_ptr in struct sigevent : not found
  2411. Checking for the maximum value of the 'time_t' type : ok
  2412. Checking whether the macro for makedev is available : ok
  2413. Checking whether the realpath function allows a NULL argument : ok
  2414. Checking for ftruncate extend : ok
  2415. Checking for header sys/sendfile.h : yes
  2416. Checking for linux sendfile support : ok
  2417. getcwd takes a NULL argument : ok
  2418. Checking for library gen : not found
  2419. Checking for getspnam : ok
  2420. building without cluster support (--without-cluster-support)
  2421. Checking whether we can compile with __attribute__((destructor)) : ok
  2422. Checking whether seekdir returns void : ok
  2423. Checking for header gpfs_gpl.h : no
  2424. Checking for header linux/fs.h : yes
  2425. Checking for declaration of FS_IOC_GETFLAGS : ok
  2426. Checking for declaration of FS_COMPR_FL : ok
  2427. Checking for header cephfs/libcephfs.h : no
  2428. Checking for glusterfs-api >= 4 : not found
  2429. Checking for header api/glfs.h : no
  2430. Checking for library gfapi : no
  2431. Checking for dbus : yes
  2432. Checking for header dbus/dbus.h : yes
  2433. Checking for library dbus-1 : yes
  2434. Looking for ncurses features
  2435. Checking for program ncurses5-config : /usr/bin/ncurses5-config
  2436. Checking for /usr/bin/ncurses5-config : yes
  2437. Checking for header ncurses.h : yes
  2438. Checking for header menu.h : yes
  2439. Checking for header panel.h : yes
  2440. Checking for header form.h : yes
  2441. Checking for initscr : ok
  2442. Checking for library menu : yes
  2443. Checking for set_menu_items : ok
  2444. Checking for item_count : ok
  2445. Checking for library panel : yes
  2446. Checking for new_panel : ok
  2447. Checking for show_panel : ok
  2448. Checking for library form : yes
  2449. Checking for new_field : ok
  2450. Checking for new_form : ok
  2451. building regedit
  2452. Checking for DES_pcbc_encrypt : ok
  2453. Checking for openpty : not found
  2454. Checking for library util : yes
  2455. Checking for openpty : ok
  2456. Checking linker accepts -Wl,-no-undefined : yes
  2457. Checking linker accepts ['-undefined', 'dynamic_lookup'] : no
  2458. Checking linker accepts -Wl,--as-needed : yes
  2459. Checking for -lc not needed : ok
  2460. Checking configure summary : ok
  2461. Checking compiler for PIE support : yes
  2462. Checking compiler for full RELRO support : yes
  2463. Checking compiler accepts ['-fstack-protector'] : yes
  2464. Checking linker accepts ['-fstack-protector'] : yes
  2465. 'configure' finished successfully (1m20.024s)
  2466. >>> Source configured.
  2467. >>> Compiling source in /var/tmp/portage/net-fs/samba-4.2.9/work/samba-4.2.9 ...
  2468. * abi_x86_32.x86: running multilib-minimal_abi_src_compile
  2469. make -j5
  2470. WAF_MAKE=1 /usr/bin/python2.7 ./buildtools/bin/waf build
  2471. Waf: Entering directory `/var/tmp/portage/net-fs/samba-4.2.9/work/samba-4.2.9-abi_x86_32.x86/bin'
  2472. Selected system MIT krb5 libraries, Heimdal use is disabled
  2473. Checking project rules ...
  2474. Project rules pass
  2475. [ 1/2261] Generating replace.vscript
  2476. [ 2/2261] Generating interfaces.vscript
  2477. [ 3/2261] Generating addns.vscript
  2478. [ 4/2261] Generating ccan.vscript
  2479. [ 5/2261] Generating tdb_compat.vscript
  2480. [ 6/2261] Generating server-role.vscript
  2481. [ 7/2261] Generating samba-hostconfig.vscript
  2482. [ 8/2261] Generating shares.vscript
  2483. [ 9/2261] Generating ndr-samba4.vscript
  2484. [ 10/2261] Generating dcerpc-samba4.vscript
  2485. [ 11/2261] Generating dcerpc-samr.vscript
  2486. [ 12/2261] Generating dcerpc-atsvc.vscript
  2487. [ 13/2261] Generating dcerpc.vscript
  2488. [ 14/2261] Generating dsdb-module.vscript
  2489. [ 15/2261] Generating samdb.vscript
  2490. [ 16/2261] Generating samdb-common.vscript
  2491. [ 17/2261] Generating cluster.vscript
  2492. [ 18/2261] Generating authkrb5.vscript
  2493. [ 19/2261] Generating auth4.vscript
  2494. [ 20/2261] Generating auth_unix_token.vscript
  2495. [ 21/2261] Generating auth_sam_reply.vscript
  2496. [ 22/2261] Generating gensec.vscript
  2497. [ 23/2261] Generating samba-credentials.vscript
  2498. [ 24/2261] Generating winbind-client.vscript
  2499. [ 25/2261] Generating nss_wrapper_winbind.vscript
  2500. [ 26/2261] Generating nss_winbind.vscript
  2501. [ 27/2261] Generating nss_wins.vscript
  2502. [ 28/2261] Generating wbclient.vscript
  2503. [ 29/2261] Generating smbpasswdparser.vscript
  2504. [ 30/2261] Generating netif.vscript
  2505. [ 31/2261] Generating ldbsamba.vscript
  2506. [ 32/2261] Generating registry.vscript
  2507. [ 33/2261] Generating MESSAGING.vscript
  2508. [ 34/2261] Generating events.vscript
  2509. [ 35/2261] Generating cmdline-credentials.vscript
  2510. [ 36/2261] Generating http.vscript
  2511. [ 37/2261] Generating samba-debug.vscript
  2512. [ 38/2261] Generating socket-blocking.vscript
  2513. [ 39/2261] Generating samba-util.vscript
  2514. [ 40/2261] Generating samba-modules.vscript
  2515. [ 41/2261] Generating asn1util.vscript
  2516. [ 42/2261] Generating util_tdb.vscript
  2517. [ 43/2261] Generating util_ntdb.vscript
  2518. [ 44/2261] Generating tevent-util.vscript
  2519. [ 45/2261] Generating util_setid.vscript
  2520. [ 46/2261] Generating tdb-wrap.vscript
  2521. [ 47/2261] Generating torture.vscript
  2522. [ 48/2261] Generating dnsserver_common.vscript
  2523. [ 49/2261] Generating ndr-krb5pac.vscript
  2524. [ 50/2261] Generating ndr-standard.vscript
  2525. [ 51/2261] Generating ndr_nbt.vscript
  2526. [ 52/2261] Generating ndr-samba.vscript
  2527. [ 53/2261] Generating dcerpc-samba.vscript
  2528. [ 54/2261] Generating ndr.vscript
  2529. [ 55/2261] Generating dcerpc-binding.vscript
  2530. [ 56/2261] Generating cli-ldap.vscript
  2531. [ 57/2261] Generating LIBWBCLIENT_OLD.vscript
  2532. [ 58/2261] Generating smbclient-raw.vscript
  2533. [ 59/2261] Generating smb_transport.vscript
  2534. [ 60/2261] Generating cli_smb_common.vscript
  2535. [ 61/2261] Generating errors.vscript
  2536. [ 62/2261] Generating cli_cldap.vscript
  2537. [ 63/2261] Generating dbwrap.vscript
  2538. [ 64/2261] Generating samba-security.vscript
  2539. [ 65/2261] Generating cli-ldap-common.vscript
  2540. [ 66/2261] Generating cli-nbt.vscript
  2541. [ 67/2261] Generating cliauth.vscript
  2542. [ 68/2261] Generating util_reg.vscript
  2543. [ 69/2261] Generating npa_tstream.vscript
  2544. [ 70/2261] Generating samba-sockets.vscript
  2545. [ 71/2261] Generating flag_mapping.vscript
  2546. [ 72/2261] Generating netapi.vscript
  2547. [ 73/2261] Generating gse.vscript
  2548. [ 74/2261] Generating msrpc3.vscript
  2549. [ 75/2261] Generating gpo.vscript
  2550. [ 76/2261] Generating samba-passdb.vscript
  2551. [ 77/2261] Generating smbldaphelper.vscript
  2552. [ 78/2261] Generating smbregistry.vscript
  2553. [ 79/2261] Generating popt_samba3.vscript
  2554. [ 80/2261] Generating util_cmdline.vscript
  2555. [ 81/2261] Generating samba-cluster-support.vscript
  2556. [ 82/2261] Generating smbd_shim.vscript
  2557. [ 83/2261] Generating libsmb.vscript
  2558. [ 84/2261] Generating secrets3.vscript
  2559. [ 85/2261] Generating smbldap.vscript
  2560. [ 86/2261] Generating ads.vscript
  2561. [ 87/2261] Generating smbconf.vscript
  2562. [ 88/2261] Generating smbd_conn.vscript
  2563. [ 89/2261] Generating smbd_base.vscript
  2564. [ 90/2261] Generating printing_migrate.vscript
  2565. [ 91/2261] Generating net_keytab.vscript
  2566. [ 92/2261] Generating trusts_util.vscript
  2567. [ 93/2261] Generating samba3-util.vscript
  2568. [ 94/2261] Generating xattr_tdb.vscript
  2569. [ 95/2261] Generating CHARSET3.vscript
  2570. [ 96/2261] Generating libcli_lsa3.vscript
  2571. [ 97/2261] Generating libcli_netlogon3.vscript
  2572. [ 98/2261] Generating cli_spoolss.vscript
  2573. [ 99/2261] Generating auth.vscript
  2574. [ 100/2261] Generating smbclient.vscript
  2575. [ 101/2261] Generating non_posix_acls.vscript
  2576. [ 102/2261] Generating idmap.vscript
  2577. [ 103/2261] Generating nss_info.vscript
  2578. [ 104/2261] Generating dfs_server_ad.vscript
  2579. [ 105/2261] Generating krb5samba.vscript
  2580. [ 106/2261] Compiling lib/replace/replace.c
  2581. [ 107/2261] Compiling lib/replace/cwrap.c
  2582. [ 108/2261] Linking default/lib/replace/libreplace-samba4.so
  2583. [ 109/2261] Generating VERSION
  2584. [ 110/2261] Generating INFILE_catalog.xml
  2585. [ 111/2261] Generating smbdotconf/parameters.all.xml
  2586. [ 112/2261] Generating ccan-array_size_empty_c
  2587. [ 113/2261] Generating ccan-asearch_empty_c
  2588. [ 114/2261] Generating ccan-cast_empty_c
  2589. [ 115/2261] Generating ccan-check_type_empty_c
  2590. [ 116/2261] Generating ccan_empty_c
  2591. [ 117/2261] Generating PKGCONFIG_samba-hostconfig.pc
  2592. [ 118/2261] Generating shares_empty_c
  2593. [ 119/2261] Generating ndr-samba4_empty_c
  2594. [ 120/2261] Generating dcerpc-samba4_empty_c
  2595. [ 121/2261] Generating dcerpc-samr_empty_c
  2596. [ 122/2261] Generating PKGCONFIG_dcerpc_samr.pc
  2597. [ 123/2261] Generating dcerpc-atsvc_empty_c
  2598. [ 124/2261] Generating PKGCONFIG_dcerpc_atsvc.pc
  2599. [ 125/2261] Generating PKGCONFIG_dcerpc.pc
  2600. [ 126/2261] Generating dsdb-module_empty_c
  2601. [ 127/2261] Generating PKGCONFIG_samdb.pc
  2602. [ 128/2261] Generating PKGCONFIG_gensec.pc
  2603. [ 129/2261] Generating gensec_ntlmssp_empty_c
  2604. [ 130/2261] Generating PKGCONFIG_samba-credentials.pc
  2605. [ 131/2261] Generating PKGCONFIG_wbclient.pc
  2606. [ 132/2261] Generating PKGCONFIG_registry.pc
  2607. [ 133/2261] Generating PKGCONFIG_samba-util.pc
  2608. [ 134/2261] Generating PKGCONFIG_torture.pc
  2609. [ 135/2261] Generating PKGCONFIG_ndr_krb5pac.pc
  2610. [ 136/2261] Generating PKGCONFIG_ndr_standard.pc
  2611. [ 137/2261] Generating PKGCONFIG_ndr_nbt.pc
  2612. [ 138/2261] Generating ndr-samba_empty_c
  2613. [ 139/2261] Generating dcerpc-samba_empty_c
  2614. [ 140/2261] Generating PKGCONFIG_ndr.pc
  2615. [ 141/2261] Generating PKGCONFIG_smbclient-raw.pc
  2616. [ 142/2261] Generating cliauth_empty_c
  2617. [ 143/2261] Generating perl_pidl
  2618. [ 144/2261] Generating external_init_py
  2619. [ 145/2261] Generating samba-sockets_empty_c
  2620. [ 146/2261] Generating smbd/build_options.c
  2621. [ 147/2261] Generating build_env.h
  2622. [ 148/2261] Generating PKGCONFIG_netapi.pc
  2623. [ 149/2261] Generating samba-passdb_empty_c
  2624. [ 150/2261] Generating PKGCONFIG_smbclient.pc
  2625. [ 151/2261] Generating vfs_empty_c
  2626. [ 152/2261] Generating perfcount_empty_c
  2627. [ 153/2261] Generating rpc_empty_c
  2628. [ 154/2261] Generating idmap_ad_empty_c
  2629. [ 155/2261] Generating idmap_hash_empty_c
  2630. [ 156/2261] Generating nss_info_hash_empty_c
  2631. [ 157/2261] Generating nss_info_rfc2307_empty_c
  2632. [ 158/2261] Generating nss_info_sfu20_empty_c
  2633. [ 159/2261] Generating nss_info_sfu_empty_c
  2634. [ 160/2261] Compiling lib/replace/replace.c
  2635. [ 161/2261] Generating param_functions.c
  2636. [ 162/2261] Generating param_functions.h
  2637. [ 163/2261] Generating param_local.h
  2638. [ 164/2261] Generating param_global.h
  2639. [ 165/2261] Compiling IDL librpc/idl/atsvc.idl
  2640. [ 166/2261] Compiling IDL librpc/idl/auth.idl
  2641. [ 167/2261] Compiling IDL librpc/idl/drsuapi.idl
  2642. [ 168/2261] Compiling IDL librpc/idl/epmapper.idl
  2643. * gcc-config: No gcc profile is active!
  2644. * gcc-config: No gcc profile is active!
  2645. * gcc-config: No gcc profile is active!
  2646. /usr/bin/gcc-config: riga 72: /etc/env.d/gcc/config-i686-pc-linux-gnu: File o directory non esistente
  2647. /usr/bin/gcc-config: riga 72: /etc/env.d/gcc/config-i686-pc-linux-gnu: File o directory non esistente
  2648. /usr/bin/gcc-config: riga 72: /etc/env.d/gcc/config-i686-pc-linux-gnu: File o directory non esistente
  2649. gcc-config: error: could not run/locate 'i686-pc-linux-gnu-cpp'
  2650. gcc-config: error: could not run/locate 'i686-pc-linux-gnu-cpp'
  2651. Failed to parse /var/tmp/portage/net-fs/samba-4.2.9/work/samba-4.2.9-abi_x86_32.x86/librpc/idl/auth.idl at /var/tmp/portage/net-fs/samba-4.2.9/work/samba-4.2.9-abi_x86_32.x86/pidl/pidl line 607.
  2652. gcc-config: error: could not run/locate 'i686-pc-linux-gnu-cpp'
  2653. Failed to parse /var/tmp/portage/net-fs/samba-4.2.9/work/samba-4.2.9-abi_x86_32.x86/librpc/idl/drsuapi.idl at /var/tmp/portage/net-fs/samba-4.2.9/work/samba-4.2.9-abi_x86_32.x86/pidl/pidl line 607.
  2654. Failed to parse /var/tmp/portage/net-fs/samba-4.2.9/work/samba-4.2.9-abi_x86_32.x86/librpc/idl/epmapper.idl at /var/tmp/portage/net-fs/samba-4.2.9/work/samba-4.2.9-abi_x86_32.x86/pidl/pidl line 607.
  2655. * gcc-config: No gcc profile is active!
  2656. /usr/bin/gcc-config: riga 72: /etc/env.d/gcc/config-i686-pc-linux-gnu: File o directory non esistente
  2657. gcc-config: error: could not run/locate 'i686-pc-linux-gnu-cpp'
  2658. Failed to parse /var/tmp/portage/net-fs/samba-4.2.9/work/samba-4.2.9-abi_x86_32.x86/librpc/idl/atsvc.idl at /var/tmp/portage/net-fs/samba-4.2.9/work/samba-4.2.9-abi_x86_32.x86/pidl/pidl line 607.
  2659. Waf: Leaving directory `/var/tmp/portage/net-fs/samba-4.2.9/work/samba-4.2.9-abi_x86_32.x86/bin'
  2660. Build failed:
  2661. -> task failed (err #1):
  2662. {task: PIDL_AUTH auth.idl,CUtil.pm,Compat.pm,Dump.pm,Expr.pm,IDL.pm,NDR.pm,ODL.pm,ClientNDR.pm,ServerNDR.pm,Header.pm,Proxy.pm,Stub.pm,Header.pm,Client.pm,Parser.pm,Server.pm,Python.pm,TDR.pm,Template.pm,Samba4.pm,Typelist.pm,Util.pm,Conformance.pm,NDR.pm,Pidl.pm,Driver.pm -> auth.h,ndr_auth.c,ndr_auth.h,srv_auth.c,srv_auth.h,ndr_auth_s.c,ndr_auth_c.c,ndr_auth_c.h,py_auth.c}
  2663. -> task failed (err #1):
  2664. {task: PIDL_DRSUAPI drsuapi.idl,CUtil.pm,Compat.pm,Dump.pm,Expr.pm,IDL.pm,NDR.pm,ODL.pm,ClientNDR.pm,ServerNDR.pm,Header.pm,Proxy.pm,Stub.pm,Header.pm,Client.pm,Parser.pm,Server.pm,Python.pm,TDR.pm,Template.pm,Samba4.pm,Typelist.pm,Util.pm,Conformance.pm,NDR.pm,Pidl.pm,Driver.pm -> drsuapi.h,ndr_drsuapi.c,ndr_drsuapi.h,srv_drsuapi.c,srv_drsuapi.h,ndr_drsuapi_s.c,ndr_drsuapi_c.c,ndr_drsuapi_c.h,py_drsuapi.c}
  2665. -> task failed (err #1):
  2666. {task: PIDL_EPMAPPER epmapper.idl,CUtil.pm,Compat.pm,Dump.pm,Expr.pm,IDL.pm,NDR.pm,ODL.pm,ClientNDR.pm,ServerNDR.pm,Header.pm,Proxy.pm,Stub.pm,Header.pm,Client.pm,Parser.pm,Server.pm,Python.pm,TDR.pm,Template.pm,Samba4.pm,Typelist.pm,Util.pm,Conformance.pm,NDR.pm,Pidl.pm,Driver.pm -> epmapper.h,ndr_epmapper.c,ndr_epmapper.h,srv_epmapper.c,srv_epmapper.h,ndr_epmapper_s.c,ndr_epmapper_c.c,ndr_epmapper_c.h,py_epmapper.c}
  2667. -> task failed (err #1):
  2668. {task: PIDL_ATSVC atsvc.idl,CUtil.pm,Compat.pm,Dump.pm,Expr.pm,IDL.pm,NDR.pm,ODL.pm,ClientNDR.pm,ServerNDR.pm,Header.pm,Proxy.pm,Stub.pm,Header.pm,Client.pm,Parser.pm,Server.pm,Python.pm,TDR.pm,Template.pm,Samba4.pm,Typelist.pm,Util.pm,Conformance.pm,NDR.pm,Pidl.pm,Driver.pm -> atsvc.h,ndr_atsvc.c,ndr_atsvc.h,srv_atsvc.c,srv_atsvc.h,ndr_atsvc_s.c,ndr_atsvc_c.c,ndr_atsvc_c.h,py_atsvc.c}
  2669. Makefile:8: set di istruzioni per l'obiettivo "all" non riuscito
  2670. make: *** [all] Errore 1
  2671. * ERROR: net-fs/samba-4.2.9::gentoo failed (compile phase):
  2672. * emake failed
  2673. *
  2674. * If you need support, post the output of `emerge --info '=net-fs/samba-4.2.9::gentoo'`,
  2675. * the complete build log and the output of `emerge -pqv '=net-fs/samba-4.2.9::gentoo'`.
  2676. * The complete build log is located at '/var/tmp/portage/net-fs/samba-4.2.9/temp/build.log'.
  2677. * The ebuild environment file is located at '/var/tmp/portage/net-fs/samba-4.2.9/temp/environment'.
  2678. * Working directory: '/var/tmp/portage/net-fs/samba-4.2.9/work/samba-4.2.9-abi_x86_32.x86'
  2679. * S: '/var/tmp/portage/net-fs/samba-4.2.9/work/samba-4.2.9'
  2680.  
  2681. >>> Failed to emerge net-fs/samba-4.2.9
  2682.  
  2683. * Messages for package net-fs/samba-4.2.9:
  2684.  
  2685. * ERROR: net-fs/samba-4.2.9::gentoo failed (compile phase):
  2686. * emake failed
  2687. *
  2688. * If you need support, post the output of `emerge --info '=net-fs/samba-4.2.9::gentoo'`,
  2689. * the complete build log and the output of `emerge -pqv '=net-fs/samba-4.2.9::gentoo'`.
  2690. * The complete build log is located at '/var/tmp/portage/net-fs/samba-4.2.9/temp/build.log'.
  2691. * The ebuild environment file is located at '/var/tmp/portage/net-fs/samba-4.2.9/temp/environment'.
  2692. * Working directory: '/var/tmp/portage/net-fs/samba-4.2.9/work/samba-4.2.9-abi_x86_32.x86'
  2693. * S: '/var/tmp/portage/net-fs/samba-4.2.9/work/samba-4.2.9'
  2694. *
  2695. * The following package has failed to build or install:
  2696. *
  2697. * (net-fs/samba-4.2.9:0/0::gentoo, ebuild scheduled for merge)
RAW Paste Data