Guest User

Untitled

a guest
Aug 23rd, 2020
14
Never
Not a member of Pastebin yet? Sign Up, it unlocks many cool features!
  1. DKMS make.log for nvidia-450.66 for kernel 5.8.3-6-tkg-pds (x86_64)
  2. dom 23 ago 2020, 17:56:59, CEST
  3. make[1]: ingresso nella directory «/usr/lib/modules/5.8.3-6-tkg-pds/build»
  4. scripts/Makefile.lib:8: 'always' is deprecated. Please use 'always-y' instead
  5. SYMLINK /var/lib/dkms/nvidia/450.66/build/nvidia/nv-kernel.o
  6. SYMLINK /var/lib/dkms/nvidia/450.66/build/nvidia-modeset/nv-modeset-kernel.o
  7. CONFTEST: hash__remap_4k_pfn
  8. CONFTEST: set_memory_uc
  9. CONFTEST: acquire_console_sem
  10. CONFTEST: list_is_first
  11. CONFTEST: ioremap_cache
  12. CONFTEST: set_pages_uc
  13. CONFTEST: set_memory_array_uc
  14. CONFTEST: set_pages_array_uc
  15. CONFTEST: console_lock
  16. CONFTEST: ioremap_wc
  17. CONFTEST: acpi_walk_namespace
  18. CONFTEST: sg_alloc_table
  19. CONFTEST: pci_get_domain_bus_and_slot
  20. CONFTEST: get_num_physpages
  21. CONFTEST: efi_enabled
  22. CONFTEST: proc_remove
  23. CONFTEST: pm_vt_switch_required
  24. CONFTEST: pde_data
  25. CONFTEST: xen_ioemu_inject_msi
  26. CONFTEST: phys_to_dma
  27. CONFTEST: get_dma_ops
  28. CONFTEST: write_cr4
  29. CONFTEST: of_get_property
  30. CONFTEST: of_find_node_by_phandle
  31. CONFTEST: of_node_to_nid
  32. CONFTEST: pnv_pci_get_npu_dev
  33. CONFTEST: of_get_ibm_chip_id
  34. CONFTEST: node_end_pfn
  35. CONFTEST: pci_bus_address
  36. CONFTEST: pci_stop_and_remove_bus_device
  37. CONFTEST: pci_remove_bus_device
  38. CONFTEST: register_cpu_notifier
  39. CONFTEST: cpuhp_setup_state
  40. CONFTEST: dma_map_resource
  41. CONFTEST: backlight_device_register
  42. CONFTEST: timer_setup
  43. CONFTEST: do_gettimeofday
  44. CONFTEST: pci_enable_msix_range
  45. CONFTEST: kernel_read
  46. CONFTEST: kernel_write
  47. CONFTEST: kthread_create_on_node
  48. CONFTEST: of_find_matching_node
  49. CONFTEST: dev_is_pci
  50. CONFTEST: dma_direct_map_resource
  51. CONFTEST: tegra_get_platform
  52. CONFTEST: flush_cache_all
  53. CONFTEST: vmf_insert_pfn
  54. CONFTEST: jiffies_to_timespec
  55. CONFTEST: ktime_get_raw_ts64
  56. CONFTEST: ktime_get_real_ts64
  57. CONFTEST: address_space_init_once
  58. CONFTEST: kbasename
  59. CONFTEST: vzalloc
  60. CONFTEST: wait_on_bit_lock_argument_count
  61. CONFTEST: bitmap_clear
  62. CONFTEST: usleep_range
  63. CONFTEST: radix_tree_empty
  64. CONFTEST: radix_tree_replace_slot
  65. CONFTEST: pnv_npu2_init_context
  66. CONFTEST: cpumask_of_node
  67. CONFTEST: drm_dev_unref
  68. CONFTEST: drm_reinit_primary_mode_group
  69. CONFTEST: get_user_pages
  70. CONFTEST: get_user_pages_remote
  71. CONFTEST: drm_gem_object_lookup
  72. CONFTEST: drm_atomic_state_ref_counting
  73. CONFTEST: drm_driver_has_gem_prime_res_obj
  74. CONFTEST: drm_atomic_helper_connector_dpms
  75. CONFTEST: drm_connector_funcs_have_mode_in_name
  76. CONFTEST: drm_framebuffer_get
  77. CONFTEST: drm_dev_put
  78. CONFTEST: drm_gem_object_get
  79. CONFTEST: drm_format_num_planes
  80. CONFTEST: drm_connector_for_each_possible_encoder
  81. CONFTEST: is_export_symbol_gpl_of_node_to_nid
  82. CONFTEST: is_export_symbol_gpl_sme_active
  83. CONFTEST: is_export_symbol_present_swiotlb_map_sg_attrs
  84. CONFTEST: is_export_symbol_present___close_fd
  85. CONFTEST: is_export_symbol_present_swiotlb_dma_ops
  86. CONFTEST: is_export_symbol_present_get_unused_fd
  87. CONFTEST: is_export_symbol_present_get_unused_fd_flags
  88. CONFTEST: is_export_symbol_present_screen_info
  89. CONFTEST: is_export_symbol_present_kthread_create_on_node
  90. CONFTEST: acpi_op_remove
  91. CONFTEST: outer_flush_all
  92. CONFTEST: file_operations
  93. CONFTEST: file_inode
  94. CONFTEST: kuid_t
  95. CONFTEST: dma_ops
  96. CONFTEST: swiotlb_dma_ops
  97. CONFTEST: noncoherent_swiotlb_dma_ops
  98. CONFTEST: vm_fault_has_address
  99. CONFTEST: backlight_properties_type
  100. CONFTEST: vm_insert_pfn_prot
  101. CONFTEST: vmf_insert_pfn_prot
  102. CONFTEST: vm_ops_fault_removed_vma_arg
  103. CONFTEST: vmbus_channel_has_ringbuffer_page
  104. CONFTEST: device_driver_of_match_table
  105. CONFTEST: device_of_node
  106. CONFTEST: node_states_n_memory
  107. CONFTEST: kmem_cache_has_kobj_remove_work
  108. CONFTEST: sysfs_slab_unlink
  109. CONFTEST: proc_ops
  110. CONFTEST: vmalloc_has_pgprot_t_arg
  111. CONFTEST: timeval
  112. CONFTEST: mm_has_mmap_lock
  113. CONFTEST: address_space
  114. CONFTEST: backing_dev_info
  115. CONFTEST: mm_context_t
  116. CONFTEST: vm_fault_t
  117. CONFTEST: mmu_notifier_ops_invalidate_range
  118. CONFTEST: drm_bus_present
  119. CONFTEST: drm_bus_has_bus_type
  120. CONFTEST: drm_bus_has_get_irq
  121. CONFTEST: drm_bus_has_get_name
  122. CONFTEST: drm_driver_has_legacy_dev_list
  123. CONFTEST: drm_driver_has_set_busid
  124. CONFTEST: drm_crtc_state_has_connectors_changed
  125. CONFTEST: drm_init_function_args
  126. CONFTEST: drm_helper_mode_fill_fb_struct
  127. CONFTEST: drm_master_drop_has_from_release_arg
  128. CONFTEST: drm_driver_unload_has_int_return_type
  129. CONFTEST: drm_atomic_helper_crtc_destroy_state_has_crtc_arg
  130. CONFTEST: drm_crtc_helper_funcs_has_atomic_enable
  131. CONFTEST: drm_mode_object_find_has_file_priv_arg
  132. CONFTEST: dma_buf_owner
  133. CONFTEST: drm_connector_list_iter
  134. CONFTEST: drm_atomic_helper_swap_state_has_stall_arg
  135. CONFTEST: drm_driver_prime_flag_present
  136. CONFTEST: drm_gem_object_has_resv
  137. CONFTEST: dom0_kernel_present
  138. CONFTEST: nvidia_vgpu_hyperv_available
  139. CONFTEST: nvidia_vgpu_kvm_build
  140. CONFTEST: nvidia_grid_build
  141. CONFTEST: nvidia_grid_csp_build
  142. CONFTEST: pm_runtime_available
  143. CONFTEST: drm_available
  144. CONFTEST: drm_atomic_available
  145. CONFTEST: is_export_symbol_gpl_refcount_inc
  146. CONFTEST: is_export_symbol_gpl_refcount_dec_and_test
  147. CONFTEST: drm_alpha_blending_available
  148. CC [M] /var/lib/dkms/nvidia/450.66/build/nvidia/nv.o
  149. CC [M] /var/lib/dkms/nvidia/450.66/build/nvidia/nv-frontend.o
  150. CC [M] /var/lib/dkms/nvidia/450.66/build/nvidia/nv-pci.o
  151. cc1: error: incompatible gcc/plugin versions
  152. cc1: error: failed to initialize plugin ./scripts/gcc-plugins/structleak_plugin.so
  153. cc1: error: incompatible gcc/plugin versions
  154. cc1: error: failed to initialize plugin ./scripts/gcc-plugins/structleak_plugin.so
  155. CC [M] /var/lib/dkms/nvidia/450.66/build/nvidia/nv-i2c.o
  156. CC [M] /var/lib/dkms/nvidia/450.66/build/nvidia/nv-dma.o
  157. cc1: error: incompatible gcc/plugin versions
  158. cc1: error: failed to initialize plugin ./scripts/gcc-plugins/structleak_plugin.so
  159. make[2]: *** [scripts/Makefile.build:281: /var/lib/dkms/nvidia/450.66/build/nvidia/nv.o] Errore 1
  160. make[2]: *** Attesa per i processi non terminati....
  161. make[2]: *** [scripts/Makefile.build:281: /var/lib/dkms/nvidia/450.66/build/nvidia/nv-frontend.o] Errore 1
  162. make[2]: *** [scripts/Makefile.build:281: /var/lib/dkms/nvidia/450.66/build/nvidia/nv-pci.o] Errore 1
  163. CC [M] /var/lib/dkms/nvidia/450.66/build/nvidia/nv-acpi.o
  164. CC [M] /var/lib/dkms/nvidia/450.66/build/nvidia/nv-cray.o
  165. cc1: error: incompatible gcc/plugin versions
  166. cc1: error: incompatible gcc/plugin versions
  167. cc1: error: failed to initialize plugin ./scripts/gcc-plugins/structleak_plugin.so
  168. cc1: error: failed to initialize plugin ./scripts/gcc-plugins/structleak_plugin.so
  169. CC [M] /var/lib/dkms/nvidia/450.66/build/nvidia/nv-usermap.o
  170. make[2]: *** [scripts/Makefile.build:281: /var/lib/dkms/nvidia/450.66/build/nvidia/nv-dma.o] Errore 1
  171. CC [M] /var/lib/dkms/nvidia/450.66/build/nvidia/nv-p2p.o
  172. make[2]: *** [scripts/Makefile.build:281: /var/lib/dkms/nvidia/450.66/build/nvidia/nv-i2c.o] Errore 1
  173. CC [M] /var/lib/dkms/nvidia/450.66/build/nvidia/nv-procfs.o
  174. CC [M] /var/lib/dkms/nvidia/450.66/build/nvidia/nv-mmap.o
  175. CC [M] /var/lib/dkms/nvidia/450.66/build/nvidia/nv-pat.o
  176. cc1: error: incompatible gcc/plugin versions
  177. cc1: error: failed to initialize plugin ./scripts/gcc-plugins/structleak_plugin.so
  178. cc1: error: incompatible gcc/plugin versions
  179. cc1: error: failed to initialize plugin ./scripts/gcc-plugins/structleak_plugin.so
  180. make[2]: *** [scripts/Makefile.build:281: /var/lib/dkms/nvidia/450.66/build/nvidia/nv-acpi.o] Errore 1
  181. cc1: error: incompatible gcc/plugin versions
  182. cc1: error: failed to initialize plugin ./scripts/gcc-plugins/structleak_plugin.so
  183. make[2]: *** [scripts/Makefile.build:281: /var/lib/dkms/nvidia/450.66/build/nvidia/nv-cray.o] Errore 1
  184. cc1: error: incompatible gcc/plugin versions
  185. cc1: error: failed to initialize plugin ./scripts/gcc-plugins/structleak_plugin.so
  186. make[2]: *** [scripts/Makefile.build:281: /var/lib/dkms/nvidia/450.66/build/nvidia/nv-usermap.o] Errore 1
  187. cc1: error: incompatible gcc/plugin versions
  188. cc1: error: failed to initialize plugin ./scripts/gcc-plugins/structleak_plugin.so
  189. make[2]: *** [scripts/Makefile.build:281: /var/lib/dkms/nvidia/450.66/build/nvidia/nv-p2p.o] Errore 1
  190. cc1: error: incompatible gcc/plugin versions
  191. cc1: error: failed to initialize plugin ./scripts/gcc-plugins/structleak_plugin.so
  192. make[2]: *** [scripts/Makefile.build:281: /var/lib/dkms/nvidia/450.66/build/nvidia/nv-procfs.o] Errore 1
  193. make[2]: *** [scripts/Makefile.build:281: /var/lib/dkms/nvidia/450.66/build/nvidia/nv-mmap.o] Errore 1
  194. cc1: error: incompatible gcc/plugin versions
  195. cc1: error: failed to initialize plugin ./scripts/gcc-plugins/structleak_plugin.so
  196. make[2]: *** [scripts/Makefile.build:281: /var/lib/dkms/nvidia/450.66/build/nvidia/nv-pat.o] Errore 1
  197. make[1]: *** [Makefile:1756: /var/lib/dkms/nvidia/450.66/build] Errore 2
  198. make[1]: uscita dalla directory «/usr/lib/modules/5.8.3-6-tkg-pds/build»
  199. make: *** [Makefile:81: modules] Errore 2
RAW Paste Data