SHARE
TWEET

Untitled

Sunka Mar 8th, 2019 1 Never
Not a member of Pastebin yet? Sign Up, it unlocks many cool features!
  1. # cat /root/centminlogs/centminmod_123.09beta01.b109_080319-214703_php_upgrade.log
  2.  
  3. Do you want to run YUM install checks ?  [y/n]
  4.  
  5. This will increase your upgrade duration time wise.
  6. Check the change log centminmod.com/changelog.html
  7. to see if any Nginx or PHP related new additions
  8. which require checking YUM prequisites are met.
  9. If no new additions made, you can skip the
  10. YUM install check to speed up upgrade time.
  11.  
  12.  [y/n]:      ____   _   _  ____       _   _                                _      
  13.     |  _ \ | | | ||  _ \  _  | | | | _ __    __ _  _ __  __ _   __| |  ___
  14.     | |_) || |_| || |_) |(_) | | | || '_ \  / _` || '__|/ _` | / _` | / _ \
  15.     |  __/ |  _  ||  __/  _  | |_| || |_) || (_| || |  | (_| || (_| ||  __/
  16.     |_|    |_| |_||_|    (_)  \___/ | .__/  \__, ||_|   \__,_| \__,_| \___|
  17.                                     |_|     |___/                          
  18.  
  19. PHP Upgrade/Downgrade - Would you like to continue? [y/n] y
  20.  
  21. ----------------------------------------------------------------
  22. Install which version of PHP? (version i.e. 5.6.40, 7.0.33, NGDEBUG)
  23. PHP 7.x/7.1.x/7.2.x/7.3.x is GA Stable but still may have broken PHP extensions.
  24. NGDEBUG is PHP 7.4.0 dev builds minus incompatible PHP extensions
  25. ----------------------------------------------------------------
  26. Enter PHP Version number you want to upgrade/downgrade to: 7.3.2
  27. ----------------------------------------------------------------
  28. existing php.ini will be backed up at /usr/local/lib/php.ini-oldversion_080319-214703
  29. Want to update to latest php.conf ? (overwrites will auto backup existing php.conf)
  30. existing php.conf will be backed up at /usr/local/nginx/conf/php.conf-oldversion_080319-214703
  31. ----------------------------------------------------------------
  32. Update & overwrite your existing php.conf [y/n]: n
  33. ----------------------------------------------------------------
  34.  
  35. -----------------------------------------------------------------------------------------
  36. Detected PHP 7.3 branch.
  37. You can compile Zend OPcache (Zend Optimizer Plus+) support
  38. as an alternative to using APC Cache or Xcache cache.
  39. But Zend OPcache only provides PHP opcode cache and
  40. DOESN'T do data caching, so if your web apps such as Wordpress,
  41. Drupal or vBulletin require data caching to APC or Xcache,
  42. it won't work with Zend OPcache.
  43.  
  44. -----------------------------------------------------------------------------------------
  45. Do you want to use Zend OPcache [y/n] ? y
  46.  
  47. *************************************************
  48. * Zend Optimizer Plus OPcache configured
  49. *************************************************
  50.  
  51. PHP 7+ detected which uses newer mysqlnd
  52. or PDO MySQL extensions and removed the
  53. legacy mysql extension. You can optionally
  54. re-add the removed legacy mysql extension
  55. to PHP 7+ by answering yes to next question
  56. Only answer yes if you know for sure you
  57. have very old web scripts which need mysql
  58. legacy extension re-added. Otherwise answer
  59. no which is recommended for best stability
  60.  
  61. Re-add legacy mysql extension to PHP 7+ [y/n] ? n
  62.  
  63. *************************************************
  64. * Upgrading PHP
  65. *************************************************
  66. DE server detected
  67.  ____   _   _  ____       ____                          _                    _
  68. |  _ \ | | | ||  _ \  _  |  _ \   ___ __      __ _ __  | |  ___    __ _   __| |
  69. | |_) || |_| || |_) |(_) | | | | / _ \\ \ /\ / /| '_ \ | | / _ \  / _` | / _` |
  70. |  __/ |  _  ||  __/  _  | |_| || (_) |\ V  V / | | | || || (_) || (_| || (_| |
  71. |_|    |_| |_||_|    (_) |____/  \___/  \_/\_/  |_| |_||_| \___/  \__,_| \__,_|
  72.                                                                              
  73. HTTP/1.1 302 Found
  74. Initializing download: http://de2.php.net/get/php-7.3.2.tar.xz/from/this/mirror
  75. File size: 11966760 bytes
  76. Opening output file php-7.3.2.tar.xz
  77. Starting download
  78.  
  79. [  0%]  .......... .......... .......... .......... ..........  [ 597.7KB/s]
  80. [  0%]  .......... .......... .......... .......... ..........  [1193.5KB/s]
  81. [  0%]  .......... .......... .......... .......... ..........  [1589.9KB/s]
  82. [  1%]  .......... .......... .......... .......... ..........  [2182.8KB/s]
  83. [  1%]  .......... .......... .......... .......... ..........  [2577.5KB/s]
  84. [  2%]  .......... .......... .......... .......... ..........  [3168.6KB/s]
  85. [  2%]  .......... .......... .......... .......... ..........  [3561.3KB/s]
  86. [  3%]  .......... .......... .......... .......... ..........  [4149.5KB/s]
  87. [  3%]  .......... .......... .......... .......... ..........  [4540.6KB/s]
  88. [  3%]  .......... .......... .......... .......... ..........  [5126.9KB/s]
  89. [  4%]  .......... .......... .......... .......... ..........  [5517.0KB/s]
  90. [  4%]  .......... .......... .......... .......... ..........  [6101.1KB/s]
  91. [  5%]  .......... .......... .......... .......... ..........  [6284.4KB/s]
  92. [  5%]  .......... .......... .......... .......... ..........  [6712.0KB/s]
  93. [  6%]  .......... .......... .......... .......... ..........  [7133.2KB/s]
  94. [  6%]  .......... .......... .......... .......... ..........  [7553.6KB/s]
  95. [  6%]  .......... .......... .......... .......... ..........  [7955.2KB/s]
  96. [  7%]  .......... .......... .......... .......... ..........  [8373.3KB/s]
  97. [  7%]  .......... .......... .......... .......... ..........  [8643.3KB/s]
  98. [  8%]  .......... .......... .......... .......... ..........  [9024.3KB/s]
  99. [  8%]  .......... .......... .......... .......... ..........  [9402.6KB/s]
  100. [  9%]  .......... .......... .......... .......... ..........  [9725.1KB/s]
  101. [  9%]  .......... .......... .......... .......... ..........  [10024.4KB/s]
  102. [  9%]  .......... .......... .......... .......... ..........  [10386.2KB/s]
  103. [ 10%]  .......... .......... .......... .......... ..........  [10586.3KB/s]
  104. [ 10%]  .......... .......... .......... .......... ..........  [10824.8KB/s]
  105. [ 11%]  .......... .......... .......... .......... ..........  [11112.3KB/s]
  106. [ 11%]  .......... .......... .......... .......... ..........  [11426.8KB/s]
  107. [ 12%]  .......... .......... .......... .......... ..........  [11681.9KB/s]
  108. [ 12%]  .......... .......... .......... .......... ..........  [11935.5KB/s]
  109. [ 12%]  .......... .......... .......... .......... ..........  [12259.2KB/s]
  110. [ 13%]  .......... .......... .......... .......... ..........  [12485.8KB/s]
  111. [ 13%]  .......... .......... .......... .......... ..........  [12696.7KB/s]
  112. [ 14%]  .......... .......... .......... .......... ..........  [12988.6KB/s]
  113. [ 14%]  .......... .......... .......... .......... ..........  [13171.5KB/s]
  114. [ 15%]  .......... .......... .......... .......... ..........  [13402.6KB/s]
  115. [ 15%]  .......... .......... .......... .......... ..........  [13678.2KB/s]
  116. [ 15%]  .......... .......... .......... .......... ..........  [13932.8KB/s]
  117. [ 16%]  .......... .......... .......... .......... ..........  [14200.1KB/s]
  118. [ 16%]  .......... .......... .......... .......... ..........  [14470.4KB/s]
  119. [ 17%]  .......... .......... .......... .......... ..........  [13320.2KB/s]
  120. [ 17%]  .......... .......... .......... .......... ..........  [12935.3KB/s]
  121. [ 18%]  .......... .......... .......... .......... ..........  [13057.1KB/s]
  122. [ 18%]  .......... .......... .......... .......... ..........  [13345.8KB/s]
  123. [ 18%]  .......... .......... .......... .......... ..........  [13631.8KB/s]
  124. [ 19%]  .......... .......... .......... .......... ..........  [13603.1KB/s]
  125. [ 19%]  .......... .......... .......... .......... ..........  [13519.2KB/s]
  126. [ 20%]  .......... .......... .......... .......... ..........  [13389.8KB/s]
  127. [ 20%]  .......... .......... .......... .......... ..........  [13474.5KB/s]
  128. [ 21%]  .......... .......... .......... .......... ..........  [13531.3KB/s]
  129. [ 21%]  .......... .......... .......... .......... ..........  [13321.8KB/s]
  130. [ 21%]  .......... .......... .......... .......... ..........  [13114.1KB/s]
  131. [ 22%]  .......... .......... .......... .......... ..........  [13263.6KB/s]
  132. [ 22%]  .......... .......... .......... .......... ..........  [13148.3KB/s]
  133. [ 23%]  .......... .......... .......... .......... ..........  [13237.1KB/s]
  134. [ 23%]  .......... .......... .......... .......... ..........  [13240.6KB/s]
  135. [ 24%]  .......... .......... .......... .......... ..........  [13210.3KB/s]
  136. [ 24%]  .......... .......... .......... .......... ..........  [12992.7KB/s]
  137. [ 25%]  .......... .......... .......... .......... ..........  [13072.7KB/s]
  138. [ 25%]  .......... .......... .......... .......... ..........  [13066.7KB/s]
  139. [ 25%]  .......... .......... .......... .......... ..........  [13096.2KB/s]
  140. [ 26%]  .......... .......... .......... .......... ..........  [13049.0KB/s]
  141. [ 26%]  .......... .......... .......... .......... ..........  [12949.2KB/s]
  142. [ 27%]  .......... .......... .......... .......... ..........  [12979.3KB/s]
  143. [ 27%]  .......... .......... .......... .......... ..........  [12901.2KB/s]
  144. [ 28%]  .......... .......... .......... .......... ..........  [12924.1KB/s]
  145. [ 28%]  .......... .......... .......... .......... ..........  [12826.3KB/s]
  146. [ 28%]  .......... .......... .......... .......... ..........  [12851.2KB/s]
  147. [ 29%]  .......... .......... .......... .......... ..........  [12781.1KB/s]
  148. [ 29%]  .......... .......... .......... .......... ..........  [12783.5KB/s]
  149. [ 30%]  .......... .......... .......... .......... ..........  [12751.5KB/s]
  150. [ 30%]  .......... .......... .......... .......... ..........  [12783.7KB/s]
  151. [ 31%]  .......... .......... .......... .......... ..........  [12826.7KB/s]
  152. [ 31%]  .......... .......... .......... .......... ..........  [12746.3KB/s]
  153. [ 31%]  .......... .......... .......... .......... ..........  [12771.9KB/s]
  154. [ 32%]  .......... .......... .......... .......... ..........  [12721.4KB/s]
  155. [ 32%]  .......... .......... .......... .......... ..........  [12754.1KB/s]
  156. [ 33%]  .......... .......... .......... .......... ..........  [12679.8KB/s]
  157. [ 33%]  .......... .......... .......... .......... ..........  [12719.3KB/s]
  158. [ 34%]  .......... .......... .......... .......... ..........  [12721.9KB/s]
  159. [ 34%]  .......... .......... .......... .......... ..........  [12694.0KB/s]
  160. [ 34%]  .......... .......... .......... .......... ..........  [12625.7KB/s]
  161. [ 35%]  .......... .......... .......... .......... ..........  [12644.2KB/s]
  162. [ 35%]  .......... .......... .......... .......... ..........  [12585.6KB/s]
  163. [ 36%]  .......... .......... .......... .......... ..........  [12609.2KB/s]
  164. [ 36%]  .......... .......... .......... .......... ..........  [12553.0KB/s]
  165. [ 37%]  .......... .......... .......... .......... ..........  [12568.2KB/s]
  166. [ 37%]  .......... .......... .......... .......... ..........  [12515.2KB/s]
  167. [ 37%]  .......... .......... .......... .......... ..........  [12449.1KB/s]
  168. [ 38%]  .......... .......... .......... .......... ..........  [12476.7KB/s]
  169. [ 38%]  .......... .......... .......... .......... ..........  [12425.1KB/s]
  170. [ 39%]  .......... .......... .......... .......... ..........  [12457.0KB/s]
  171. [ 39%]  .......... .......... .......... .......... ..........  [12498.0KB/s]
  172. [ 40%]  .......... .......... .......... .......... ..........  [12538.2KB/s]
  173. [ 40%]  .......... .......... .......... .......... ..........  [12488.8KB/s]
  174. [ 40%]  .......... .......... .......... .......... ..........  [12449.0KB/s]
  175. [ 41%]  .......... .......... .......... .......... ..........  [12489.6KB/s]
  176. [ 41%]  .......... .......... .......... .......... ..........  [12517.0KB/s]
  177. [ 42%]  .......... .......... .......... .......... ..........  [12547.1KB/s]
  178. [ 42%]  .......... .......... .......... .......... ..........  [12564.6KB/s]
  179. [ 43%]  .......... .......... .......... .......... ..........  [12496.1KB/s]
  180. [ 43%]  .......... .......... .......... .......... ..........  [12459.9KB/s]
  181. [ 43%]  .......... .......... .......... .......... ..........  [12490.3KB/s]
  182. [ 44%]  .......... .......... .......... .......... ..........  [12516.6KB/s]
  183. [ 44%]  .......... .......... .......... .......... ..........  [12453.9KB/s]
  184. [ 45%]  .......... .......... .......... .......... ..........  [12482.2KB/s]
  185. [ 45%]  .......... .......... .......... .......... ..........  [12450.2KB/s]
  186. [ 46%]  .......... .......... .......... .......... ..........  [12464.0KB/s]
  187. [ 46%]  .......... .......... .......... .......... ..........  [12435.4KB/s]
  188. [ 46%]  .......... .......... .......... .......... ..........  [12450.4KB/s]
  189. [ 47%]  .......... .......... .......... .......... ..........  [12409.5KB/s]
  190. [ 47%]  .......... .......... .......... .......... ..........  [12433.3KB/s]
  191. [ 48%]  .......... .......... .......... .......... ..........  [12452.7KB/s]
  192. [ 48%]  .......... .......... .......... .......... ..........  [12417.0KB/s]
  193. [ 49%]  .......... .......... .......... .......... ..........  [12379.7KB/s]
  194. [ 49%]  .......... .......... .......... .......... ..........  [12395.3KB/s]
  195. [ 50%]  .......... .......... .......... .......... ..........  [12356.9KB/s]
  196. [ 50%]  .......... .......... .......... .......... ..........  [12378.9KB/s]
  197. [ 50%]  .......... .......... .......... .......... ..........  [12401.4KB/s]
  198. [ 51%]  .......... .......... .......... .......... ..........  [12359.8KB/s]
  199. [ 51%]  .......... .......... .......... .......... ..........  [12304.9KB/s]
  200. [ 52%]  .......... .......... .......... .......... ..........  [12330.6KB/s]
  201. [ 52%]  .......... .......... .......... .......... ..........  [12354.7KB/s]
  202. [ 53%]  .......... .......... .......... .......... ..........  [12322.8KB/s]
  203. [ 53%]  .......... .......... .......... .......... ..........  [12275.4KB/s]
  204. [ 53%]  .......... .......... .......... .......... ..........  [12295.8KB/s]
  205. [ 54%]  .......... .......... .......... .......... ..........  [12313.8KB/s]
  206. [ 54%]  .......... .......... .......... .......... ..........  [12286.8KB/s]
  207. [ 55%]  .......... .......... .......... .......... ..........  [12302.7KB/s]
  208. [ 55%]  .......... .......... .......... .......... ..........  [12273.0KB/s]
  209. [ 56%]  .......... .......... .......... .......... ..........  [12294.3KB/s]
  210. [ 56%]  .......... .......... .......... .......... ..........  [12264.1KB/s]
  211. [ 56%]  .......... .......... .......... .......... ..........  [12235.4KB/s]
  212. [ 57%]  .......... .......... .......... .......... ..........  [12245.3KB/s]
  213. [ 57%]  .......... .......... .......... .......... ..........  [12228.6KB/s]
  214. [ 58%]  .......... .......... .......... .......... ..........  [12229.6KB/s]
  215. [ 58%]  .......... .......... .......... .......... ..........  [12221.3KB/s]
  216. [ 59%]  .......... .......... .......... .......... ..........  [12227.5KB/s]
  217. [ 59%]  .......... .......... .......... .......... ..........  [12210.8KB/s]
  218. [ 59%]  .......... .......... .......... .......... ..........  [12226.8KB/s]
  219. [ 60%]  .......... .......... .......... .......... ..........  [12203.6KB/s]
  220. [ 60%]  .......... .......... .......... .......... ..........  [12222.6KB/s]
  221. [ 61%]  .......... .......... .......... .......... ..........  [12242.2KB/s]
  222. [ 61%]  .......... .......... .......... .......... ..........  [12213.4KB/s]
  223. [ 62%]  .......... .......... .......... .......... ..........  [12188.1KB/s]
  224. [ 62%]  .......... .......... .......... .......... ..........  [12164.9KB/s]
  225. [ 62%]  .......... .......... .......... .......... ..........  [12121.4KB/s]
  226. [ 63%]  .......... .......... .......... .......... ..........  [12142.4KB/s]
  227. [ 63%]  .......... .......... .......... .......... ..........  [12156.1KB/s]
  228. [ 64%]  .......... .......... .......... .......... ..........  [12169.6KB/s]
  229. [ 64%]  .......... .......... .......... .......... ..........  [12135.6KB/s]
  230. [ 65%]  .......... .......... .......... .......... ..........  [12156.5KB/s]
  231. [ 65%]  .......... .......... .......... .......... ..........  [12170.3KB/s]
  232. [ 65%]  .......... .......... .......... .......... ..........  [12142.1KB/s]
  233. [ 66%]  .......... .......... .......... .......... ..........  [12119.3KB/s]
  234. [ 66%]  .......... .......... .......... .......... ..........  [12134.3KB/s]
  235. [ 67%]  .......... .......... .......... .......... ..........  [12116.3KB/s]
  236. [ 67%]  .......... .......... .......... .......... ..........  [12118.0KB/s]
  237. [ 68%]  .......... .......... .......... .......... .......
  238. Connection 0 finished
  239.        ,,,,,,,,,, ,,,,,,,,,, ,,,,,,,,,, ,,,,,,,,,, ,,,,,,,...  [12090.6KB/s]
  240. [ 68%]  .......... .......... .......... .......... ..........  [12047.7KB/s]
  241. [ 68%]  .......... .......... .......... .......... ..........  [12067.8KB/s]
  242. [ 69%]  .......... .......... .......... .......... ..........  [12083.9KB/s]
  243. [ 69%]  .......... .......... .......... .......... ..........  [12067.0KB/s]
  244. [ 70%]  .......... .......... .......... .......... ..........  [12032.4KB/s]
  245. [ 70%]  .......... .......... .......... .......... ..........  [12044.0KB/s]
  246. [ 71%]  .......... .......... .......... .......... ..........  [12054.8KB/s]
  247. [ 71%]  .......... .......... .......... .......... ..........  [11994.4KB/s]
  248. [ 71%]  .......... .......... .......... .......... ..........  [12011.3KB/s]
  249. [ 72%]  .......... .......... .......... .......... ..........  [12063.5KB/s]
  250. [ 72%]  .......... .......... .......... .......... ..........  [12030.1KB/s]
  251. [ 73%]  .......... .......... .......... .......... ..........  [12018.7KB/s]
  252. [ 73%]  .......... .......... .......... .......... ..........  [11986.3KB/s]
  253. [ 74%]  .......... .......... .......... .......... ..........  [11987.6KB/s]
  254. [ 74%]  .......... .......... .......... .......... ..........  [11987.2KB/s]
  255. [ 75%]  .......... .......... .......... .......... ..........  [11982.3KB/s]
  256. [ 75%]  .......... .......... .......... .......... ..........  [11999.5KB/s]
  257. [ 75%]  .......... .......... .......... .......... ..........  [12019.2KB/s]
  258. [ 76%]  .......... .......... .......... .......... ..........  [12024.7KB/s]
  259. [ 76%]  .......... .......... .......... .......... ..........  [12018.9KB/s]
  260. [ 77%]  .......... .......... .......... .......... ..........  [12031.2KB/s]
  261. [ 77%]  .......... .......... .......... .......... ..........  [12029.9KB/s]
  262. [ 78%]  .......... .......... .......... .......... ..........  [11984.2KB/s]
  263. [ 78%]  .......... .......... .......... .......... ..........  [12026.1KB/s]
  264. [ 78%]  .......... .......... .......... .......... ..........  [11974.3KB/s]
  265. [ 79%]  .......... .......... .......... .......... ....
  266. Connection 0 finished
  267.        ,,,,,,,,,, ,,,,,,,,,, ,,,,,,,,,, ,,,,,,,,,, ,,,,......  [11984.9KB/s]
  268. [ 79%]  .......... .......... .......... .......... ..........  [11917.0KB/s]
  269. [ 80%]  .......... .......... .......... .......... ..........  [11925.7KB/s]
  270. [ 80%]  .......... .......... .......... .......... ..........  [11907.5KB/s]
  271. [ 81%]  .......... .......... .......... .......... ..........  [11916.6KB/s]
  272. [ 81%]  .......... .......... .......... .......... ..........  [11894.1KB/s]
  273. [ 81%]  .......... .......... .......... .......... ..........  [11909.6KB/s]
  274. [ 82%]  .......... .......... .......... .......... ..........  [11921.0KB/s]
  275. [ 82%]  .......... .......... .......... .......... ..........  [11939.5KB/s]
  276. [ 83%]  .......... .......... .......... .......... ..........  [11942.7KB/s]
  277. [ 83%]  .......... .......... .......... .......... ..........  [11949.4KB/s]
  278. [ 84%]  .......... .......... .......... .......... ..........  [11971.3KB/s]
  279. [ 84%]  .......... .......... .......... .......... ..........  [11988.9KB/s]
  280. [ 84%]  .......... .......... .......... .......... ..........  [11968.8KB/s]
  281. [ 85%]  .......... .......... .......... .......... ..........  [11976.5KB/s]
  282. [ 85%]  .......... .......... .......... .......... ..........  [11974.8KB/s]
  283. [ 86%]  .......... .......... .......... .......... ..........  [11983.5KB/s]
  284. [ 86%]  .......... .......... .......... .......... ..........  [11994.6KB/s]
  285. [ 87%]  .......... .......... .......... .......... ..........  [11975.7KB/s]
  286. [ 87%]  .......... .......... .......... .......... ..........  [11991.9KB/s]
  287. [ 87%]  .......... .......... .......... .......... ..........  [11975.0KB/s]
  288. [ 88%]  .......... .......... .......... .......... ..........  [11984.9KB/s]
  289. [ 88%]  .......... .......... .......... .......... ..........  [11973.4KB/s]
  290. [ 89%]  .......... .......... .......... .......... ..........  [11985.6KB/s]
  291. [ 89%]  .......... .......... .......... .......... ..........  [11965.4KB/s]
  292. [ 90%]  .......... .......... .......... .......... ..........  [11943.6KB/s]
  293. [ 90%]  .......... .......... .......... .......... ..........  [11931.8KB/s]
  294. [ 90%]  .......... .......... .......... .......... ..........  [11977.6KB/s]
  295. [ 91%]  .......... .......... .......... .......... ..........  [11956.3KB/s]
  296. [ 91%]  .......... .......... .......... .......... ..........  [11970.1KB/s]
  297. [ 92%]  .......... .......... .......... .......... ..........  [11987.5KB/s]
  298. [ 92%]  .......... .......... .......... .......... ..........  [11964.6KB/s]
  299. [ 93%]  .......... .......... .......... .......... ..........  [11956.9KB/s]
  300. [ 93%]  .......... .......... .....
  301. Connection 2 finished
  302.        ,,,,,,,,,, ,,,,,,,,,, ,,,,,..... .......... ..........  [11915.9KB/s]
  303. [ 93%]  .......... .......... .......... .......... ..........  [11901.9KB/s]
  304. [ 94%]  .......... .......... .......... .......... ..........  [11907.7KB/s]
  305. [ 94%]  .......... .......... ......
  306. Connection 0 finished
  307.        ,,,,,,,,,, ,,,,,,,,,, ,,,,,,.... .......... ..........  [11887.3KB/s]
  308. [ 95%]  .......... .......... .......... .......... ..........  [11867.4KB/s]
  309. [ 95%]  .......... .......... .......... .......... ..........  [11876.0KB/s]
  310. [ 96%]  .......... .......... .......... .......... ..........  [11887.0KB/s]
  311. [ 96%]  .......... .......... .......... .......... ..........  [11873.0KB/s]
  312. [ 96%]  .......... .......... .......... .......... ..........  [11885.6KB/s]
  313. [ 97%]  .......... .......... .......... .......... ..........  [11895.7KB/s]
  314. [ 97%]  .......... .......... .......... .......... ..........  [11912.1KB/s]
  315. [ 98%]  .......... .......... .......... .......... ..........  [11932.3KB/s]
  316. [ 98%]  .......... .......... .......... .......... .........
  317. Connection 0 finished
  318.        ,,,,,,,,,, ,,,,,,,,,, ,,,,,,,,,, ,,,,,,,,,, ,,,,,,,,,.  [11841.8KB/s]
  319. [ 99%]  ........
  320. Connection 2 finished
  321.        ,,,,,,,,.. .......... .......... .......... ..........  [11807.2KB/s]
  322. [ 99%]  .......... .......... .......... .......... ....
  323. Connection 0 finished
  324.        ,,,,,,,,,, ,,,,,,,,,, ,,,,,,,,,, ,,,,,,,,,, ,,,,..
  325. Connection 1 finished
  326.        ,,,,,,,,,, ,,,,,,,,,, ,,,,,,,,,, ,,,,,,,,,, ,,,,,,....  [10449.0KB/s]
  327. [100%]  .......... .......... .......... .......... ..........  [10267.0KB/s]
  328. [100%]  .......... .......... .......... ......
  329. Connection 3 finished
  330.  
  331. Downloaded 11.4 Megabyte in 1 second. (10238.76 KB/s)
  332. Download done.
  333.  
  334. php-7.3.2.tar.xz valid file.
  335.  
  336. PHP VERSION ID: 70302
  337.  
  338. *************************************************
  339. * Updating php.ini...
  340. *************************************************
  341. old php.ini will be saved at /usr/local/lib/php.ini-oldversion_080319-214703
  342. if you have modified your old php.ini i.e. installed and loaded
  343. APC, Xcache, Memcache or Suhosin - please re-install them after php upgrade
  344. ...
  345.  
  346. make: *** No rule to make target `clean'.  Stop.
  347. Forcing buildconf
  348. Removing configure caches
  349. buildconf: checking installation...
  350. buildconf: autoconf version 2.69 (ok)
  351. rebuilding aclocal.m4
  352. rebuilding configure
  353. rebuilding main/php_config.h.in
  354. make: *** No rule to make target `clean'.  Stop.
  355.  ____   _   _  ____        ____                __  _                          
  356. |  _ \ | | | ||  _ \  _   / ___| ___   _ __   / _|(_)  __ _  _   _  _ __  ___
  357. | |_) || |_| || |_) |(_) | |    / _ \ | '_ \ | |_ | | / _` || | | || '__|/ _ \
  358. |  __/ |  _  ||  __/  _  | |___| (_) || | | ||  _|| || (_| || |_| || |  |  __/
  359. |_|    |_| |_||_|    (_)  \____|\___/ |_| |_||_|  |_| \__, | \__,_||_|   \___|
  360.                                                       |___/                  
  361. /svr-setup /svr-setup/php-7.3.2/fpm-build
  362. libsodium-1.0.17.tar.gz found, skipping download...
  363. Making clean in builds
  364. make[1]: Entering directory `/svr-setup/libsodium-1.0.17/builds'
  365. rm -rf .libs _libs
  366. rm -f *.lo
  367. make[1]: Leaving directory `/svr-setup/libsodium-1.0.17/builds'
  368. Making clean in contrib
  369. make[1]: Entering directory `/svr-setup/libsodium-1.0.17/contrib'
  370. rm -rf .libs _libs
  371. rm -f *.lo
  372. make[1]: Leaving directory `/svr-setup/libsodium-1.0.17/contrib'
  373. Making clean in dist-build
  374. make[1]: Entering directory `/svr-setup/libsodium-1.0.17/dist-build'
  375. rm -rf .libs _libs
  376. rm -f *.lo
  377. make[1]: Leaving directory `/svr-setup/libsodium-1.0.17/dist-build'
  378. Making clean in msvc-scripts
  379. make[1]: Entering directory `/svr-setup/libsodium-1.0.17/msvc-scripts'
  380. rm -rf .libs _libs
  381. rm -f *.lo
  382. make[1]: Leaving directory `/svr-setup/libsodium-1.0.17/msvc-scripts'
  383. Making clean in src
  384. make[1]: Entering directory `/svr-setup/libsodium-1.0.17/src'
  385. Making clean in libsodium
  386. make[2]: Entering directory `/svr-setup/libsodium-1.0.17/src/libsodium'
  387. Making clean in include
  388. make[3]: Entering directory `/svr-setup/libsodium-1.0.17/src/libsodium/include'
  389. rm -rf .libs _libs
  390. rm -f *.lo
  391. make[3]: Leaving directory `/svr-setup/libsodium-1.0.17/src/libsodium/include'
  392. make[3]: Entering directory `/svr-setup/libsodium-1.0.17/src/libsodium'
  393. test -z "" || rm -f
  394. test -z "libsodium.la" || rm -f libsodium.la
  395. rm -f ./so_locations
  396. rm -rf .libs _libs
  397. rm -rf crypto_aead/aes256gcm/aesni/.libs crypto_aead/aes256gcm/aesni/_libs
  398. rm -rf crypto_aead/chacha20poly1305/sodium/.libs crypto_aead/chacha20poly1305/sodium/_libs
  399. rm -rf crypto_aead/xchacha20poly1305/sodium/.libs crypto_aead/xchacha20poly1305/sodium/_libs
  400. rm -rf crypto_auth/.libs crypto_auth/_libs
  401. rm -rf crypto_auth/hmacsha256/.libs crypto_auth/hmacsha256/_libs
  402. rm -rf crypto_auth/hmacsha512/.libs crypto_auth/hmacsha512/_libs
  403. rm -rf crypto_auth/hmacsha512256/.libs crypto_auth/hmacsha512256/_libs
  404. rm -rf crypto_box/.libs crypto_box/_libs
  405. rm -rf crypto_box/curve25519xchacha20poly1305/.libs crypto_box/curve25519xchacha20poly1305/_libs
  406. rm -rf crypto_box/curve25519xsalsa20poly1305/.libs crypto_box/curve25519xsalsa20poly1305/_libs
  407. rm -rf crypto_core/ed25519/.libs crypto_core/ed25519/_libs
  408. rm -rf crypto_core/ed25519/ref10/.libs crypto_core/ed25519/ref10/_libs
  409. rm -rf crypto_core/hchacha20/.libs crypto_core/hchacha20/_libs
  410. rm -rf crypto_core/hsalsa20/.libs crypto_core/hsalsa20/_libs
  411. rm -rf crypto_core/hsalsa20/ref2/.libs crypto_core/hsalsa20/ref2/_libs
  412. rm -rf crypto_core/salsa/ref/.libs crypto_core/salsa/ref/_libs
  413. rm -rf crypto_generichash/.libs crypto_generichash/_libs
  414. rm -rf crypto_generichash/blake2b/.libs crypto_generichash/blake2b/_libs
  415. rm -rf crypto_generichash/blake2b/ref/.libs crypto_generichash/blake2b/ref/_libs
  416. rm -rf crypto_hash/.libs crypto_hash/_libs
  417. rm -rf crypto_hash/sha256/.libs crypto_hash/sha256/_libs
  418. rm -rf crypto_hash/sha256/cp/.libs crypto_hash/sha256/cp/_libs
  419. rm -rf crypto_hash/sha512/.libs crypto_hash/sha512/_libs
  420. rm -rf crypto_hash/sha512/cp/.libs crypto_hash/sha512/cp/_libs
  421. rm -rf crypto_kdf/.libs crypto_kdf/_libs
  422. rm -rf crypto_kdf/blake2b/.libs crypto_kdf/blake2b/_libs
  423. rm -rf crypto_kx/.libs crypto_kx/_libs
  424. rm -rf crypto_onetimeauth/.libs crypto_onetimeauth/_libs
  425. rm -rf crypto_onetimeauth/poly1305/.libs crypto_onetimeauth/poly1305/_libs
  426. rm -rf crypto_onetimeauth/poly1305/donna/.libs crypto_onetimeauth/poly1305/donna/_libs
  427. rm -rf crypto_onetimeauth/poly1305/sse2/.libs crypto_onetimeauth/poly1305/sse2/_libs
  428. rm -rf crypto_pwhash/.libs crypto_pwhash/_libs
  429. rm -rf crypto_pwhash/argon2/.libs crypto_pwhash/argon2/_libs
  430. rm -rf crypto_pwhash/scryptsalsa208sha256/.libs crypto_pwhash/scryptsalsa208sha256/_libs
  431. rm -rf crypto_pwhash/scryptsalsa208sha256/nosse/.libs crypto_pwhash/scryptsalsa208sha256/nosse/_libs
  432. rm -rf crypto_pwhash/scryptsalsa208sha256/sse/.libs crypto_pwhash/scryptsalsa208sha256/sse/_libs
  433. rm -rf crypto_scalarmult/.libs crypto_scalarmult/_libs
  434. rm -rf crypto_scalarmult/curve25519/.libs crypto_scalarmult/curve25519/_libs
  435. rm -rf crypto_scalarmult/curve25519/ref10/.libs crypto_scalarmult/curve25519/ref10/_libs
  436. rm -rf crypto_scalarmult/curve25519/sandy2x/.libs crypto_scalarmult/curve25519/sandy2x/_libs
  437. rm -rf crypto_scalarmult/ed25519/ref10/.libs crypto_scalarmult/ed25519/ref10/_libs
  438. rm -rf crypto_secretbox/.libs crypto_secretbox/_libs
  439. rm -rf crypto_secretbox/xchacha20poly1305/.libs crypto_secretbox/xchacha20poly1305/_libs
  440. rm -rf crypto_secretbox/xsalsa20poly1305/.libs crypto_secretbox/xsalsa20poly1305/_libs
  441. rm -rf crypto_secretstream/xchacha20poly1305/.libs crypto_secretstream/xchacha20poly1305/_libs
  442. rm -rf crypto_shorthash/.libs crypto_shorthash/_libs
  443. rm -rf crypto_shorthash/siphash24/.libs crypto_shorthash/siphash24/_libs
  444. rm -rf crypto_shorthash/siphash24/ref/.libs crypto_shorthash/siphash24/ref/_libs
  445. rm -rf crypto_sign/.libs crypto_sign/_libs
  446. rm -rf crypto_sign/ed25519/.libs crypto_sign/ed25519/_libs
  447. rm -rf crypto_sign/ed25519/ref10/.libs crypto_sign/ed25519/ref10/_libs
  448. rm -rf crypto_stream/.libs crypto_stream/_libs
  449. rm -rf crypto_stream/chacha20/.libs crypto_stream/chacha20/_libs
  450. rm -rf crypto_stream/chacha20/dolbeau/.libs crypto_stream/chacha20/dolbeau/_libs
  451. rm -rf crypto_stream/chacha20/ref/.libs crypto_stream/chacha20/ref/_libs
  452. rm -rf crypto_stream/salsa20/.libs crypto_stream/salsa20/_libs
  453. rm -rf crypto_stream/salsa20/ref/.libs crypto_stream/salsa20/ref/_libs
  454. rm -rf crypto_stream/salsa20/xmm6/.libs crypto_stream/salsa20/xmm6/_libs
  455. rm -rf crypto_stream/salsa20/xmm6int/.libs crypto_stream/salsa20/xmm6int/_libs
  456. rm -rf crypto_stream/salsa2012/.libs crypto_stream/salsa2012/_libs
  457. rm -rf crypto_stream/salsa2012/ref/.libs crypto_stream/salsa2012/ref/_libs
  458. rm -rf crypto_stream/salsa208/.libs crypto_stream/salsa208/_libs
  459. rm -rf crypto_stream/salsa208/ref/.libs crypto_stream/salsa208/ref/_libs
  460. rm -rf crypto_stream/xchacha20/.libs crypto_stream/xchacha20/_libs
  461. rm -rf crypto_stream/xsalsa20/.libs crypto_stream/xsalsa20/_libs
  462. rm -rf crypto_verify/sodium/.libs crypto_verify/sodium/_libs
  463. rm -rf randombytes/.libs randombytes/_libs
  464. rm -rf randombytes/nativeclient/.libs randombytes/nativeclient/_libs
  465. rm -rf randombytes/salsa20/.libs randombytes/salsa20/_libs
  466. rm -rf randombytes/sysrandom/.libs randombytes/sysrandom/_libs
  467. rm -rf sodium/.libs sodium/_libs
  468. test -z "libaesni.la libsse2.la libssse3.la libsse41.la libavx2.la libavx512f.la librdrand.la" || rm -f libaesni.la libsse2.la libssse3.la libsse41.la libavx2.la libavx512f.la librdrand.la
  469. rm -f ./so_locations
  470. rm -f *.o
  471. rm -f crypto_aead/aes256gcm/aesni/*.o
  472. rm -f crypto_aead/aes256gcm/aesni/*.lo
  473. rm -f crypto_aead/chacha20poly1305/sodium/*.o
  474. rm -f crypto_aead/chacha20poly1305/sodium/*.lo
  475. rm -f crypto_aead/xchacha20poly1305/sodium/*.o
  476. rm -f crypto_aead/xchacha20poly1305/sodium/*.lo
  477. rm -f crypto_auth/*.o
  478. rm -f crypto_auth/*.lo
  479. rm -f crypto_auth/hmacsha256/*.o
  480. rm -f crypto_auth/hmacsha256/*.lo
  481. rm -f crypto_auth/hmacsha512/*.o
  482. rm -f crypto_auth/hmacsha512/*.lo
  483. rm -f crypto_auth/hmacsha512256/*.o
  484. rm -f crypto_auth/hmacsha512256/*.lo
  485. rm -f crypto_box/*.o
  486. rm -f crypto_box/*.lo
  487. rm -f crypto_box/curve25519xchacha20poly1305/*.o
  488. rm -f crypto_box/curve25519xchacha20poly1305/*.lo
  489. rm -f crypto_box/curve25519xsalsa20poly1305/*.o
  490. rm -f crypto_box/curve25519xsalsa20poly1305/*.lo
  491. rm -f crypto_core/ed25519/*.o
  492. rm -f crypto_core/ed25519/*.lo
  493. rm -f crypto_core/ed25519/ref10/*.o
  494. rm -f crypto_core/ed25519/ref10/*.lo
  495. rm -f crypto_core/hchacha20/*.o
  496. rm -f crypto_core/hchacha20/*.lo
  497. rm -f crypto_core/hsalsa20/*.o
  498. rm -f crypto_core/hsalsa20/*.lo
  499. rm -f crypto_core/hsalsa20/ref2/*.o
  500. rm -f crypto_core/hsalsa20/ref2/*.lo
  501. rm -f crypto_core/salsa/ref/*.o
  502. rm -f crypto_core/salsa/ref/*.lo
  503. rm -f crypto_generichash/*.o
  504. rm -f crypto_generichash/*.lo
  505. rm -f crypto_generichash/blake2b/*.o
  506. rm -f crypto_generichash/blake2b/*.lo
  507. rm -f crypto_generichash/blake2b/ref/*.o
  508. rm -f crypto_generichash/blake2b/ref/*.lo
  509. rm -f crypto_hash/*.o
  510. rm -f crypto_hash/*.lo
  511. rm -f crypto_hash/sha256/*.o
  512. rm -f crypto_hash/sha256/*.lo
  513. rm -f crypto_hash/sha256/cp/*.o
  514. rm -f crypto_hash/sha256/cp/*.lo
  515. rm -f crypto_hash/sha512/*.o
  516. rm -f crypto_hash/sha512/*.lo
  517. rm -f crypto_hash/sha512/cp/*.o
  518. rm -f crypto_hash/sha512/cp/*.lo
  519. rm -f crypto_kdf/*.o
  520. rm -f crypto_kdf/*.lo
  521. rm -f crypto_kdf/blake2b/*.o
  522. rm -f crypto_kdf/blake2b/*.lo
  523. rm -f crypto_kx/*.o
  524. rm -f crypto_kx/*.lo
  525. rm -f crypto_onetimeauth/*.o
  526. rm -f crypto_onetimeauth/*.lo
  527. rm -f crypto_onetimeauth/poly1305/*.o
  528. rm -f crypto_onetimeauth/poly1305/*.lo
  529. rm -f crypto_onetimeauth/poly1305/donna/*.o
  530. rm -f crypto_onetimeauth/poly1305/donna/*.lo
  531. rm -f crypto_onetimeauth/poly1305/sse2/*.o
  532. rm -f crypto_onetimeauth/poly1305/sse2/*.lo
  533. rm -f crypto_pwhash/*.o
  534. rm -f crypto_pwhash/*.lo
  535. rm -f crypto_pwhash/argon2/*.o
  536. rm -f crypto_pwhash/argon2/*.lo
  537. rm -f crypto_pwhash/scryptsalsa208sha256/*.o
  538. rm -f crypto_pwhash/scryptsalsa208sha256/*.lo
  539. rm -f crypto_pwhash/scryptsalsa208sha256/nosse/*.o
  540. rm -f crypto_pwhash/scryptsalsa208sha256/nosse/*.lo
  541. rm -f crypto_pwhash/scryptsalsa208sha256/sse/*.o
  542. rm -f crypto_pwhash/scryptsalsa208sha256/sse/*.lo
  543. rm -f crypto_scalarmult/*.o
  544. rm -f crypto_scalarmult/*.lo
  545. rm -f crypto_scalarmult/curve25519/*.o
  546. rm -f crypto_scalarmult/curve25519/*.lo
  547. rm -f crypto_scalarmult/curve25519/ref10/*.o
  548. rm -f crypto_scalarmult/curve25519/ref10/*.lo
  549. rm -f crypto_scalarmult/curve25519/sandy2x/*.o
  550. rm -f crypto_scalarmult/curve25519/sandy2x/*.lo
  551. rm -f crypto_scalarmult/ed25519/ref10/*.o
  552. rm -f crypto_scalarmult/ed25519/ref10/*.lo
  553. rm -f crypto_secretbox/*.o
  554. rm -f crypto_secretbox/*.lo
  555. rm -f crypto_secretbox/xchacha20poly1305/*.o
  556. rm -f crypto_secretbox/xchacha20poly1305/*.lo
  557. rm -f crypto_secretbox/xsalsa20poly1305/*.o
  558. rm -f crypto_secretbox/xsalsa20poly1305/*.lo
  559. rm -f crypto_secretstream/xchacha20poly1305/*.o
  560. rm -f crypto_secretstream/xchacha20poly1305/*.lo
  561. rm -f crypto_shorthash/*.o
  562. rm -f crypto_shorthash/*.lo
  563. rm -f crypto_shorthash/siphash24/*.o
  564. rm -f crypto_shorthash/siphash24/*.lo
  565. rm -f crypto_shorthash/siphash24/ref/*.o
  566. rm -f crypto_shorthash/siphash24/ref/*.lo
  567. rm -f crypto_sign/*.o
  568. rm -f crypto_sign/*.lo
  569. rm -f crypto_sign/ed25519/*.o
  570. rm -f crypto_sign/ed25519/*.lo
  571. rm -f crypto_sign/ed25519/ref10/*.o
  572. rm -f crypto_sign/ed25519/ref10/*.lo
  573. rm -f crypto_stream/*.o
  574. rm -f crypto_stream/*.lo
  575. rm -f crypto_stream/chacha20/*.o
  576. rm -f crypto_stream/chacha20/*.lo
  577. rm -f crypto_stream/chacha20/dolbeau/*.o
  578. rm -f crypto_stream/chacha20/dolbeau/*.lo
  579. rm -f crypto_stream/chacha20/ref/*.o
  580. rm -f crypto_stream/chacha20/ref/*.lo
  581. rm -f crypto_stream/salsa20/*.o
  582. rm -f crypto_stream/salsa20/*.lo
  583. rm -f crypto_stream/salsa20/ref/*.o
  584. rm -f crypto_stream/salsa20/ref/*.lo
  585. rm -f crypto_stream/salsa20/xmm6/*.o
  586. rm -f crypto_stream/salsa20/xmm6/*.lo
  587. rm -f crypto_stream/salsa20/xmm6int/*.o
  588. rm -f crypto_stream/salsa20/xmm6int/*.lo
  589. rm -f crypto_stream/salsa2012/*.o
  590. rm -f crypto_stream/salsa2012/*.lo
  591. rm -f crypto_stream/salsa2012/ref/*.o
  592. rm -f crypto_stream/salsa2012/ref/*.lo
  593. rm -f crypto_stream/salsa208/*.o
  594. rm -f crypto_stream/salsa208/*.lo
  595. rm -f crypto_stream/salsa208/ref/*.o
  596. rm -f crypto_stream/salsa208/ref/*.lo
  597. rm -f crypto_stream/xchacha20/*.o
  598. rm -f crypto_stream/xchacha20/*.lo
  599. rm -f crypto_stream/xsalsa20/*.o
  600. rm -f crypto_stream/xsalsa20/*.lo
  601. rm -f crypto_verify/sodium/*.o
  602. rm -f crypto_verify/sodium/*.lo
  603. rm -f randombytes/*.o
  604. rm -f randombytes/*.lo
  605. rm -f randombytes/nativeclient/*.o
  606. rm -f randombytes/nativeclient/*.lo
  607. rm -f randombytes/salsa20/*.o
  608. rm -f randombytes/salsa20/*.lo
  609. rm -f randombytes/sysrandom/*.o
  610. rm -f randombytes/sysrandom/*.lo
  611. rm -f sodium/*.o
  612. rm -f sodium/*.lo
  613. rm -f *.lo
  614. make[3]: Leaving directory `/svr-setup/libsodium-1.0.17/src/libsodium'
  615. make[2]: Leaving directory `/svr-setup/libsodium-1.0.17/src/libsodium'
  616. make[2]: Entering directory `/svr-setup/libsodium-1.0.17/src'
  617. rm -rf .libs _libs
  618. rm -f *.lo
  619. make[2]: Leaving directory `/svr-setup/libsodium-1.0.17/src'
  620. make[1]: Leaving directory `/svr-setup/libsodium-1.0.17/src'
  621. Making clean in test
  622. make[1]: Entering directory `/svr-setup/libsodium-1.0.17/test'
  623. Making clean in default
  624. make[2]: Entering directory `/svr-setup/libsodium-1.0.17/test/default'
  625. rm -f aead_aes256gcm aead_aes256gcm2 aead_chacha20poly1305 aead_chacha20poly13052 aead_xchacha20poly1305 auth auth2 auth3 auth5 auth6 auth7 box box2 box7 box8 box_easy box_easy2 box_seal box_seed chacha20 codecs core1 core2 core3 core4 core5 core6 ed25519_convert generichash generichash2 generichash3 hash hash3 kdf keygen kx metamorphic misuse onetimeauth onetimeauth2 onetimeauth7 pwhash_argon2i pwhash_argon2id randombytes scalarmult scalarmult2 scalarmult5 scalarmult6 scalarmult7 scalarmult8 secretbox secretbox2 secretbox7 secretbox8 secretbox_easy secretbox_easy2 secretstream shorthash sign sodium_core sodium_utils sodium_version stream stream2 stream3 stream4 verify1 sodium_utils2 sodium_utils3 core_ed25519 pwhash_scrypt pwhash_scrypt_ll scalarmult_ed25519 siphashx24 xchacha20
  626. test -z "" || rm -f
  627. rm -rf .libs _libs
  628. rm -f *.o
  629. test -z "aead_aes256gcm.log aead_aes256gcm2.log aead_chacha20poly1305.log aead_chacha20poly13052.log aead_xchacha20poly1305.log auth.log auth2.log auth3.log auth5.log auth6.log auth7.log box.log box2.log box7.log box8.log box_easy.log box_easy2.log box_seal.log box_seed.log chacha20.log codecs.log core1.log core2.log core3.log core4.log core5.log core6.log ed25519_convert.log generichash.log generichash2.log generichash3.log hash.log hash3.log kdf.log keygen.log kx.log metamorphic.log misuse.log onetimeauth.log onetimeauth2.log onetimeauth7.log pwhash_argon2i.log pwhash_argon2id.log randombytes.log scalarmult.log scalarmult2.log scalarmult5.log scalarmult6.log scalarmult7.log scalarmult8.log secretbox.log secretbox2.log secretbox7.log secretbox8.log secretbox_easy.log secretbox_easy2.log secretstream.log shorthash.log sign.log sodium_core.log sodium_utils.log sodium_version.log stream.log stream2.log stream3.log stream4.log verify1.log sodium_utils2.log sodium_utils3.log core_ed25519.log pwhash_scrypt.log pwhash_scrypt_ll.log scalarmult_ed25519.log siphashx24.log xchacha20.log" || rm -f aead_aes256gcm.log aead_aes256gcm2.log aead_chacha20poly1305.log aead_chacha20poly13052.log aead_xchacha20poly1305.log auth.log auth2.log auth3.log auth5.log auth6.log auth7.log box.log box2.log box7.log box8.log box_easy.log box_easy2.log box_seal.log box_seed.log chacha20.log codecs.log core1.log core2.log core3.log core4.log core5.log core6.log ed25519_convert.log generichash.log generichash2.log generichash3.log hash.log hash3.log kdf.log keygen.log kx.log metamorphic.log misuse.log onetimeauth.log onetimeauth2.log onetimeauth7.log pwhash_argon2i.log pwhash_argon2id.log randombytes.log scalarmult.log scalarmult2.log scalarmult5.log scalarmult6.log scalarmult7.log scalarmult8.log secretbox.log secretbox2.log secretbox7.log secretbox8.log secretbox_easy.log secretbox_easy2.log secretstream.log shorthash.log sign.log sodium_core.log sodium_utils.log sodium_version.log stream.log stream2.log stream3.log stream4.log verify1.log sodium_utils2.log sodium_utils3.log core_ed25519.log pwhash_scrypt.log pwhash_scrypt_ll.log scalarmult_ed25519.log siphashx24.log xchacha20.log
  630. test -z "aead_aes256gcm.trs aead_aes256gcm2.trs aead_chacha20poly1305.trs aead_chacha20poly13052.trs aead_xchacha20poly1305.trs auth.trs auth2.trs auth3.trs auth5.trs auth6.trs auth7.trs box.trs box2.trs box7.trs box8.trs box_easy.trs box_easy2.trs box_seal.trs box_seed.trs chacha20.trs codecs.trs core1.trs core2.trs core3.trs core4.trs core5.trs core6.trs ed25519_convert.trs generichash.trs generichash2.trs generichash3.trs hash.trs hash3.trs kdf.trs keygen.trs kx.trs metamorphic.trs misuse.trs onetimeauth.trs onetimeauth2.trs onetimeauth7.trs pwhash_argon2i.trs pwhash_argon2id.trs randombytes.trs scalarmult.trs scalarmult2.trs scalarmult5.trs scalarmult6.trs scalarmult7.trs scalarmult8.trs secretbox.trs secretbox2.trs secretbox7.trs secretbox8.trs secretbox_easy.trs secretbox_easy2.trs secretstream.trs shorthash.trs sign.trs sodium_core.trs sodium_utils.trs sodium_version.trs stream.trs stream2.trs stream3.trs stream4.trs verify1.trs sodium_utils2.trs sodium_utils3.trs core_ed25519.trs pwhash_scrypt.trs pwhash_scrypt_ll.trs scalarmult_ed25519.trs siphashx24.trs xchacha20.trs" || rm -f aead_aes256gcm.trs aead_aes256gcm2.trs aead_chacha20poly1305.trs aead_chacha20poly13052.trs aead_xchacha20poly1305.trs auth.trs auth2.trs auth3.trs auth5.trs auth6.trs auth7.trs box.trs box2.trs box7.trs box8.trs box_easy.trs box_easy2.trs box_seal.trs box_seed.trs chacha20.trs codecs.trs core1.trs core2.trs core3.trs core4.trs core5.trs core6.trs ed25519_convert.trs generichash.trs generichash2.trs generichash3.trs hash.trs hash3.trs kdf.trs keygen.trs kx.trs metamorphic.trs misuse.trs onetimeauth.trs onetimeauth2.trs onetimeauth7.trs pwhash_argon2i.trs pwhash_argon2id.trs randombytes.trs scalarmult.trs scalarmult2.trs scalarmult5.trs scalarmult6.trs scalarmult7.trs scalarmult8.trs secretbox.trs secretbox2.trs secretbox7.trs secretbox8.trs secretbox_easy.trs secretbox_easy2.trs secretstream.trs shorthash.trs sign.trs sodium_core.trs sodium_utils.trs sodium_version.trs stream.trs stream2.trs stream3.trs stream4.trs verify1.trs sodium_utils2.trs sodium_utils3.trs core_ed25519.trs pwhash_scrypt.trs pwhash_scrypt_ll.trs scalarmult_ed25519.trs siphashx24.trs xchacha20.trs
  631. test -z "test-suite.log" || rm -f test-suite.log
  632. rm -f *.lo
  633. make[2]: Leaving directory `/svr-setup/libsodium-1.0.17/test/default'
  634. make[2]: Entering directory `/svr-setup/libsodium-1.0.17/test'
  635. rm -rf .libs _libs
  636. rm -f *.lo
  637. make[2]: Leaving directory `/svr-setup/libsodium-1.0.17/test'
  638. make[1]: Leaving directory `/svr-setup/libsodium-1.0.17/test'
  639. make[1]: Entering directory `/svr-setup/libsodium-1.0.17'
  640. rm -rf .libs _libs
  641. rm -f *.lo
  642. make[1]: Leaving directory `/svr-setup/libsodium-1.0.17'
  643. checking build system type... x86_64-pc-linux-gnu
  644. checking host system type... x86_64-pc-linux-gnu
  645. checking for a BSD-compatible install... /bin/install -c
  646. checking whether build environment is sane... yes
  647. checking for a thread-safe mkdir -p... /bin/mkdir -p
  648. checking for gawk... gawk
  649. checking whether make sets $(MAKE)... yes
  650. checking whether make supports nested variables... yes
  651. checking whether UID '0' is supported by ustar format... yes
  652. checking whether GID '0' is supported by ustar format... yes
  653. checking how to create a ustar tar archive... gnutar
  654. checking whether make supports nested variables... (cached) yes
  655. checking whether to enable maintainer-specific portions of Makefiles... no
  656. checking whether make supports the include directive... yes (GNU style)
  657. checking for gcc... ccache gcc
  658. checking whether the C compiler works... yes
  659. checking for C compiler default output file name... a.out
  660. checking for suffix of executables...
  661. checking whether we are cross compiling... no
  662. checking for suffix of object files... o
  663. checking whether we are using the GNU C compiler... yes
  664. checking whether ccache gcc accepts -g... yes
  665. checking for ccache gcc option to accept ISO C89... none needed
  666. checking whether ccache gcc understands -c and -o together... yes
  667. checking dependency style of ccache gcc... gcc3
  668. checking for a sed that does not truncate output... /bin/sed
  669. checking how to run the C preprocessor... ccache gcc -E
  670. checking for grep that handles long lines and -e... /bin/grep
  671. checking for egrep... /bin/grep -E
  672. checking whether ccache gcc is Clang... no
  673. checking whether pthreads work with -pthread... yes
  674. checking for joinable pthread attribute... PTHREAD_CREATE_JOINABLE
  675. checking whether more special flags are required for pthreads... no
  676. checking for PTHREAD_PRIO_INHERIT... yes
  677. checking for ccache gcc option to accept ISO C99... -std=gnu99
  678. checking dependency style of ccache gcc -std=gnu99... gcc3
  679. checking for ANSI C header files... yes
  680. checking for sys/types.h... yes
  681. checking for sys/stat.h... yes
  682. checking for stdlib.h... yes
  683. checking for string.h... yes
  684. checking for memory.h... yes
  685. checking for strings.h... yes
  686. checking for inttypes.h... yes
  687. checking for stdint.h... yes
  688. checking for unistd.h... yes
  689. checking minix/config.h usability... no
  690. checking minix/config.h presence... no
  691. checking for minix/config.h... no
  692. checking whether it is safe to define __EXTENSIONS__... yes
  693. checking for variable-length arrays... yes
  694. checking for __native_client__ defined... no
  695. checking for _FORTIFY_SOURCE defined... no
  696. checking whether C compiler accepts -D_FORTIFY_SOURCE=2... yes
  697. checking whether C compiler accepts -fvisibility=hidden... yes
  698. checking whether C compiler accepts -fPIC... yes
  699. checking whether C compiler accepts -fPIE... yes
  700. checking whether the linker accepts -pie... yes
  701. checking whether C compiler accepts -fno-strict-aliasing... yes
  702. checking whether C compiler accepts -fno-strict-overflow... yes
  703. checking whether C compiler accepts -fstack-protector... yes
  704. checking whether the linker accepts -fstack-protector... yes
  705. checking whether C compiler accepts -g -O2 -pthread -fvisibility=hidden -fPIC -fPIE -fno-strict-aliasing -fno-strict-overflow -fstack-protector -Wall... yes
  706. checking whether C compiler accepts -g -O2 -pthread -fvisibility=hidden -fPIC -fPIE -fno-strict-aliasing -fno-strict-overflow -fstack-protector -Wextra... yes
  707. checking for clang... no
  708. checking whether C compiler accepts -g -O2 -pthread -fvisibility=hidden -fPIC -fPIE -fno-strict-aliasing -fno-strict-overflow -fstack-protector -Wextra -Wbad-function-cast... yes
  709. checking whether C compiler accepts -g -O2 -pthread -fvisibility=hidden -fPIC -fPIE -fno-strict-aliasing -fno-strict-overflow -fstack-protector -Wextra -Wbad-function-cast -Wcast-qual... yes
  710. checking whether C compiler accepts -g -O2 -pthread -fvisibility=hidden -fPIC -fPIE -fno-strict-aliasing -fno-strict-overflow -fstack-protector -Wextra -Wbad-function-cast -Wcast-qual -Wdiv-by-zero... yes
  711. checking whether C compiler accepts -g -O2 -pthread -fvisibility=hidden -fPIC -fPIE -fno-strict-aliasing -fno-strict-overflow -fstack-protector -Wextra -Wbad-function-cast -Wcast-qual -Wdiv-by-zero -Wduplicated-branches... no
  712. checking whether C compiler accepts -g -O2 -pthread -fvisibility=hidden -fPIC -fPIE -fno-strict-aliasing -fno-strict-overflow -fstack-protector -Wextra -Wbad-function-cast -Wcast-qual -Wdiv-by-zero -Wduplicated-cond... no
  713. checking whether C compiler accepts -g -O2 -pthread -fvisibility=hidden -fPIC -fPIE -fno-strict-aliasing -fno-strict-overflow -fstack-protector -Wextra -Wbad-function-cast -Wcast-qual -Wdiv-by-zero -Wfloat-equal... yes
  714. checking whether C compiler accepts -g -O2 -pthread -fvisibility=hidden -fPIC -fPIE -fno-strict-aliasing -fno-strict-overflow -fstack-protector -Wextra -Wbad-function-cast -Wcast-qual -Wdiv-by-zero -Wfloat-equal -Wformat=2... yes
  715. checking whether C compiler accepts -g -O2 -pthread -fvisibility=hidden -fPIC -fPIE -fno-strict-aliasing -fno-strict-overflow -fstack-protector -Wextra -Wbad-function-cast -Wcast-qual -Wdiv-by-zero -Wfloat-equal -Wformat=2 -Wlogical-op... yes
  716. checking whether C compiler accepts -g -O2 -pthread -fvisibility=hidden -fPIC -fPIE -fno-strict-aliasing -fno-strict-overflow -fstack-protector -Wextra -Wbad-function-cast -Wcast-qual -Wdiv-by-zero -Wfloat-equal -Wformat=2 -Wlogical-op -Wmaybe-uninitialized... yes
  717. checking whether C compiler accepts -g -O2 -pthread -fvisibility=hidden -fPIC -fPIE -fno-strict-aliasing -fno-strict-overflow -fstack-protector -Wextra -Wbad-function-cast -Wcast-qual -Wdiv-by-zero -Wfloat-equal -Wformat=2 -Wlogical-op -Wmaybe-uninitialized -Wmisleading-indentation... no
  718. checking whether C compiler accepts -g -O2 -pthread -fvisibility=hidden -fPIC -fPIE -fno-strict-aliasing -fno-strict-overflow -fstack-protector -Wextra -Wbad-function-cast -Wcast-qual -Wdiv-by-zero -Wfloat-equal -Wformat=2 -Wlogical-op -Wmaybe-uninitialized -Wmissing-declarations... yes
  719. checking whether C compiler accepts -g -O2 -pthread -fvisibility=hidden -fPIC -fPIE -fno-strict-aliasing -fno-strict-overflow -fstack-protector -Wextra -Wbad-function-cast -Wcast-qual -Wdiv-by-zero -Wfloat-equal -Wformat=2 -Wlogical-op -Wmaybe-uninitialized -Wmissing-declarations -Wmissing-prototypes... yes
  720. checking whether C compiler accepts -g -O2 -pthread -fvisibility=hidden -fPIC -fPIE -fno-strict-aliasing -fno-strict-overflow -fstack-protector -Wextra -Wbad-function-cast -Wcast-qual -Wdiv-by-zero -Wfloat-equal -Wformat=2 -Wlogical-op -Wmaybe-uninitialized -Wmissing-declarations -Wmissing-prototypes -Wnested-externs... yes
  721. checking whether C compiler accepts -g -O2 -pthread -fvisibility=hidden -fPIC -fPIE -fno-strict-aliasing -fno-strict-overflow -fstack-protector -Wextra -Wbad-function-cast -Wcast-qual -Wdiv-by-zero -Wfloat-equal -Wformat=2 -Wlogical-op -Wmaybe-uninitialized -Wmissing-declarations -Wmissing-prototypes -Wnested-externs -Wno-type-limits... yes
  722. checking whether C compiler accepts -g -O2 -pthread -fvisibility=hidden -fPIC -fPIE -fno-strict-aliasing -fno-strict-overflow -fstack-protector -Wextra -Wbad-function-cast -Wcast-qual -Wdiv-by-zero -Wfloat-equal -Wformat=2 -Wlogical-op -Wmaybe-uninitialized -Wmissing-declarations -Wmissing-prototypes -Wnested-externs -Wno-type-limits -Wno-unknown-pragmas... yes
  723. checking whether C compiler accepts -g -O2 -pthread -fvisibility=hidden -fPIC -fPIE -fno-strict-aliasing -fno-strict-overflow -fstack-protector -Wextra -Wbad-function-cast -Wcast-qual -Wdiv-by-zero -Wfloat-equal -Wformat=2 -Wlogical-op -Wmaybe-uninitialized -Wmissing-declarations -Wmissing-prototypes -Wnested-externs -Wno-type-limits -Wno-unknown-pragmas -Wnormalized=id... yes
  724. checking whether C compiler accepts -g -O2 -pthread -fvisibility=hidden -fPIC -fPIE -fno-strict-aliasing -fno-strict-overflow -fstack-protector -Wextra -Wbad-function-cast -Wcast-qual -Wdiv-by-zero -Wfloat-equal -Wformat=2 -Wlogical-op -Wmaybe-uninitialized -Wmissing-declarations -Wmissing-prototypes -Wnested-externs -Wno-type-limits -Wno-unknown-pragmas -Wnormalized=id -Wnull-dereference... no
  725. checking whether C compiler accepts -g -O2 -pthread -fvisibility=hidden -fPIC -fPIE -fno-strict-aliasing -fno-strict-overflow -fstack-protector -Wextra -Wbad-function-cast -Wcast-qual -Wdiv-by-zero -Wfloat-equal -Wformat=2 -Wlogical-op -Wmaybe-uninitialized -Wmissing-declarations -Wmissing-prototypes -Wnested-externs -Wno-type-limits -Wno-unknown-pragmas -Wnormalized=id -Wold-style-declaration... yes
  726. checking whether C compiler accepts -g -O2 -pthread -fvisibility=hidden -fPIC -fPIE -fno-strict-aliasing -fno-strict-overflow -fstack-protector -Wextra -Wbad-function-cast -Wcast-qual -Wdiv-by-zero -Wfloat-equal -Wformat=2 -Wlogical-op -Wmaybe-uninitialized -Wmissing-declarations -Wmissing-prototypes -Wnested-externs -Wno-type-limits -Wno-unknown-pragmas -Wnormalized=id -Wold-style-declaration -Wpointer-arith... yes
  727. checking whether C compiler accepts -g -O2 -pthread -fvisibility=hidden -fPIC -fPIE -fno-strict-aliasing -fno-strict-overflow -fstack-protector -Wextra -Wbad-function-cast -Wcast-qual -Wdiv-by-zero -Wfloat-equal -Wformat=2 -Wlogical-op -Wmaybe-uninitialized -Wmissing-declarations -Wmissing-prototypes -Wnested-externs -Wno-type-limits -Wno-unknown-pragmas -Wnormalized=id -Wold-style-declaration -Wpointer-arith -Wredundant-decls... yes
  728. checking whether C compiler accepts -g -O2 -pthread -fvisibility=hidden -fPIC -fPIE -fno-strict-aliasing -fno-strict-overflow -fstack-protector -Wextra -Wbad-function-cast -Wcast-qual -Wdiv-by-zero -Wfloat-equal -Wformat=2 -Wlogical-op -Wmaybe-uninitialized -Wmissing-declarations -Wmissing-prototypes -Wnested-externs -Wno-type-limits -Wno-unknown-pragmas -Wnormalized=id -Wold-style-declaration -Wpointer-arith -Wredundant-decls -Wrestrict... no
  729. checking whether C compiler accepts -g -O2 -pthread -fvisibility=hidden -fPIC -fPIE -fno-strict-aliasing -fno-strict-overflow -fstack-protector -Wextra -Wbad-function-cast -Wcast-qual -Wdiv-by-zero -Wfloat-equal -Wformat=2 -Wlogical-op -Wmaybe-uninitialized -Wmissing-declarations -Wmissing-prototypes -Wnested-externs -Wno-type-limits -Wno-unknown-pragmas -Wnormalized=id -Wold-style-declaration -Wpointer-arith -Wredundant-decls -Wshorten-64-to-32... no
  730. checking whether C compiler accepts -g -O2 -pthread -fvisibility=hidden -fPIC -fPIE -fno-strict-aliasing -fno-strict-overflow -fstack-protector -Wextra -Wbad-function-cast -Wcast-qual -Wdiv-by-zero -Wfloat-equal -Wformat=2 -Wlogical-op -Wmaybe-uninitialized -Wmissing-declarations -Wmissing-prototypes -Wnested-externs -Wno-type-limits -Wno-unknown-pragmas -Wnormalized=id -Wold-style-declaration -Wpointer-arith -Wredundant-decls -Wsometimes-uninitialized... no
  731. checking whether C compiler accepts -g -O2 -pthread -fvisibility=hidden -fPIC -fPIE -fno-strict-aliasing -fno-strict-overflow -fstack-protector -Wextra -Wbad-function-cast -Wcast-qual -Wdiv-by-zero -Wfloat-equal -Wformat=2 -Wlogical-op -Wmaybe-uninitialized -Wmissing-declarations -Wmissing-prototypes -Wnested-externs -Wno-type-limits -Wno-unknown-pragmas -Wnormalized=id -Wold-style-declaration -Wpointer-arith -Wredundant-decls -Wstrict-prototypes... yes
  732. checking whether C compiler accepts -g -O2 -pthread -fvisibility=hidden -fPIC -fPIE -fno-strict-aliasing -fno-strict-overflow -fstack-protector -Wextra -Wbad-function-cast -Wcast-qual -Wdiv-by-zero -Wfloat-equal -Wformat=2 -Wlogical-op -Wmaybe-uninitialized -Wmissing-declarations -Wmissing-prototypes -Wnested-externs -Wno-type-limits -Wno-unknown-pragmas -Wnormalized=id -Wold-style-declaration -Wpointer-arith -Wredundant-decls -Wstrict-prototypes -Wswitch-enum... yes
  733. checking whether C compiler accepts -g -O2 -pthread -fvisibility=hidden -fPIC -fPIE -fno-strict-aliasing -fno-strict-overflow -fstack-protector -Wextra -Wbad-function-cast -Wcast-qual -Wdiv-by-zero -Wfloat-equal -Wformat=2 -Wlogical-op -Wmaybe-uninitialized -Wmissing-declarations -Wmissing-prototypes -Wnested-externs -Wno-type-limits -Wno-unknown-pragmas -Wnormalized=id -Wold-style-declaration -Wpointer-arith -Wredundant-decls -Wstrict-prototypes -Wswitch-enum -Wvariable-decl... no
  734. checking whether C compiler accepts -g -O2 -pthread -fvisibility=hidden -fPIC -fPIE -fno-strict-aliasing -fno-strict-overflow -fstack-protector -Wextra -Wbad-function-cast -Wcast-qual -Wdiv-by-zero -Wfloat-equal -Wformat=2 -Wlogical-op -Wmaybe-uninitialized -Wmissing-declarations -Wmissing-prototypes -Wnested-externs -Wno-type-limits -Wno-unknown-pragmas -Wnormalized=id -Wold-style-declaration -Wpointer-arith -Wredundant-decls -Wstrict-prototypes -Wswitch-enum -Wwrite-strings... yes
  735. checking whether the linker accepts -Wl,-z,relro... yes
  736. checking whether the linker accepts -Wl,-z,now... yes
  737. checking whether the linker accepts -Wl,-z,noexecstack... yes
  738. checking whether segmentation violations can be caught when using the C compiler... yes
  739. checking whether SIGABRT can be caught when using the C compiler... yes
  740. checking for thread local storage (TLS) class... __thread
  741. thread local storage is supported
  742. checking whether C compiler accepts -ftls-model=local-dynamic... yes
  743. checking how to print strings... printf
  744. checking for a sed that does not truncate output... (cached) /bin/sed
  745. checking for fgrep... /bin/grep -F
  746. checking for ld used by ccache gcc -std=gnu99... /bin/ld
  747. checking if the linker (/bin/ld) is GNU ld... yes
  748. checking for BSD- or MS-compatible name lister (nm)... /bin/nm -B
  749. checking the name lister (/bin/nm -B) interface... BSD nm
  750. checking whether ln -s works... yes
  751. checking the maximum length of command line arguments... 1572864
  752. checking how to convert x86_64-pc-linux-gnu file names to x86_64-pc-linux-gnu format... func_convert_file_noop
  753. checking how to convert x86_64-pc-linux-gnu file names to toolchain format... func_convert_file_noop
  754. checking for /bin/ld option to reload object files... -r
  755. checking for objdump... objdump
  756. checking how to recognize dependent libraries... pass_all
  757. checking for dlltool... no
  758. checking how to associate runtime and link libraries... printf %s\n
  759. checking for ar... ar
  760. checking for archiver @FILE support... @
  761. checking for strip... strip
  762. checking for ranlib... ranlib
  763. checking command to parse /bin/nm -B output from ccache gcc -std=gnu99 object... ok
  764. checking for sysroot... no
  765. checking for a working dd... /bin/dd
  766. checking how to truncate binary pipes... /bin/dd bs=4096 count=1
  767. checking for mt... no
  768. checking if : is a manifest tool... no
  769. checking for dlfcn.h... yes
  770. checking for objdir... .libs
  771. checking if ccache gcc -std=gnu99 supports -fno-rtti -fno-exceptions... no
  772. checking for ccache gcc -std=gnu99 option to produce PIC... -fPIC -DPIC
  773. checking if ccache gcc -std=gnu99 PIC flag -fPIC -DPIC works... yes
  774. checking if ccache gcc -std=gnu99 static flag -static works... no
  775. checking if ccache gcc -std=gnu99 supports -c -o file.o... yes
  776. checking if ccache gcc -std=gnu99 supports -c -o file.o... (cached) yes
  777. checking whether the ccache gcc -std=gnu99 linker (/bin/ld -m elf_x86_64) supports shared libraries... yes
  778. checking whether -lc should be explicitly linked in... no
  779. checking dynamic linker characteristics... GNU/Linux ld.so
  780. checking how to hardcode library paths into programs... immediate
  781. checking whether stripping libraries is possible... yes
  782. checking if libtool supports shared libraries... yes
  783. checking whether to build shared libraries... yes
  784. checking whether to build static libraries... yes
  785. checking for ar... (cached) ar
  786. checking whether C compiler accepts -mmmx... yes
  787. checking for MMX instructions set... yes
  788. checking whether C compiler accepts -mmmx... (cached) yes
  789. checking whether C compiler accepts -msse2... yes
  790. checking for SSE2 instructions set... yes
  791. checking whether C compiler accepts -msse2... (cached) yes
  792. checking whether C compiler accepts -msse3... yes
  793. checking for SSE3 instructions set... yes
  794. checking whether C compiler accepts -msse3... (cached) yes
  795. checking whether C compiler accepts -mssse3... yes
  796. checking for SSSE3 instructions set... yes
  797. checking whether C compiler accepts -mssse3... (cached) yes
  798. checking whether C compiler accepts -msse4.1... yes
  799. checking for SSE4.1 instructions set... yes
  800. checking whether C compiler accepts -msse4.1... (cached) yes
  801. checking whether C compiler accepts -mavx... yes
  802. checking for AVX instructions set... yes
  803. checking whether C compiler accepts -mavx... (cached) yes
  804. checking whether C compiler accepts -mavx2... yes
  805. checking for AVX2 instructions set... yes
  806. checking whether C compiler accepts -mavx2... (cached) yes
  807. checking if _mm256_broadcastsi128_si256 is correctly defined... yes
  808. checking whether C compiler accepts -mavx512f... no
  809. checking for AVX512F instructions set... no
  810. checking whether C compiler accepts -g -O2 -pthread -fvisibility=hidden -fPIC -fPIE -fno-strict-aliasing -fno-strict-overflow -fstack-protector -ftls-model=local-dynamic -mno-avx512f... no
  811. checking whether C compiler accepts -maes... yes
  812. checking whether C compiler accepts -mpclmul... yes
  813. checking for AESNI instructions set and PCLMULQDQ... yes
  814. checking whether C compiler accepts -maes... (cached) yes
  815. checking whether C compiler accepts -mpclmul... (cached) yes
  816. checking whether C compiler accepts -mrdrnd... yes
  817. checking for RDRAND... yes
  818. checking whether C compiler accepts -mrdrnd... (cached) yes
  819. checking sys/mman.h usability... yes
  820. checking sys/mman.h presence... yes
  821. checking for sys/mman.h... yes
  822. checking intrin.h usability... no
  823. checking intrin.h presence... no
  824. checking for intrin.h... no
  825. checking if _xgetbv() is available... no
  826. checking for inline... inline
  827. checking whether byte ordering is bigendian... (cached) no
  828. checking whether __STDC_LIMIT_MACROS is required... no
  829. checking whether we can use inline asm code... yes
  830. no
  831. checking whether we can use x86_64 asm code... yes
  832. checking whether we can assemble AVX opcodes... yes
  833. checking for 128-bit arithmetic... yes
  834. checking for cpuid instruction... yes
  835. checking if the .private_extern asm directive is supported... no
  836. checking if the .hidden asm directive is supported... yes
  837. checking if weak symbols are supported... yes
  838. checking if data alignment is required... no
  839. checking if atomic operations are supported... yes
  840. checking for size_t... yes
  841. checking for working alloca.h... yes
  842. checking for alloca... yes
  843. checking for arc4random... no
  844. checking for arc4random_buf... no
  845. checking for mmap... yes
  846. checking for mlock... yes
  847. checking for madvise... yes
  848. checking for mprotect... yes
  849. checking for memset_s... no
  850. checking for explicit_bzero... no
  851. checking for explicit_memset... no
  852. checking for nanosleep... yes
  853. checking for posix_memalign... yes
  854. checking for getpid... yes
  855. checking if gcc/ld supports -Wl,--output-def... no
  856. checking that generated files are newer than configure... done
  857. configure: creating ./config.status
  858. config.status: creating Makefile
  859. config.status: creating builds/Makefile
  860. config.status: creating contrib/Makefile
  861. config.status: creating dist-build/Makefile
  862. config.status: creating libsodium.pc
  863. config.status: creating libsodium-uninstalled.pc
  864. config.status: creating msvc-scripts/Makefile
  865. config.status: creating src/Makefile
  866. config.status: creating src/libsodium/Makefile
  867. config.status: creating src/libsodium/include/Makefile
  868. config.status: creating src/libsodium/include/sodium/version.h
  869. config.status: creating test/default/Makefile
  870. config.status: creating test/Makefile
  871. config.status: executing depfiles commands
  872. config.status: executing libtool commands
  873. Making all in builds
  874. make[1]: Entering directory `/svr-setup/libsodium-1.0.17/builds'
  875. make[1]: Nothing to be done for `all'.
  876. make[1]: Leaving directory `/svr-setup/libsodium-1.0.17/builds'
  877. Making all in contrib
  878. make[1]: Entering directory `/svr-setup/libsodium-1.0.17/contrib'
  879. make[1]: Nothing to be done for `all'.
  880. make[1]: Leaving directory `/svr-setup/libsodium-1.0.17/contrib'
  881. Making all in dist-build
  882. make[1]: Entering directory `/svr-setup/libsodium-1.0.17/dist-build'
  883. make[1]: Nothing to be done for `all'.
  884. make[1]: Leaving directory `/svr-setup/libsodium-1.0.17/dist-build'
  885. Making all in msvc-scripts
  886. make[1]: Entering directory `/svr-setup/libsodium-1.0.17/msvc-scripts'
  887. make[1]: Nothing to be done for `all'.
  888. make[1]: Leaving directory `/svr-setup/libsodium-1.0.17/msvc-scripts'
  889. Making all in src
  890. make[1]: Entering directory `/svr-setup/libsodium-1.0.17/src'
  891. Making all in libsodium
  892. make[2]: Entering directory `/svr-setup/libsodium-1.0.17/src/libsodium'
  893. Making all in include
  894. make[3]: Entering directory `/svr-setup/libsodium-1.0.17/src/libsodium/include'
  895. make[3]: Nothing to be done for `all'.
  896. make[3]: Leaving directory `/svr-setup/libsodium-1.0.17/src/libsodium/include'
  897. make[3]: Entering directory `/svr-setup/libsodium-1.0.17/src/libsodium'
  898.  CC       crypto_aead/chacha20poly1305/sodium/libsodium_la-aead_chacha20poly1305.lo
  899.  CC       crypto_aead/xchacha20poly1305/sodium/libsodium_la-aead_xchacha20poly1305.lo
  900.  CC       crypto_auth/libsodium_la-crypto_auth.lo
  901.  CC       crypto_auth/hmacsha256/libsodium_la-auth_hmacsha256.lo
  902.  CC       crypto_auth/hmacsha512/libsodium_la-auth_hmacsha512.lo
  903.  CC       crypto_auth/hmacsha512256/libsodium_la-auth_hmacsha512256.lo
  904.  CC       crypto_box/libsodium_la-crypto_box.lo
  905.  CC       crypto_box/libsodium_la-crypto_box_easy.lo
  906.  CC       crypto_box/libsodium_la-crypto_box_seal.lo
  907.  CC       crypto_box/curve25519xsalsa20poly1305/libsodium_la-box_curve25519xsalsa20poly1305.lo
  908.  CC       crypto_core/ed25519/ref10/libsodium_la-ed25519_ref10.lo
  909.  CC       crypto_core/hchacha20/libsodium_la-core_hchacha20.lo
  910.  CC       crypto_core/hsalsa20/ref2/libsodium_la-core_hsalsa20_ref2.lo
  911.  CC       crypto_core/hsalsa20/libsodium_la-core_hsalsa20.lo
  912.  CC       crypto_core/salsa/ref/libsodium_la-core_salsa_ref.lo
  913.  CC       crypto_generichash/libsodium_la-crypto_generichash.lo
  914.  CC       crypto_generichash/blake2b/libsodium_la-generichash_blake2.lo
  915.  CC       crypto_generichash/blake2b/ref/libsodium_la-blake2b-compress-ref.lo
  916.  CC       crypto_generichash/blake2b/ref/libsodium_la-blake2b-ref.lo
  917.  CC       crypto_generichash/blake2b/ref/libsodium_la-generichash_blake2b.lo
  918.  CC       crypto_hash/libsodium_la-crypto_hash.lo
  919.  CC       crypto_hash/sha256/libsodium_la-hash_sha256.lo
  920.  CC       crypto_hash/sha256/cp/libsodium_la-hash_sha256_cp.lo
  921.  CC       crypto_hash/sha512/libsodium_la-hash_sha512.lo
  922.  CC       crypto_hash/sha512/cp/libsodium_la-hash_sha512_cp.lo
  923.  CC       crypto_kdf/blake2b/libsodium_la-kdf_blake2b.lo
  924.  CC       crypto_kdf/libsodium_la-crypto_kdf.lo
  925.  CC       crypto_kx/libsodium_la-crypto_kx.lo
  926.  CC       crypto_onetimeauth/libsodium_la-crypto_onetimeauth.lo
  927.  CC       crypto_onetimeauth/poly1305/libsodium_la-onetimeauth_poly1305.lo
  928.  CC       crypto_onetimeauth/poly1305/donna/libsodium_la-poly1305_donna.lo
  929.  CC       crypto_pwhash/argon2/libsodium_la-argon2-core.lo
  930.  CC       crypto_pwhash/argon2/libsodium_la-argon2-encoding.lo
  931.  CC       crypto_pwhash/argon2/libsodium_la-argon2-fill-block-ref.lo
  932.  CC       crypto_pwhash/argon2/libsodium_la-argon2.lo
  933.  CC       crypto_pwhash/argon2/libsodium_la-blake2b-long.lo
  934.  CC       crypto_pwhash/argon2/libsodium_la-pwhash_argon2i.lo
  935.  CC       crypto_pwhash/argon2/libsodium_la-pwhash_argon2id.lo
  936.  CC       crypto_pwhash/libsodium_la-crypto_pwhash.lo
  937.  CC       crypto_scalarmult/libsodium_la-crypto_scalarmult.lo
  938.  CC       crypto_scalarmult/curve25519/ref10/libsodium_la-x25519_ref10.lo
  939.  CC       crypto_scalarmult/curve25519/libsodium_la-scalarmult_curve25519.lo
  940.  CC       crypto_secretbox/libsodium_la-crypto_secretbox.lo
  941.  CC       crypto_secretbox/libsodium_la-crypto_secretbox_easy.lo
  942.  CC       crypto_secretbox/xsalsa20poly1305/libsodium_la-secretbox_xsalsa20poly1305.lo
  943.  CC       crypto_secretstream/xchacha20poly1305/libsodium_la-secretstream_xchacha20poly1305.lo
  944.  CC       crypto_shorthash/libsodium_la-crypto_shorthash.lo
  945.  CC       crypto_shorthash/siphash24/libsodium_la-shorthash_siphash24.lo
  946.  CC       crypto_shorthash/siphash24/ref/libsodium_la-shorthash_siphash24_ref.lo
  947.  CC       crypto_sign/libsodium_la-crypto_sign.lo
  948.  CC       crypto_sign/ed25519/libsodium_la-sign_ed25519.lo
  949.  CC       crypto_sign/ed25519/ref10/libsodium_la-keypair.lo
  950.  CC       crypto_sign/ed25519/ref10/libsodium_la-open.lo
  951.  CC       crypto_sign/ed25519/ref10/libsodium_la-sign.lo
  952.  CC       crypto_stream/chacha20/libsodium_la-stream_chacha20.lo
  953.  CC       crypto_stream/chacha20/ref/libsodium_la-chacha20_ref.lo
  954.  CC       crypto_stream/libsodium_la-crypto_stream.lo
  955.  CC       crypto_stream/salsa20/libsodium_la-stream_salsa20.lo
  956.  CC       crypto_stream/xsalsa20/libsodium_la-stream_xsalsa20.lo
  957.  CC       crypto_verify/sodium/libsodium_la-verify.lo
  958.  CC       randombytes/libsodium_la-randombytes.lo
  959.  CC       sodium/libsodium_la-codecs.lo
  960.  CC       sodium/libsodium_la-core.lo
  961.  CC       sodium/libsodium_la-runtime.lo
  962.  CC       sodium/libsodium_la-utils.lo
  963.  CC       sodium/libsodium_la-version.lo
  964.  CPPAS    crypto_stream/salsa20/xmm6/libsodium_la-salsa20_xmm6-asm.lo
  965.  CC       crypto_stream/salsa20/xmm6/libsodium_la-salsa20_xmm6.lo
  966.  CC       crypto_scalarmult/curve25519/sandy2x/libsodium_la-curve25519_sandy2x.lo
  967.  CC       crypto_scalarmult/curve25519/sandy2x/libsodium_la-fe51_invert.lo
  968.  CC       crypto_scalarmult/curve25519/sandy2x/libsodium_la-fe_frombytes_sandy2x.lo
  969.  CPPAS    crypto_scalarmult/curve25519/sandy2x/libsodium_la-sandy2x.lo
  970.  CC       crypto_box/curve25519xchacha20poly1305/libsodium_la-box_curve25519xchacha20poly1305.lo
  971.  CC       crypto_box/curve25519xchacha20poly1305/libsodium_la-box_seal_curve25519xchacha20poly1305.lo
  972.  CC       crypto_core/ed25519/libsodium_la-core_ed25519.lo
  973.  CC       crypto_pwhash/scryptsalsa208sha256/libsodium_la-crypto_scrypt-common.lo
  974.  CC       crypto_pwhash/scryptsalsa208sha256/libsodium_la-scrypt_platform.lo
  975.  CC       crypto_pwhash/scryptsalsa208sha256/libsodium_la-pbkdf2-sha256.lo
  976.  CC       crypto_pwhash/scryptsalsa208sha256/libsodium_la-pwhash_scryptsalsa208sha256.lo
  977.  CC       crypto_pwhash/scryptsalsa208sha256/nosse/libsodium_la-pwhash_scryptsalsa208sha256_nosse.lo
  978.  CC       crypto_scalarmult/ed25519/ref10/libsodium_la-scalarmult_ed25519_ref10.lo
  979.  CC       crypto_secretbox/xchacha20poly1305/libsodium_la-secretbox_xchacha20poly1305.lo
  980.  CC       crypto_shorthash/siphash24/libsodium_la-shorthash_siphashx24.lo
  981.  CC       crypto_shorthash/siphash24/ref/libsodium_la-shorthash_siphashx24_ref.lo
  982.  CC       crypto_sign/ed25519/ref10/libsodium_la-obsolete.lo
  983.  CC       crypto_stream/salsa2012/ref/libsodium_la-stream_salsa2012_ref.lo
  984.  CC       crypto_stream/salsa2012/libsodium_la-stream_salsa2012.lo
  985.  CC       crypto_stream/salsa208/ref/libsodium_la-stream_salsa208_ref.lo
  986.  CC       crypto_stream/salsa208/libsodium_la-stream_salsa208.lo
  987.  CC       crypto_stream/xchacha20/libsodium_la-stream_xchacha20.lo
  988.  CC       randombytes/sysrandom/libsodium_la-randombytes_sysrandom.lo
  989.  CC       crypto_aead/aes256gcm/aesni/libaesni_la-aead_aes256gcm_aesni.lo
  990.  CC       crypto_onetimeauth/poly1305/sse2/libsse2_la-poly1305_sse2.lo
  991.  CC       crypto_pwhash/scryptsalsa208sha256/sse/libsse2_la-pwhash_scryptsalsa208sha256_sse.lo
  992.  CC       crypto_generichash/blake2b/ref/libssse3_la-blake2b-compress-ssse3.lo
  993.  CC       crypto_pwhash/argon2/libssse3_la-argon2-fill-block-ssse3.lo
  994.  CC       crypto_stream/chacha20/dolbeau/libssse3_la-chacha20_dolbeau-ssse3.lo
  995.  CC       crypto_generichash/blake2b/ref/libsse41_la-blake2b-compress-sse41.lo
  996.  CC       crypto_generichash/blake2b/ref/libavx2_la-blake2b-compress-avx2.lo
  997.  CC       crypto_pwhash/argon2/libavx2_la-argon2-fill-block-avx2.lo
  998.  CC       crypto_stream/chacha20/dolbeau/libavx2_la-chacha20_dolbeau-avx2.lo
  999.  CC       crypto_stream/salsa20/xmm6int/libavx2_la-salsa20_xmm6int-avx2.lo
  1000.  CC       crypto_pwhash/argon2/libavx512f_la-argon2-fill-block-avx512f.lo
  1001.  CC       randombytes/salsa20/librdrand_la-randombytes_salsa20_random.lo
  1002.  CCLD     libaesni.la
  1003. libtool: warning: '-version-info/-version-number' is ignored for convenience libraries
  1004.  CCLD     libsse2.la
  1005. libtool: warning: '-version-info/-version-number' is ignored for convenience libraries
  1006.  CCLD     libssse3.la
  1007.  CCLD     libsse41.la
  1008. libtool: warning: '-version-info/-version-number' is ignored for convenience libraries
  1009.  CCLD     libavx2.la
  1010. libtool: warning: '-version-info/-version-number' is ignored for convenience libraries
  1011.  CCLD     libavx512f.la
  1012. libtool: warning: '-version-info/-version-number' is ignored for convenience libraries
  1013.  CCLD     librdrand.la
  1014. libtool: warning: '-version-info/-version-number' is ignored for convenience libraries
  1015. libtool: warning: '-version-info/-version-number' is ignored for convenience libraries
  1016.  CCLD     libsodium.la
  1017. make[3]: Leaving directory `/svr-setup/libsodium-1.0.17/src/libsodium'
  1018. make[2]: Leaving directory `/svr-setup/libsodium-1.0.17/src/libsodium'
  1019. make[2]: Entering directory `/svr-setup/libsodium-1.0.17/src'
  1020. make[2]: Nothing to be done for `all-am'.
  1021. make[2]: Leaving directory `/svr-setup/libsodium-1.0.17/src'
  1022. make[1]: Leaving directory `/svr-setup/libsodium-1.0.17/src'
  1023. Making all in test
  1024. make[1]: Entering directory `/svr-setup/libsodium-1.0.17/test'
  1025. Making all in default
  1026. make[2]: Entering directory `/svr-setup/libsodium-1.0.17/test/default'
  1027. make[2]: Nothing to be done for `all'.
  1028. make[2]: Leaving directory `/svr-setup/libsodium-1.0.17/test/default'
  1029. make[2]: Entering directory `/svr-setup/libsodium-1.0.17/test'
  1030. make[2]: Nothing to be done for `all-am'.
  1031. make[2]: Leaving directory `/svr-setup/libsodium-1.0.17/test'
  1032. make[1]: Leaving directory `/svr-setup/libsodium-1.0.17/test'
  1033. make[1]: Entering directory `/svr-setup/libsodium-1.0.17'
  1034. make[1]: Nothing to be done for `all-am'.
  1035. make[1]: Leaving directory `/svr-setup/libsodium-1.0.17'
  1036. Making install in builds
  1037. make[1]: Entering directory `/svr-setup/libsodium-1.0.17/builds'
  1038. make[2]: Entering directory `/svr-setup/libsodium-1.0.17/builds'
  1039. make[2]: Nothing to be done for `install-exec-am'.
  1040. make[2]: Nothing to be done for `install-data-am'.
  1041. make[2]: Leaving directory `/svr-setup/libsodium-1.0.17/builds'
  1042. make[1]: Leaving directory `/svr-setup/libsodium-1.0.17/builds'
  1043. Making install in contrib
  1044. make[1]: Entering directory `/svr-setup/libsodium-1.0.17/contrib'
  1045. make[2]: Entering directory `/svr-setup/libsodium-1.0.17/contrib'
  1046. make[2]: Nothing to be done for `install-exec-am'.
  1047. make[2]: Nothing to be done for `install-data-am'.
  1048. make[2]: Leaving directory `/svr-setup/libsodium-1.0.17/contrib'
  1049. make[1]: Leaving directory `/svr-setup/libsodium-1.0.17/contrib'
  1050. Making install in dist-build
  1051. make[1]: Entering directory `/svr-setup/libsodium-1.0.17/dist-build'
  1052. make[2]: Entering directory `/svr-setup/libsodium-1.0.17/dist-build'
  1053. make[2]: Nothing to be done for `install-exec-am'.
  1054. make[2]: Nothing to be done for `install-data-am'.
  1055. make[2]: Leaving directory `/svr-setup/libsodium-1.0.17/dist-build'
  1056. make[1]: Leaving directory `/svr-setup/libsodium-1.0.17/dist-build'
  1057. Making install in msvc-scripts
  1058. make[1]: Entering directory `/svr-setup/libsodium-1.0.17/msvc-scripts'
  1059. make[2]: Entering directory `/svr-setup/libsodium-1.0.17/msvc-scripts'
  1060. make[2]: Nothing to be done for `install-exec-am'.
  1061. make[2]: Nothing to be done for `install-data-am'.
  1062. make[2]: Leaving directory `/svr-setup/libsodium-1.0.17/msvc-scripts'
  1063. make[1]: Leaving directory `/svr-setup/libsodium-1.0.17/msvc-scripts'
  1064. Making install in src
  1065. make[1]: Entering directory `/svr-setup/libsodium-1.0.17/src'
  1066. Making install in libsodium
  1067. make[2]: Entering directory `/svr-setup/libsodium-1.0.17/src/libsodium'
  1068. Making install in include
  1069. make[3]: Entering directory `/svr-setup/libsodium-1.0.17/src/libsodium/include'
  1070. make[4]: Entering directory `/svr-setup/libsodium-1.0.17/src/libsodium/include'
  1071. make[4]: Nothing to be done for `install-exec-am'.
  1072. /bin/mkdir -p '/usr/local/include'
  1073. /bin/mkdir -p '/usr/local/include/sodium'
  1074. /bin/install -c -m 644  sodium/core.h sodium/crypto_aead_aes256gcm.h sodium/crypto_aead_chacha20poly1305.h sodium/crypto_aead_xchacha20poly1305.h sodium/crypto_auth.h sodium/crypto_auth_hmacsha256.h sodium/crypto_auth_hmacsha512.h sodium/crypto_auth_hmacsha512256.h sodium/crypto_box.h sodium/crypto_box_curve25519xchacha20poly1305.h sodium/crypto_box_curve25519xsalsa20poly1305.h sodium/crypto_core_ed25519.h sodium/crypto_core_hchacha20.h sodium/crypto_core_hsalsa20.h sodium/crypto_core_salsa20.h sodium/crypto_core_salsa2012.h sodium/crypto_core_salsa208.h sodium/crypto_generichash.h sodium/crypto_generichash_blake2b.h sodium/crypto_hash.h sodium/crypto_hash_sha256.h sodium/crypto_hash_sha512.h sodium/crypto_kdf.h sodium/crypto_kdf_blake2b.h sodium/crypto_kx.h sodium/crypto_onetimeauth.h sodium/crypto_onetimeauth_poly1305.h sodium/crypto_pwhash.h sodium/crypto_pwhash_argon2i.h sodium/crypto_pwhash_argon2id.h sodium/crypto_pwhash_scryptsalsa208sha256.h sodium/crypto_scalarmult.h sodium/crypto_scalarmult_curve25519.h sodium/crypto_scalarmult_ed25519.h sodium/crypto_secretbox.h sodium/crypto_secretbox_xchacha20poly1305.h sodium/crypto_secretbox_xsalsa20poly1305.h sodium/crypto_secretstream_xchacha20poly1305.h sodium/crypto_shorthash.h sodium/crypto_shorthash_siphash24.h '/usr/local/include/sodium'
  1075. /bin/mkdir -p '/usr/local/include/sodium'
  1076. /bin/install -c -m 644  sodium/crypto_sign.h sodium/crypto_sign_ed25519.h sodium/crypto_sign_edwards25519sha512batch.h sodium/crypto_stream.h sodium/crypto_stream_chacha20.h sodium/crypto_stream_salsa20.h sodium/crypto_stream_salsa2012.h sodium/crypto_stream_salsa208.h sodium/crypto_stream_xchacha20.h sodium/crypto_stream_xsalsa20.h sodium/crypto_verify_16.h sodium/crypto_verify_32.h sodium/crypto_verify_64.h sodium/export.h sodium/randombytes.h sodium/randombytes_salsa20_random.h sodium/randombytes_sysrandom.h sodium/runtime.h sodium/utils.h '/usr/local/include/sodium'
  1077. /bin/install -c -m 644  sodium.h '/usr/local/include/.'
  1078. /bin/mkdir -p '/usr/local/include'
  1079. /bin/mkdir -p '/usr/local/include/sodium'
  1080. /bin/install -c -m 644  sodium/version.h '/usr/local/include/sodium'
  1081. make[4]: Leaving directory `/svr-setup/libsodium-1.0.17/src/libsodium/include'
  1082. make[3]: Leaving directory `/svr-setup/libsodium-1.0.17/src/libsodium/include'
  1083. make[3]: Entering directory `/svr-setup/libsodium-1.0.17/src/libsodium'
  1084. make[4]: Entering directory `/svr-setup/libsodium-1.0.17/src/libsodium'
  1085. /bin/mkdir -p '/usr/local/lib64'
  1086. /bin/sh ../../libtool   --mode=install /bin/install -c   libsodium.la '/usr/local/lib64'
  1087. libtool: install: /bin/install -c .libs/libsodium.so.23.2.0 /usr/local/lib64/libsodium.so.23.2.0
  1088. libtool: install: (cd /usr/local/lib64 && { ln -s -f libsodium.so.23.2.0 libsodium.so.23 || { rm -f libsodium.so.23 && ln -s libsodium.so.23.2.0 libsodium.so.23; }; })
  1089. libtool: install: (cd /usr/local/lib64 && { ln -s -f libsodium.so.23.2.0 libsodium.so || { rm -f libsodium.so && ln -s libsodium.so.23.2.0 libsodium.so; }; })
  1090. libtool: install: /bin/install -c .libs/libsodium.lai /usr/local/lib64/libsodium.la
  1091. libtool: install: /bin/install -c .libs/libsodium.a /usr/local/lib64/libsodium.a
  1092. libtool: install: chmod 644 /usr/local/lib64/libsodium.a
  1093. libtool: install: ranlib /usr/local/lib64/libsodium.a
  1094. libtool: finish: PATH="/usr/local/sbin:/usr/local/bin:/sbin:/bin:/usr/sbin:/usr/bin:/root/bin:/sbin" ldconfig -n /usr/local/lib64
  1095. ----------------------------------------------------------------------
  1096. Libraries have been installed in:
  1097.   /usr/local/lib64
  1098.  
  1099. If you ever happen to want to link against installed libraries
  1100. in a given directory, LIBDIR, you must either use libtool, and
  1101. specify the full pathname of the library, or use the '-LLIBDIR'
  1102. flag during linking and do at least one of the following:
  1103.   - add LIBDIR to the 'LD_LIBRARY_PATH' environment variable
  1104.     during execution
  1105.   - add LIBDIR to the 'LD_RUN_PATH' environment variable
  1106.     during linking
  1107.   - use the '-Wl,-rpath -Wl,LIBDIR' linker flag
  1108.   - have your system administrator add LIBDIR to '/etc/ld.so.conf'
  1109.  
  1110. See any operating system documentation about shared libraries for
  1111. more information, such as the ld(1) and ld.so(8) manual pages.
  1112. ----------------------------------------------------------------------
  1113. make[4]: Nothing to be done for `install-data-am'.
  1114. make[4]: Leaving directory `/svr-setup/libsodium-1.0.17/src/libsodium'
  1115. make[3]: Leaving directory `/svr-setup/libsodium-1.0.17/src/libsodium'
  1116. make[2]: Leaving directory `/svr-setup/libsodium-1.0.17/src/libsodium'
  1117. make[2]: Entering directory `/svr-setup/libsodium-1.0.17/src'
  1118. make[3]: Entering directory `/svr-setup/libsodium-1.0.17/src'
  1119. make[3]: Nothing to be done for `install-exec-am'.
  1120. make[3]: Nothing to be done for `install-data-am'.
  1121. make[3]: Leaving directory `/svr-setup/libsodium-1.0.17/src'
  1122. make[2]: Leaving directory `/svr-setup/libsodium-1.0.17/src'
  1123. make[1]: Leaving directory `/svr-setup/libsodium-1.0.17/src'
  1124. Making install in test
  1125. make[1]: Entering directory `/svr-setup/libsodium-1.0.17/test'
  1126. Making install in default
  1127. make[2]: Entering directory `/svr-setup/libsodium-1.0.17/test/default'
  1128. make[3]: Entering directory `/svr-setup/libsodium-1.0.17/test/default'
  1129. make[3]: Nothing to be done for `install-exec-am'.
  1130. make[3]: Nothing to be done for `install-data-am'.
  1131. make[3]: Leaving directory `/svr-setup/libsodium-1.0.17/test/default'
  1132. make[2]: Leaving directory `/svr-setup/libsodium-1.0.17/test/default'
  1133. make[2]: Entering directory `/svr-setup/libsodium-1.0.17/test'
  1134. make[3]: Entering directory `/svr-setup/libsodium-1.0.17/test'
  1135. make[3]: Nothing to be done for `install-exec-am'.
  1136. make[3]: Nothing to be done for `install-data-am'.
  1137. make[3]: Leaving directory `/svr-setup/libsodium-1.0.17/test'
  1138. make[2]: Leaving directory `/svr-setup/libsodium-1.0.17/test'
  1139. make[1]: Leaving directory `/svr-setup/libsodium-1.0.17/test'
  1140. make[1]: Entering directory `/svr-setup/libsodium-1.0.17'
  1141. make[2]: Entering directory `/svr-setup/libsodium-1.0.17'
  1142. make[2]: Nothing to be done for `install-exec-am'.
  1143. /bin/mkdir -p '/usr/local/lib64/pkgconfig'
  1144. /bin/install -c -m 644 libsodium.pc '/usr/local/lib64/pkgconfig'
  1145. make[2]: Leaving directory `/svr-setup/libsodium-1.0.17'
  1146. make[1]: Leaving directory `/svr-setup/libsodium-1.0.17'
  1147. /svr-setup/php-7.3.2/fpm-build
  1148. /svr-setup /svr-setup/php-7.3.2/fpm-build
  1149. 20171227.tar.gz found, skipping download...
  1150. Building with optimizations for native
  1151. rm -f argon2 bench genkat
  1152. rm -f libargon2.so.1 libargon2.a kat-argon2*
  1153. rm -f testcase
  1154. rm -rf *.dSYM
  1155. cd src/ && rm -f *.o
  1156. cd src/blake2/ && rm -f *.o
  1157. cd kats/ &&  rm -f kat-* diff* run_* make_*
  1158. Building with optimizations for native
  1159. ccache gcc -std=c89 -O3 -Wall -g -Iinclude -Isrc -pthread -march=native  src/argon2.c src/core.c src/blake2/blake2b.c src/thread.c src/encoding.c src/opt.c src/run.c -o argon2
  1160. ccache gcc -std=c89 -O3 -Wall -g -Iinclude -Isrc -pthread -march=native -shared -fPIC -fvisibility=hidden -DA2_VISCTL=1  -Wl,-soname,libargon2.so.1 src/argon2.c src/core.c src/blake2/blake2b.c src/thread.c src/encoding.c src/opt.c -o libargon2.so.1
  1161. ccache gcc -std=c89 -O3 -Wall -g -Iinclude -Isrc -pthread -march=native   -c -o src/argon2.o src/argon2.c
  1162. ccache gcc -std=c89 -O3 -Wall -g -Iinclude -Isrc -pthread -march=native   -c -o src/core.o src/core.c
  1163. ccache gcc -std=c89 -O3 -Wall -g -Iinclude -Isrc -pthread -march=native   -c -o src/blake2/blake2b.o src/blake2/blake2b.c
  1164. ccache gcc -std=c89 -O3 -Wall -g -Iinclude -Isrc -pthread -march=native   -c -o src/thread.o src/thread.c
  1165. ccache gcc -std=c89 -O3 -Wall -g -Iinclude -Isrc -pthread -march=native   -c -o src/encoding.o src/encoding.c
  1166. ccache gcc -std=c89 -O3 -Wall -g -Iinclude -Isrc -pthread -march=native   -c -o src/opt.o src/opt.c
  1167. ar rcs libargon2.a src/argon2.o src/core.o src/blake2/blake2b.o src/thread.o src/encoding.o src/opt.o
  1168. Building with optimizations for native
  1169. install -d /usr/local/include
  1170. install -m 0644 include/argon2.h /usr/local/include
  1171. install -d /usr/local/lib64
  1172. install libargon2.so.1 libargon2.a /usr/local/lib64
  1173. cd /usr/local/lib64 && ln -s libargon2.so.1 libargon2.so
  1174. install -d /usr/local/bin
  1175. install argon2 /usr/local/bin
  1176. /svr-setup/php-7.3.2/fpm-build
  1177. NEWLIBICU=n
  1178. /opt/rh/devtoolset-8/root/usr/bin/gcc
  1179. /opt/rh/devtoolset-8/root/usr/bin/g++
  1180. centos 7 set devtoolset-8
  1181. ccache /opt/rh/devtoolset-8/root/usr/bin/gcc
  1182. ccache /opt/rh/devtoolset-8/root/usr/bin/g++
  1183. gcc (GCC) 8.2.1 20180905 (Red Hat 8.2.1-3)
  1184. Copyright (C) 2018 Free Software Foundation, Inc.
  1185. This is free software; see the source for copying conditions.  There is NO
  1186. warranty; not even for MERCHANTABILITY or FITNESS FOR A PARTICULAR PURPOSE.
  1187.  
  1188.  -m128bit-long-double                  [enabled]
  1189.  -m64                                  [enabled]
  1190.  -m80387                               [enabled]
  1191.  -mabm                                 [enabled]
  1192.  -maes                                 [enabled]
  1193.  -malign-stringops                     [enabled]
  1194.  -march=                               haswell
  1195.  -mavx                                 [enabled]
  1196.  -mavx2                                [enabled]
  1197.  -mbmi                                 [enabled]
  1198.  -mbmi2                                [enabled]
  1199.  -mcx16                                [enabled]
  1200.  -mf16c                                [enabled]
  1201.  -mfancy-math-387                      [enabled]
  1202.  -mfma                                 [enabled]
  1203.  -mfp-ret-in-387                       [enabled]
  1204.  -mfpmath=                             sse
  1205.  -mfsgsbase                            [enabled]
  1206.  -mfxsr                                [enabled]
  1207.  -mglibc                               [enabled]
  1208.  -mhard-float                          [enabled]
  1209.  -mhle                                 [enabled]
  1210.  -mieee-fp                             [enabled]
  1211.  -mlong-double-80                      [enabled]
  1212.  -mlzcnt                               [enabled]
  1213.  -mmmx                                 [enabled]
  1214.  -mmovbe                               [enabled]
  1215.  -mpclmul                              [enabled]
  1216.  -mpopcnt                              [enabled]
  1217.  -mpush-args                           [enabled]
  1218.  -mrdrnd                               [enabled]
  1219.  -mred-zone                            [enabled]
  1220.  -msahf                                [enabled]
  1221.  -msse                                 [enabled]
  1222.  -msse2                                [enabled]
  1223.  -msse3                                [enabled]
  1224.  -msse4                                [enabled]
  1225.  -msse4.1                              [enabled]
  1226.  -msse4.2                              [enabled]
  1227.  -mssse3                               [enabled]
  1228.  -mstv                                 [enabled]
  1229.  -mtls-direct-seg-refs                 [enabled]
  1230.  -mtune-ctrl=                
  1231.  -mtune=                               haswell
  1232.  -mvzeroupper                          [enabled]
  1233.  -mxsave                               [enabled]
  1234.  -mxsaveopt                            [enabled]
  1235.  Valid arguments to -mfpmath=:
  1236.  
  1237. set vm.nr.hugepages in /etc/sysctl.conf
  1238.  
  1239. net.ipv4.conf.all.rp_filter = 0
  1240. net.ipv4.conf.default.rp_filter = 0
  1241. net.ipv4.conf.eth0.rp_filter = 0
  1242. net.ipv4.conf.eth1.rp_filter = 0
  1243. net.ipv4.conf.eth2.rp_filter = 0
  1244. sysctl: cannot stat /proc/sys/net/ipv4/conf/eth3/rp_filter: No such file or directory
  1245. sysctl: cannot stat /proc/sys/net/ipv4/conf/eth4/rp_filter: No such file or directory
  1246. sysctl: cannot stat /proc/sys/net/ipv4/conf/eth5/rp_filter: No such file or directory
  1247. vm.overcommit_memory = 1
  1248. vm.swappiness = 10
  1249. net.ipv6.conf.all.disable_ipv6 = 0
  1250. net.ipv6.conf.default.disable_ipv6 = 0
  1251. vm.nr_hugepages = 244
  1252.  
  1253.  
  1254. set system max locked memory limit
  1255.  
  1256. /etc/security/limits.conf
  1257. * soft memlock 3997696
  1258. * hard memlock 3997696
  1259.  
  1260. # /etc/security/limits.conf
  1261. #
  1262. #This file sets the resource limits for the users logged in via PAM.
  1263. #It does not affect resource limits of the system services.
  1264. #
  1265. #Also note that configuration files in /etc/security/limits.d directory,
  1266. #which are read in alphabetical order, override the settings in this
  1267. #file in case the domain is the same or more specific.
  1268. #That means for example that setting a limit for wildcard domain here
  1269. #can be overriden with a wildcard setting in a config file in the
  1270. #subdirectory, but a user specific setting here can be overriden only
  1271. #with a user specific setting in the subdirectory.
  1272. #
  1273. #Each line describes a limit for a user in the form:
  1274. #
  1275. #<domain>        <type>  <item>  <value>
  1276. #
  1277. #Where:
  1278. #<domain> can be:
  1279. #        - a user name
  1280. #        - a group name, with @group syntax
  1281. #        - the wildcard *, for default entry
  1282. #        - the wildcard %, can be also used with %group syntax,
  1283. #                 for maxlogin limit
  1284. #
  1285. #<type> can have the two values:
  1286. #        - "soft" for enforcing the soft limits
  1287. #        - "hard" for enforcing hard limits
  1288. #
  1289. #<item> can be one of the following:
  1290. #        - core - limits the core file size (KB)
  1291. #        - data - max data size (KB)
  1292. #        - fsize - maximum filesize (KB)
  1293. #        - memlock - max locked-in-memory address space (KB)
  1294. #        - nofile - max number of open file descriptors
  1295. #        - rss - max resident set size (KB)
  1296. #        - stack - max stack size (KB)
  1297. #        - cpu - max CPU time (MIN)
  1298. #        - nproc - max number of processes
  1299. #        - as - address space limit (KB)
  1300. #        - maxlogins - max number of logins for this user
  1301. #        - maxsyslogins - max number of logins on the system
  1302. #        - priority - the priority to run user process with
  1303. #        - locks - max number of file locks the user can hold
  1304. #        - sigpending - max number of pending signals
  1305. #        - msgqueue - max memory used by POSIX message queues (bytes)
  1306. #        - nice - max nice priority allowed to raise to values: [-20, 19]
  1307. #        - rtprio - max realtime priority
  1308. #
  1309. #<domain>      <type>  <item>         <value>
  1310. #
  1311.  
  1312. #*               soft    core            0
  1313. #*               hard    rss             10000
  1314. #@student        hard    nproc           20
  1315. #@faculty        soft    nproc           20
  1316. #@faculty        hard    nproc           50
  1317. #ftp             hard    nproc           0
  1318. #@student        -       maxlogins       4
  1319.  
  1320. # End of file
  1321. * soft nofile 262144
  1322. * hard nofile 262144
  1323. nginx soft nofile 262144
  1324. nginx hard nofile 262144
  1325. nobody soft nofile 262144
  1326. nobody hard nofile 262144
  1327. root soft nofile 262144
  1328. root hard nofile 262144
  1329. * soft memlock 3997696
  1330. * hard memlock 3997696
  1331.  
  1332. 3342336
  1333.  
  1334.  
  1335. sysctl vm.nr_hugepages
  1336. vm.nr_hugepages = 244
  1337.  
  1338. MemTotal:        8008860 kB
  1339. MemFree:          183196 kB
  1340. MemAvailable:    3927240 kB
  1341. Buffers:             112 kB
  1342. Cached:          3095916 kB
  1343. SwapCached:            0 kB
  1344. Active:          4192788 kB
  1345. Inactive:        1707320 kB
  1346. Active(anon):    2675500 kB
  1347. Inactive(anon):   190216 kB
  1348. Active(file):    1517288 kB
  1349. Inactive(file):  1517104 kB
  1350. Unevictable:           0 kB
  1351. Mlocked:               0 kB
  1352. SwapTotal:       1048572 kB
  1353. SwapFree:        1048572 kB
  1354. Dirty:            167084 kB
  1355. Writeback:             0 kB
  1356. AnonPages:       2804412 kB
  1357. Mapped:           125492 kB
  1358. Shmem:             61268 kB
  1359. Slab:            1135624 kB
  1360. SReclaimable:    1007432 kB
  1361. SUnreclaim:       128192 kB
  1362. KernelStack:        4176 kB
  1363. PageTables:        18224 kB
  1364. NFS_Unstable:          0 kB
  1365. Bounce:                0 kB
  1366. WritebackTmp:          0 kB
  1367. CommitLimit:     4803144 kB
  1368. Committed_AS:    6265788 kB
  1369. VmallocTotal:   34359738367 kB
  1370. VmallocUsed:       23512 kB
  1371. VmallocChunk:   34359687036 kB
  1372. HardwareCorrupted:     0 kB
  1373. AnonHugePages:      2048 kB
  1374. CmaTotal:              0 kB
  1375. CmaFree:               0 kB
  1376. HugePages_Total:     244
  1377. HugePages_Free:      244
  1378. HugePages_Rsvd:        0
  1379. HugePages_Surp:        0
  1380. Hugepagesize:       2048 kB
  1381. DirectMap4k:      137072 kB
  1382. DirectMap2M:     6154240 kB
  1383. DirectMap1G:     4194304 kB
  1384.  
  1385. opcache.huge_code_pages => Off => Off
  1386.  
  1387. ../configure --enable-fpm --enable-opcache --enable-intl --enable-pcntl --with-mcrypt --with-snmp --enable-embed=shared --with-mhash --with-zlib --with-gettext --enable-exif --enable-zip --with-libzip --with-bz2 --enable-soap --enable-sockets --enable-sysvmsg --enable-sysvsem --enable-sysvshm --enable-shmop --with-pear --enable-mbstring --with-openssl --with-mysql=mysqlnd --with-libdir=lib64 --with-mysqli=mysqlnd --with-mysql-sock=/var/lib/mysql/mysql.sock --with-curl --with-gd --with-xmlrpc --enable-bcmath --enable-calendar  --enable-ftp --enable-gd-native-ttf --with-freetype-dir=/usr --with-jpeg-dir=/usr --with-png-dir=/usr --with-xpm-dir=/usr --with-webp-dir=/usr --with-t1lib=/usr --enable-pdo --with-pdo-sqlite --with-pdo-mysql=mysqlnd --enable-inline-optimization --with-imap --with-imap-ssl --with-kerberos --with-readline --with-libedit --with-gmp --with-pspell --with-tidy --with-enchant --with-fpm-user=nginx --with-fpm-group=nginx --disable-fileinfo --with-ldap --with-ldap-sasl --with-password-argon2 --with-sodium --with-config-file-scan-dir=/etc/centminmod/php.d --with-fpm-systemd --with-xsl
  1388. configure: WARNING: unrecognized options: --with-mcrypt, --with-mysql, --enable-gd-native-ttf, --with-t1lib
  1389. checking for grep that handles long lines and -e... /bin/grep
  1390. checking for egrep... /bin/grep -E
  1391. checking for a sed that does not truncate output... /bin/sed
  1392. checking build system type... x86_64-pc-linux-gnu
  1393. checking host system type... x86_64-pc-linux-gnu
  1394. checking target system type... x86_64-pc-linux-gnu
  1395. checking whether the C compiler works... yes
  1396. checking for C compiler default output file name... a.out
  1397. checking for suffix of executables...
  1398. checking whether we are cross compiling... no
  1399. checking for suffix of object files... o
  1400. checking whether we are using the GNU C compiler... yes
  1401. checking whether ccache /opt/rh/devtoolset-8/root/usr/bin/gcc accepts -g... yes
  1402. checking for ccache /opt/rh/devtoolset-8/root/usr/bin/gcc option to accept ISO C89... none needed
  1403. checking how to run the C preprocessor... ccache /opt/rh/devtoolset-8/root/usr/bin/gcc -E
  1404. checking for icc... no
  1405. checking for suncc... no
  1406. checking whether ccache /opt/rh/devtoolset-8/root/usr/bin/gcc and cc understand -c and -o together... yes
  1407. checking how to run the C preprocessor... ccache /opt/rh/devtoolset-8/root/usr/bin/gcc -E
  1408. checking for ANSI C header files... yes
  1409. checking for sys/types.h... yes
  1410. checking for sys/stat.h... yes
  1411. checking for stdlib.h... yes
  1412. checking for string.h... yes
  1413. checking for memory.h... yes
  1414. checking for strings.h... yes
  1415. checking for inttypes.h... yes
  1416. checking for stdint.h... yes
  1417. checking for unistd.h... yes
  1418. checking minix/config.h usability... no
  1419. checking minix/config.h presence... no
  1420. checking for minix/config.h... no
  1421. checking whether it is safe to define __EXTENSIONS__... yes
  1422. checking whether ln -s works... yes
  1423. checking for system library directory... lib64
  1424. checking whether to enable runpaths... yes
  1425. checking if compiler supports -R... no
  1426. checking if compiler supports -Wl,-rpath,... yes
  1427. checking for gawk... gawk
  1428. checking for bison... bison -y
  1429. checking for bison version... 3.0 (ok)
  1430. checking for re2c... re2c
  1431. checking for re2c version... 0.14.3 (ok)
  1432. checking whether to enable computed goto gcc extension with re2c... no
  1433. checking whether C compiler accepts -fvisibility=hidden... yes
  1434. checking whether to force non-PIC code in shared modules... no
  1435. checking whether /dev/urandom exists... yes
  1436. checking whether /dev/arandom exists... no
  1437. checking for global register variables support... yes
  1438. checking whether atof() accepts NAN... no
  1439. checking whether atof() accepts INF... no
  1440. checking whether HUGE_VAL == INF... yes
  1441. checking whether HUGE_VAL + -HUGEVAL == NAN... no
  1442. checking whether __cpuid_count is available... yes
  1443. checking for pthreads_cflags... -pthread
  1444. checking for pthreads_lib... pthread
  1445.  
  1446. Configuring SAPI modules
  1447. checking for Apache 2.0 handler-module support via DSO through APXS... no
  1448. checking for setproctitle... no
  1449. checking sys/pstat.h usability... no
  1450. checking sys/pstat.h presence... no
  1451. checking for sys/pstat.h... no
  1452. checking for PS_STRINGS... no
  1453. checking for CLI build... yes
  1454. checking for embedded SAPI library support... shared
  1455. checking for FPM build... yes
  1456. checking for setenv... yes
  1457. checking for clearenv... yes
  1458. checking for setproctitle... (cached) no
  1459. checking for setproctitle_fast... no
  1460. checking for library containing socket... none required
  1461. checking for library containing inet_addr... none required
  1462. checking errno.h usability... yes
  1463. checking errno.h presence... yes
  1464. checking for errno.h... yes
  1465. checking fcntl.h usability... yes
  1466. checking fcntl.h presence... yes
  1467. checking for fcntl.h... yes
  1468. checking stdio.h usability... yes
  1469. checking stdio.h presence... yes
  1470. checking for stdio.h... yes
  1471. checking for stdlib.h... (cached) yes
  1472. checking for unistd.h... (cached) yes
  1473. checking sys/uio.h usability... yes
  1474. checking sys/uio.h presence... yes
  1475. checking for sys/uio.h... yes
  1476. checking sys/select.h usability... yes
  1477. checking sys/select.h presence... yes
  1478. checking for sys/select.h... yes
  1479. checking sys/socket.h usability... yes
  1480. checking sys/socket.h presence... yes
  1481. checking for sys/socket.h... yes
  1482. checking sys/time.h usability... yes
  1483. checking sys/time.h presence... yes
  1484. checking for sys/time.h... yes
  1485. checking arpa/inet.h usability... yes
  1486. checking arpa/inet.h presence... yes
  1487. checking for arpa/inet.h... yes
  1488. checking netinet/in.h usability... yes
  1489. checking netinet/in.h presence... yes
  1490. checking for netinet/in.h... yes
  1491. checking sysexits.h usability... yes
  1492. checking sysexits.h presence... yes
  1493. checking for sysexits.h... yes
  1494. checking for prctl... yes
  1495. checking for clock_gettime... yes
  1496. checking for ptrace... yes
  1497. checking whether ptrace works... yes
  1498. checking for proc mem file... mem
  1499. checking if gcc supports __sync_bool_compare_and_swap... yes
  1500. checking for TCP_INFO... yes
  1501. checking for sysconf... yes
  1502. checking for times... yes
  1503. checking for kqueue... no
  1504. checking for port framework... no
  1505. checking for /dev/poll... no
  1506. checking for epoll... yes
  1507. checking for poll... yes
  1508. checking for select... yes
  1509. checking for apparmor... no
  1510. checking for pkg-config... /bin/pkg-config
  1511. checking for libsystemd... version 219
  1512. checking systemd/sd-daemon.h usability... yes
  1513. checking systemd/sd-daemon.h presence... yes
  1514. checking for systemd/sd-daemon.h... yes
  1515. checking for LiteSpeed support... no
  1516. checking for phpdbg support... yes
  1517. checking for phpdbg web SAPI support... no
  1518. checking for phpdbg debug build... no
  1519. checking whether termios.h defines TIOCGWINSZ... no
  1520. checking whether sys/ioctl.h defines TIOCGWINSZ... yes
  1521. checking for CGI build... yes
  1522. checking for socklen_t in sys/socket.h... yes
  1523. checking for sun_len in sys/un.h... no
  1524. checking whether cross-process locking is required by accept()... no
  1525. checking for chosen SAPI module... embed
  1526. checking for executable SAPI binaries...  cli fpm phpdbg cgi
  1527.  
  1528. Running system checks
  1529. checking for sendmail... /sbin/sendmail
  1530. checking whether system uses EBCDIC... no
  1531. checking whether byte ordering is bigendian... no
  1532. checking whether writing to stdout works... This is the test message -- yes
  1533. checking for socket... yes
  1534. checking for socketpair... yes
  1535. checking for htonl... yes
  1536. checking for gethostname... yes
  1537. checking for gethostbyaddr... yes
  1538. checking for yp_get_default_domain... no
  1539. checking for __yp_get_default_domain... no
  1540. checking for yp_get_default_domain in -lnsl... yes
  1541. checking for dlopen... no
  1542. checking for __dlopen... no
  1543. checking for dlopen in -ldl... yes
  1544. checking for sin in -lm... yes
  1545. checking for inet_aton... yes
  1546. checking for ANSI C header files... (cached) yes
  1547. checking for dirent.h that defines DIR... yes
  1548. checking for library containing opendir... none required
  1549. checking for inttypes.h... (cached) yes
  1550. checking for stdint.h... (cached) yes
  1551. checking for dirent.h... yes
  1552. checking for ApplicationServices/ApplicationServices.h... no
  1553. checking for sys/param.h... yes
  1554. checking for sys/types.h... (cached) yes
  1555. checking for sys/time.h... (cached) yes
  1556. checking for netinet/in.h... (cached) yes
  1557. checking for alloca.h... yes
  1558. checking for arpa/inet.h... (cached) yes
  1559. checking for arpa/nameser.h... yes
  1560. checking for assert.h... yes
  1561. checking for crypt.h... yes
  1562. checking for dns.h... no
  1563. checking for fcntl.h... (cached) yes
  1564. checking for grp.h... yes
  1565. checking for ieeefp.h... no
  1566. checking for langinfo.h... yes
  1567. checking for limits.h... yes
  1568. checking for locale.h... yes
  1569. checking for monetary.h... yes
  1570. checking for netdb.h... yes
  1571. checking for poll.h... yes
  1572. checking for pwd.h... yes
  1573. checking for resolv.h... yes
  1574. checking for signal.h... yes
  1575. checking for stdarg.h... yes
  1576. checking for stdlib.h... (cached) yes
  1577. checking for string.h... (cached) yes
  1578. checking for syslog.h... yes
  1579. checking for sysexits.h... (cached) yes
  1580. checking for sys/ioctl.h... yes
  1581. checking for sys/file.h... yes
  1582. checking for sys/mman.h... yes
  1583. checking for sys/mount.h... yes
  1584. checking for sys/poll.h... yes
  1585. checking for sys/resource.h... yes
  1586. checking for sys/select.h... (cached) yes
  1587. checking for sys/socket.h... (cached) yes
  1588. checking for sys/stat.h... (cached) yes
  1589. checking for sys/statfs.h... yes
  1590. checking for sys/statvfs.h... yes
  1591. checking for sys/vfs.h... yes
  1592. checking for sys/sysexits.h... no
  1593. checking for sys/varargs.h... no
  1594. checking for sys/wait.h... yes
  1595. checking for sys/loadavg.h... no
  1596. checking for termios.h... yes
  1597. checking for unistd.h... (cached) yes
  1598. checking for unix.h... no
  1599. checking for utime.h... yes
  1600. checking for sys/utsname.h... yes
  1601. checking for sys/ipc.h... yes
  1602. checking for dlfcn.h... yes
  1603. checking for assert.h... (cached) yes
  1604. checking for tmmintrin.h... yes
  1605. checking for nmmintrin.h... yes
  1606. checking for immintrin.h... yes
  1607. checking for fopencookie... yes
  1608. checking for broken getcwd... no
  1609. checking for broken libc stdio... yes
  1610. checking for broken gcc optimize-strlen... no
  1611. checking whether struct tm is in sys/time.h or time.h... time.h
  1612. checking for struct tm.tm_zone... yes
  1613. checking for missing declarations of reentrant functions... done
  1614. checking for fclose declaration... ok
  1615. checking for tm_gmtoff in struct tm... yes
  1616. checking for struct flock... yes
  1617. checking for socklen_t... yes
  1618. checking size of size_t... 8
  1619. checking size of long long... 8
  1620. checking size of long long int... 8
  1621. checking size of long... 8
  1622. checking size of int... 4
  1623. checking size of intmax_t... 8
  1624. checking size of ssize_t... 8
  1625. checking size of ptrdiff_t... 8
  1626. checking size of short... 2
  1627. checking size of int... (cached) 4
  1628. checking size of long... (cached) 8
  1629. checking size of long long... (cached) 8
  1630. checking for int8... no
  1631. checking for int16... no
  1632. checking for int32... no
  1633. checking for int64... no
  1634. checking for int8_t... yes
  1635. checking for int16_t... yes
  1636. checking for int32_t... yes
  1637. checking for int64_t... yes
  1638. checking for uint8... no
  1639. checking for uint16... no
  1640. checking for uint32... no
  1641. checking for uint64... no
  1642. checking for uint8_t... yes
  1643. checking for uint16_t... yes
  1644. checking for uint32_t... yes
  1645. checking for uint64_t... yes
  1646. checking for u_int8_t... yes
  1647. checking for u_int16_t... yes
  1648. checking for u_int32_t... yes
  1649. checking for u_int64_t... yes
  1650. checking for __builtin_expect... yes
  1651. checking for __builtin_clz... yes
  1652. checking for __builtin_ctzl... yes
  1653. checking for __builtin_ctzll... yes
  1654. checking for __builtin_smull_overflow... yes
  1655. checking for __builtin_smulll_overflow... yes
  1656. checking for __builtin_saddl_overflow... yes
  1657. checking for __builtin_saddll_overflow... yes
  1658. checking for __builtin_ssubl_overflow... yes
  1659. checking for __builtin_ssubll_overflow... yes
  1660. checking for __builtin_cpu_init... yes
  1661. checking for __builtin_cpu_supports... yes
  1662. checking for ssse3 instructions supports... yes
  1663. checking for sse4.2 instructions supports... yes
  1664. checking for avx instructions supports... yes
  1665. checking for avx2 instructions supports... yes
  1666. checking for struct stat.st_blksize... yes
  1667. checking for struct stat.st_rdev... yes
  1668. checking for struct stat.st_blocks... yes
  1669. checking for size_t... yes
  1670. checking for uid_t in sys/types.h... yes
  1671. checking for struct sockaddr_storage... yes
  1672. checking for field sa_len in struct sockaddr... no
  1673. checking for __attribute__((ifunc))... yes
  1674. checking for __attribute__((target))... yes
  1675. checking for IPv6 support... yes
  1676. checking for vprintf... yes
  1677. checking for _doprnt... no
  1678. checking for alphasort... yes
  1679. checking for asctime_r... yes
  1680. checking for chroot... yes
  1681. checking for ctime_r... yes
  1682. checking for cuserid... yes
  1683. checking for crypt... no
  1684. checking for explicit_memset... no
  1685. checking for flock... yes
  1686. checking for ftok... yes
  1687. checking for funopen... no
  1688. checking for gai_strerror... yes
  1689. checking for gcvt... yes
  1690. checking for getloadavg... yes
  1691. checking for getlogin... yes
  1692. checking for getprotobyname... yes
  1693. checking for getprotobynumber... yes
  1694. checking for getservbyname... yes
  1695. checking for getservbyport... yes
  1696. checking for gethostname... (cached) yes
  1697. checking for getrusage... yes
  1698. checking for gettimeofday... yes
  1699. checking for gmtime_r... yes
  1700. checking for getpwnam_r... yes
  1701. checking for getgrnam_r... yes
  1702. checking for getpwuid_r... yes
  1703. checking for grantpt... yes
  1704. checking for inet_ntoa... yes
  1705. checking for inet_ntop... yes
  1706. checking for inet_pton... yes
  1707. checking for isascii... yes
  1708. checking for link... yes
  1709. checking for localtime_r... yes
  1710. checking for lockf... yes
  1711. checking for lchown... yes
  1712. checking for lrand48... yes
  1713. checking for memcpy... yes
  1714. checking for memmove... yes
  1715. checking for mkstemp... yes
  1716. checking for mmap... yes
  1717. checking for nl_langinfo... yes
  1718. checking for perror... yes
  1719. checking for poll... yes
  1720. checking for ptsname... yes
  1721. checking for putenv... yes
  1722. checking for realpath... yes
  1723. checking for random... yes
  1724. checking for rand_r... yes
  1725. checking for scandir... yes
  1726. checking for setitimer... yes
  1727. checking for setlocale... yes
  1728. checking for localeconv... yes
  1729. checking for setenv... (cached) yes
  1730. checking for setpgid... yes
  1731. checking for setsockopt... yes
  1732. checking for setvbuf... yes
  1733. checking for shutdown... yes
  1734. checking for sin... yes
  1735. checking for snprintf... yes
  1736. checking for srand48... yes
  1737. checking for srandom... yes
  1738. checking for statfs... yes
  1739. checking for statvfs... yes
  1740. checking for std_syslog... no
  1741. checking for strcasecmp... yes
  1742. checking for strcoll... yes
  1743. checking for strdup... yes
  1744. checking for strerror... yes
  1745. checking for strftime... yes
  1746. checking for strnlen... yes
  1747. checking for strptime... yes
  1748. checking for strstr... yes
  1749. checking for strtok_r... yes
  1750. checking for symlink... yes
  1751. checking for tempnam... yes
  1752. checking for tzset... yes
  1753. checking for unlockpt... yes
  1754. checking for unsetenv... yes
  1755. checking for usleep... yes
  1756. checking for utime... yes
  1757. checking for vsnprintf... yes
  1758. checking for vasprintf... yes
  1759. checking for asprintf... yes
  1760. checking for nanosleep... yes
  1761. checking for nanosleep in -lrt... yes
  1762. checking for getaddrinfo... yes
  1763. checking for __sync_fetch_and_add... yes
  1764. checking for strlcat... no
  1765. checking for strlcpy... no
  1766. checking for explicit_bzero... no
  1767. checking for getopt... yes
  1768. checking for utime.h... (cached) yes
  1769. checking whether utime accepts a null argument... yes
  1770. checking for working alloca.h... yes
  1771. checking for alloca... yes
  1772. checking for declared timezone... yes
  1773. checking for type of reentrant time-related functions... POSIX
  1774. checking for readdir_r... yes
  1775. checking for type of readdir_r... POSIX
  1776. checking for in_addr_t... yes
  1777. checking for crypt_r... no
  1778. checking for asm goto... yes
  1779. checking whether compiler supports VLA... yes
  1780. checking whether to enable valgrind support... yes
  1781. checking for valgrind header... not found
  1782.  
  1783. General settings
  1784. checking whether to include gcov symbols... no
  1785. checking whether to include debugging symbols... no
  1786. checking layout of installed files... PHP
  1787. checking path to configuration file... DEFAULT
  1788. checking where to scan for configuration files... /etc/centminmod/php.d
  1789. checking whether to enable PHP's own SIGCHLD handler... no
  1790. checking whether to explicitly link against libgcc... no
  1791. checking whether to enable short tags by default... yes
  1792. checking whether to enable dmalloc... no
  1793. checking whether to enable IPv6 support... yes
  1794. checking whether to enable DTrace support... no
  1795. checking how big to make fd sets... using system default
  1796.  
  1797. Configuring extensions
  1798. checking size of long... (cached) 8
  1799. checking size of int... (cached) 4
  1800. checking for int32_t... yes
  1801. checking for uint32_t... yes
  1802. checking for sys/time.h... (cached) yes
  1803. checking for sys/types.h... (cached) yes
  1804. checking for stdint.h... (cached) yes
  1805. checking for dirent.h... (cached) yes
  1806. checking for string.h... (cached) yes
  1807. checking for strings.h... (cached) yes
  1808. checking for unistd.h... (cached) yes
  1809. checking io.h usability... no
  1810. checking io.h presence... no
  1811. checking for io.h... no
  1812. checking for strtoll... yes
  1813. checking for atoll... yes
  1814. checking for strftime... (cached) yes
  1815. checking for gettimeofday... (cached) yes
  1816. checking whether to enable LIBXML support... yes
  1817. checking libxml2 install dir... no
  1818. checking for xml2-config path... /usr/bin/xml2-config
  1819. checking whether libxml build works... yes
  1820. checking for OpenSSL support... yes
  1821. checking for Kerberos support... yes
  1822. checking whether to use system default cipher list instead of hardcoded value... no
  1823. checking for krb5-config... /bin/krb5-config
  1824. checking for RAND_egd... no
  1825. checking for PCRE library to use... bundled
  1826. checking whether to enable PCRE JIT functionality... yes
  1827. checking whether to enable the SQLite3 extension... yes
  1828. checking bundled sqlite3 library... yes
  1829. checking for ZLIB support... yes
  1830. checking if the location of ZLIB install directory is defined... no
  1831. checking for zlib version >= 1.2.0.4... 1.2.7
  1832. checking for gzgets in -lz... yes
  1833. checking whether to enable bc style precision math functions... yes
  1834. checking for BZip2 support... yes
  1835. checking for BZip2 in default path... found in /usr
  1836. checking for BZ2_bzerror in -lbz2... yes
  1837. checking whether to enable calendar conversion support... yes
  1838. checking whether to enable ctype functions... yes
  1839. checking for cURL support... yes
  1840. checking for libcurl.pc... using default path
  1841. checking for cURL 7.15.5 or greater... 7.64.0
  1842. checking for SSL support in libcurl... yes
  1843. checking how to run the C preprocessor... ccache /opt/rh/devtoolset-8/root/usr/bin/gcc -E
  1844. checking for openssl support in libcurl... no
  1845. checking for gnutls support in libcurl... no
  1846. checking for curl_easy_perform in -lcurl... yes
  1847. checking for curl_easy_strerror in -lcurl... yes
  1848. checking for curl_multi_strerror in -lcurl... yes
  1849. checking for QDBM support... no
  1850. checking for GDBM support... no
  1851. checking for NDBM support... no
  1852. checking for TCADB support... no
  1853. checking for LMDB support... no
  1854. checking for Berkeley DB4 support... no
  1855. checking for Berkeley DB3 support... no
  1856. checking for Berkeley DB2 support... no
  1857. checking for DB1 support... no
  1858. checking for DBM support... no
  1859. checking for CDB support... no
  1860. checking for INI File support... no
  1861. checking for FlatFile support... no
  1862. checking whether to enable DBA interface... no
  1863. checking whether to enable DOM support... yes
  1864. checking for xml2-config path... (cached) /usr/bin/xml2-config
  1865. checking whether libxml build works... (cached) yes
  1866. checking for ENCHANT support... yes
  1867. checking for enchant_broker_set_param in -lenchant... yes
  1868. checking whether to enable EXIF (metadata from images) support... yes
  1869. checking for fileinfo support... no
  1870. checking whether to enable input filter support... yes
  1871. checking pcre install prefix... no
  1872. checking whether to enable FTP support... yes
  1873. checking OpenSSL dir for FTP... no
  1874. checking for GD support... yes
  1875. checking for the location of libwebp... /usr
  1876. checking for the location of libjpeg... /usr
  1877. checking for the location of libpng... /usr
  1878. checking for the location of libXpm... /usr
  1879. checking for FreeType 2... /usr
  1880. checking whether to enable JIS-mapped Japanese font support in GD... no
  1881. checking for WebPGetInfo in -lwebp... yes
  1882. checking for jpeg_read_header in -ljpeg... yes
  1883. checking for png_write_image in -lpng... yes
  1884. checking for XpmFreeXpmImage in -lXpm... yes
  1885. checking for fabsf... yes
  1886. checking for floorf... yes
  1887. checking for GNU gettext support... yes
  1888. checking for bindtextdomain in -lintl... no
  1889. checking for bindtextdomain in -lc... yes
  1890. checking for ngettext in -lc... yes
  1891. checking for dngettext in -lc... yes
  1892. checking for dcngettext in -lc... yes
  1893. checking for bind_textdomain_codeset in -lc... yes
  1894. checking for GNU MP support... yes
  1895. checking for __gmpz_rootrem in -lgmp... yes
  1896. checking for mhash support... yes
  1897. checking whether to enable hash support... yes
  1898. checking whether byte ordering is bigendian... (cached) no
  1899. checking size of short... (cached) 2
  1900. checking size of int... (cached) 4
  1901. checking size of long... (cached) 8
  1902. checking size of long long... (cached) 8
  1903. checking size of long int... 8
  1904. checking checking if we're at 64-bit platform... yes
  1905. checking for iconv support... yes
  1906. checking for iconv... yes
  1907. checking if iconv is glibc's... yes
  1908. checking if iconv supports errno... yes
  1909. checking if iconv supports //IGNORE... no
  1910. checking if your cpp allows macro usage in include lines... yes
  1911. checking for IMAP support... yes
  1912. checking for IMAP Kerberos support... yes
  1913. checking for IMAP SSL support... yes
  1914. checking for utf8_mime2text signature... new
  1915. checking for U8T_DECOMPOSE... yes
  1916. checking for pam_start in -lpam... yes
  1917. checking for crypt in -lcrypt... yes
  1918. checking whether rfc822_output_address_list function present... yes
  1919. checking whether build with IMAP works... yes
  1920. checking for Firebird support... no
  1921. checking whether to enable internationalization support... yes
  1922. checking for icu-config... /bin/icu-config
  1923. checking for location of ICU headers and libraries... /usr
  1924. checking for ICU 4.0 or greater... found 50.1.2
  1925. checking whether we are using the GNU C++ compiler... yes
  1926. checking whether ccache /opt/rh/devtoolset-8/root/usr/bin/g++ accepts -g... yes
  1927. checking how to run the C++ preprocessor... ccache /opt/rh/devtoolset-8/root/usr/bin/g++ -E
  1928. checking whether to enable JavaScript Object Serialization support... yes
  1929. checking for ANSI C header files... (cached) yes
  1930. checking for LDAP support... yes
  1931. checking for LDAP Cyrus SASL support... yes
  1932. checking size of long int... (cached) 8
  1933. checking for 3 arg ldap_set_rebind_proc... yes
  1934. checking for ldap_parse_result... yes
  1935. checking for ldap_parse_reference... yes
  1936. checking for ldap_start_tls_s... yes
  1937. checking for ldap_control_find... yes
  1938. checking for ldap_parse_extended_result... yes
  1939. checking for ldap_extended_operation... yes
  1940. checking for ldap_extended_operation_s... yes
  1941. checking for ldap_passwd... yes
  1942. checking for ldap_whoami_s... yes
  1943. checking for ldap_refresh_s... yes
  1944. checking for sasl_version in -lsasl2... yes
  1945. checking for ldap_bind_s... yes
  1946. checking whether to enable multibyte string support... yes
  1947. checking whether to enable multibyte regex support... yes
  1948. checking whether to check multibyte regex backtrack... yes
  1949. checking for external oniguruma... no
  1950. checking for variable length prototypes and stdarg.h... yes
  1951. checking for stdlib.h... (cached) yes
  1952. checking for string.h... (cached) yes
  1953. checking for strings.h... (cached) yes
  1954. checking for unistd.h... (cached) yes
  1955. checking for sys/time.h... (cached) yes
  1956. checking sys/times.h usability... yes
  1957. checking sys/times.h presence... yes
  1958. checking for sys/times.h... yes
  1959. checking for stdarg.h... (cached) yes
  1960. checking for limits.h... (cached) yes
  1961. checking size of int... (cached) 4
  1962. checking size of short... (cached) 2
  1963. checking size of long... (cached) 8
  1964. checking for an ANSI C-conforming const... yes
  1965. checking whether time.h and sys/time.h may both be included... yes
  1966. checking for working alloca.h... (cached) yes
  1967. checking for alloca... (cached) yes
  1968. checking for working memcmp... yes
  1969. checking for stdarg.h... (cached) yes
  1970. checking for MySQLi support... yes
  1971. checking whether to enable embedded MySQLi support... no
  1972. checking for specified location of the MySQL UNIX socket... /var/lib/mysql/mysql.sock
  1973. checking for MySQL UNIX socket location... /var/lib/mysql/mysql.sock
  1974. checking for Oracle Database OCI8 support... no
  1975. checking for Adabas support... no
  1976. checking for SAP DB support... no
  1977. checking for Solid support... no
  1978. checking for IBM DB2 support... no
  1979. checking for Empress support... no
  1980. checking for Empress local access support... no
  1981. checking for a custom ODBC support... no
  1982. checking for iODBC support... no
  1983. checking for Easysoft ODBC-ODBC Bridge support... no
  1984. checking for unixODBC support... no
  1985. checking for DBMaker support... no
  1986. checking for any ODBC driver support... no
  1987. checking whether to enable Zend OPcache support... yes
  1988. checking whether to enable file based caching... yes
  1989. checking whether to enable copying PHP CODE pages into HUGE PAGES... yes
  1990. checking for mprotect... yes
  1991. checking for unistd.h... (cached) yes
  1992. checking for sys/uio.h... (cached) yes
  1993. checking for sysvipc shared memory support... yes
  1994. checking for mmap() using MAP_ANON shared memory support... yes
  1995. checking for mmap() using /dev/zero shared memory support... yes
  1996. checking for mmap() using shm_open() shared memory support... yes
  1997. checking for mmap() using regular file shared memory support... yes
  1998. checking for struct flock layout... linux
  1999. checking whether to enable pcntl support... yes
  2000. checking for fork... yes
  2001. checking for waitpid... yes
  2002. checking for sigaction... yes
  2003. checking for getpriority... yes
  2004. checking for setpriority... yes
  2005. checking for wait3... yes
  2006. checking for wait4... yes
  2007. checking for sigprocmask... yes
  2008. checking for sigwaitinfo... yes
  2009. checking for sigtimedwait... yes
  2010. checking for siginfo_t... yes
  2011. checking whether to enable PDO support... yes
  2012. checking for PDO_DBLIB support via FreeTDS... no
  2013. checking for Firebird support for PDO... no
  2014. checking for MySQL support for PDO... yes
  2015. checking for MySQL UNIX socket location... /var/lib/mysql/mysql.sock
  2016. checking for PDO includes... checking for PDO includes... /svr-setup/php-7.3.2/ext
  2017. checking Oracle OCI support for PDO... no
  2018. checking for ODBC v3 support for PDO... no
  2019. checking for PostgreSQL support for PDO... no
  2020. checking for sqlite 3 support for PDO... yes
  2021. checking for PDO includes... (cached) /svr-setup/php-7.3.2/ext
  2022. checking for usleep... (cached) yes
  2023. checking for nanosleep... (cached) yes
  2024. checking time.h usability... yes
  2025. checking time.h presence... yes
  2026. checking for time.h... yes
  2027. checking for fdatasync in -lrt... yes
  2028. checking for PostgreSQL support... no
  2029. checking for phar archive support... yes
  2030. checking for phar openssl support... yes
  2031. checking whether to enable POSIX-like functions... yes
  2032. checking sys/mkdev.h usability... no
  2033. checking sys/mkdev.h presence... no
  2034. checking for sys/mkdev.h... no
  2035. checking sys/sysmacros.h usability... yes
  2036. checking sys/sysmacros.h presence... yes
  2037. checking for sys/sysmacros.h... yes
  2038. checking for seteuid... yes
  2039. checking for setegid... yes
  2040. checking for setsid... yes
  2041. checking for getsid... yes
  2042. checking for setpgid... (cached) yes
  2043. checking for getpgid... yes
  2044. checking for ctermid... yes
  2045. checking for mkfifo... yes
  2046. checking for mknod... yes
  2047. checking for setrlimit... yes
  2048. checking for getrlimit... yes
  2049. checking for getlogin... (cached) yes
  2050. checking for getgroups... yes
  2051. checking for makedev... no
  2052. checking for initgroups... yes
  2053. checking for getpwuid_r... (cached) yes
  2054. checking for getgrgid_r... yes
  2055. checking for working ttyname_r() implementation... yes
  2056. checking for utsname.domainname... yes
  2057. checking for PSPELL support... yes
  2058. checking for new_aspell_config in -laspell... yes
  2059. checking for libedit readline replacement... yes
  2060. checking for tgetent in -lncurses... yes
  2061. checking for readline in -ledit... yes
  2062. checking for rl_callback_read_char in -ledit... yes
  2063. checking for rl_on_new_line in -ledit... yes
  2064. checking for rl_completion_matches in -ledit... yes
  2065. checking for recode support... no
  2066. checking whether to enable PHP sessions... yes
  2067. checking for mm support... no
  2068. checking whether pwrite works... yes
  2069. checking whether pread works... yes
  2070. checking whether to enable shmop support... yes
  2071. checking whether to enable SimpleXML support... yes
  2072. checking for xml2-config path... (cached) /usr/bin/xml2-config
  2073. checking whether libxml build works... (cached) yes
  2074. checking for SNMP support... yes
  2075. checking OpenSSL dir for SNMP... no
  2076. checking for net-snmp-config... /bin/net-snmp-config
  2077. checking for init_snmp in -lnetsnmp... yes
  2078. checking for shutdown_snmp_logging in -lnetsnmp... yes
  2079. checking whether to enable SOAP support... yes
  2080. checking for xml2-config path... (cached) /usr/bin/xml2-config
  2081. checking whether libxml build works... (cached) yes
  2082. checking whether to enable sockets support... yes
  2083. checking for struct cmsghdr... yes
  2084. checking for hstrerror... yes
  2085. checking for socketpair... (cached) yes
  2086. checking for if_nametoindex... yes
  2087. checking for if_indextoname... yes
  2088. checking for netdb.h... (cached) yes
  2089. checking netinet/tcp.h usability... yes
  2090. checking netinet/tcp.h presence... yes
  2091. checking for netinet/tcp.h... yes
  2092. checking sys/un.h usability... yes
  2093. checking sys/un.h presence... yes
  2094. checking for sys/un.h... yes
  2095. checking sys/sockio.h usability... no
  2096. checking sys/sockio.h presence... no
  2097. checking for sys/sockio.h... no
  2098. checking for errno.h... (cached) yes
  2099. checking for field ss_family in struct sockaddr_storage... yes
  2100. checking if getaddrinfo supports AI_V4MAPPED... yes
  2101. checking if getaddrinfo supports AI_ALL... yes
  2102. checking if getaddrinfo supports AI_IDN... yes
  2103. checking for sodium support... yes
  2104. checking for pkg-config... (cached) /bin/pkg-config
  2105. checking for libsodium... found in /usr/local
  2106. checking for sodium_add in -lsodium... yes
  2107. checking whether flush should be called explicitly after a buffered io... no
  2108. checking for crypt in -lcrypt... (cached) yes
  2109. checking for standard DES crypt... yes
  2110. checking for extended DES crypt... no
  2111. checking for MD5 crypt... yes
  2112. checking for Blowfish crypt... no
  2113. checking for SHA512 crypt... yes
  2114. checking for SHA256 crypt... yes
  2115. checking whether the compiler supports __alignof__... yes
  2116. checking whether the compiler supports aligned attribute... yes
  2117. checking for getcwd... yes
  2118. checking for getwd... yes
  2119. checking for asinh... yes
  2120. checking for acosh... yes
  2121. checking for atanh... yes
  2122. checking for log1p... yes
  2123. checking for hypot... yes
  2124. checking for glob... yes
  2125. checking for strfmon... yes
  2126. checking for nice... yes
  2127. checking for fpclass... no
  2128. checking for mempcpy... yes
  2129. checking for strpncpy... no
  2130. checking for working POSIX fnmatch... yes
  2131. checking for fork... (cached) yes
  2132. checking if your OS can spawn processes with inherited handles... yes
  2133. checking for res_nsearch... no
  2134. checking for __res_nsearch... no
  2135. checking for res_nsearch in -lresolv... no
  2136. checking for __res_nsearch in -lresolv... yes
  2137. checking for res_ndestroy... no
  2138. checking for __res_ndestroy... no
  2139. checking for res_ndestroy in -lresolv... no
  2140. checking for __res_ndestroy in -lresolv... no
  2141. checking for res_ndestroy in -lbind... no
  2142. checking for __res_ndestroy in -lbind... no
  2143. checking for res_ndestroy in -lsocket... no
  2144. checking for __res_ndestroy in -lsocket... no
  2145. checking for dns_search... no
  2146. checking for __dns_search... no
  2147. checking for dns_search in -lresolv... no
  2148. checking for __dns_search in -lresolv... no
  2149. checking for dns_search in -lbind... no
  2150. checking for __dns_search in -lbind... no
  2151. checking for dns_search in -lsocket... no
  2152. checking for __dns_search in -lsocket... no
  2153. checking for dn_expand... no
  2154. checking for __dn_expand... yes
  2155. checking for dn_skipname... no
  2156. checking for __dn_skipname... yes
  2157. checking for res_search... no
  2158. checking for __res_search... yes
  2159. checking whether strptime() declaration fails... yes
  2160. checking wchar.h usability... yes
  2161. checking wchar.h presence... yes
  2162. checking for wchar.h... yes
  2163. checking for mblen... yes
  2164. checking for mbrlen... yes
  2165. checking for mbsinit... yes
  2166. checking for mbstate_t... yes
  2167. checking atomic.h usability... no
  2168. checking atomic.h presence... no
  2169. checking for atomic.h... no
  2170. checking whether arc4random_buf is declared... no
  2171. checking for Argon2 support... yes
  2172. checking for Argon2 library... found in /usr/local
  2173. checking for argon2id_hash_raw in -largon2... yes
  2174. checking for net/if.h... yes
  2175. checking for netdb.h... (cached) yes
  2176. checking for usable getifaddrs... yes
  2177. checking whether to enable System V IPC support... yes
  2178. checking sys/msg.h usability... yes
  2179. checking sys/msg.h presence... yes
  2180. checking for sys/msg.h... yes
  2181. checking whether to enable System V semaphore support... yes
  2182. checking for union semun... no
  2183. checking whether to enable System V shared memory support... yes
  2184. checking for TIDY support... yes
  2185. checking for tidyOptGetDoc in -ltidy... yes
  2186. checking for tidyReleaseDate in -ltidy... yes
  2187. checking whether to enable tokenizer support... yes
  2188. checking whether to enable WDDX support... no
  2189. checking libexpat dir for WDDX... no
  2190. checking whether to enable XML support... yes
  2191. checking libexpat install dir... no
  2192. checking for xml2-config path... (cached) /usr/bin/xml2-config
  2193. checking whether libxml build works... (cached) yes
  2194. checking whether to enable XMLReader support... yes
  2195. checking for xml2-config path... (cached) /usr/bin/xml2-config
  2196. checking whether libxml build works... (cached) yes
  2197. checking for XMLRPC-EPI support... yes
  2198. checking libexpat dir for XMLRPC-EPI... no
  2199. checking iconv dir for XMLRPC-EPI... no
  2200. checking for xml2-config path... (cached) /usr/bin/xml2-config
  2201. checking whether libxml build works... (cached) yes
  2202. checking for ranlib... ranlib
  2203. checking for inline... inline
  2204. checking for ANSI C header files... (cached) yes
  2205. checking xmlparse.h usability... no
  2206. checking xmlparse.h presence... no
  2207. checking for xmlparse.h... no
  2208. checking xmltok.h usability... no
  2209. checking xmltok.h presence... no
  2210. checking for xmltok.h... no
  2211. checking for stdlib.h... (cached) yes
  2212. checking for strings.h... (cached) yes
  2213. checking for string.h... (cached) yes
  2214. checking size of char... 1
  2215. checking size of int... (cached) 4
  2216. checking size of long... (cached) 8
  2217. checking size of long long... (cached) 8
  2218. checking for size_t... (cached) yes
  2219. checking whether time.h and sys/time.h may both be included... (cached) yes
  2220. checking for uid_t in sys/types.h... (cached) yes
  2221. checking for strtoul... yes
  2222. checking for strtoull... yes
  2223. checking for snprintf... (cached) yes
  2224. checking for strstr... (cached) yes
  2225. checking for strpbrk... yes
  2226. checking for strerror... (cached) yes
  2227. checking for memcpy... (cached) yes
  2228. checking for memmove... (cached) yes
  2229. checking whether to enable XMLWriter support... yes
  2230. checking for xml2-config path... (cached) /usr/bin/xml2-config
  2231. checking whether libxml build works... (cached) yes
  2232. checking for XSL support... yes
  2233. checking for EXSLT support... found
  2234. checking whether to enable zend-test extension... no
  2235. checking for zip archive read/writesupport... yes
  2236. checking pcre install prefix... no
  2237. checking libzip... yes
  2238. checking for the location of zlib... /usr
  2239. checking for pkg-config... (cached) /bin/pkg-config
  2240. checking for libzip... in default path: found in /usr/local
  2241. checking for zip_open in -lzip... yes
  2242. checking for zip_file_set_encryption in -lzip... yes
  2243. checking for zip_libzip_version in -lzip... yes
  2244. checking stdbool.h usability... yes
  2245. checking stdbool.h presence... yes
  2246. checking for stdbool.h... yes
  2247. checking fts.h usability... yes
  2248. checking fts.h presence... yes
  2249. checking for fts.h... yes
  2250. checking for int8_t... (cached) yes
  2251. checking for int16_t... (cached) yes
  2252. checking for int32_t... (cached) yes
  2253. checking for int64_t... (cached) yes
  2254. checking for uint8_t... (cached) yes
  2255. checking for uint16_t... (cached) yes
  2256. checking for uint32_t... (cached) yes
  2257. checking for uint64_t... (cached) yes
  2258. checking for ssize_t... yes
  2259. checking size of short... (cached) 2
  2260. checking size of int... (cached) 4
  2261. checking size of long... (cached) 8
  2262. checking size of long long... (cached) 8
  2263. checking size of off_t... 8
  2264. checking size of size_t... (cached) 8
  2265. checking for touch... /bin/touch
  2266. checking for unzip... /bin/unzip
  2267. checking for struct tm.tm_zone... (cached) yes
  2268. checking whether to enable mysqlnd... no
  2269. checking whether to disable compressed protocol support in mysqlnd... yes
  2270. checking for DSA_get_default_method in -lssl... yes
  2271. checking for X509_free in -lcrypto... yes
  2272.  
  2273. Configuring PEAR
  2274. checking whether to install PEAR... yes
  2275.  
  2276. Configuring Zend
  2277. checking for bison version... (cached) 3.0 (ok)
  2278. checking for inttypes.h... (cached) yes
  2279. checking for stdint.h... (cached) yes
  2280. checking for limits.h... (cached) yes
  2281. checking malloc.h usability... yes
  2282. checking malloc.h presence... yes
  2283. checking for malloc.h... yes
  2284. checking for string.h... (cached) yes
  2285. checking for unistd.h... (cached) yes
  2286. checking for stdarg.h... (cached) yes
  2287. checking for sys/types.h... (cached) yes
  2288. checking for sys/time.h... (cached) yes
  2289. checking for signal.h... (cached) yes
  2290. checking for unix.h... (cached) no
  2291. checking for stdlib.h... (cached) yes
  2292. checking cpuid.h usability... yes
  2293. checking cpuid.h presence... yes
  2294. checking for cpuid.h... yes
  2295. checking for dlfcn.h... (cached) yes
  2296. checking for size_t... (cached) yes
  2297. checking for uint... yes
  2298. checking for ulong... yes
  2299. checking for int32_t... yes
  2300. checking for uint32_t... yes
  2301. checking for vprintf... (cached) yes
  2302. checking for _doprnt... (cached) no
  2303. checking for working memcmp... (cached) yes
  2304. checking for working alloca.h... (cached) yes
  2305. checking for alloca... (cached) yes
  2306. checking for memcpy... (cached) yes
  2307. checking for strdup... (cached) yes
  2308. checking for getpid... yes
  2309. checking for kill... yes
  2310. checking for strtod... yes
  2311. checking for strtol... yes
  2312. checking for finite... yes
  2313. checking for fpclass... (cached) no
  2314. checking for sigsetjmp... no
  2315. checking whether sprintf is broken... no
  2316. checking whether isfinite is declared... yes
  2317. checking whether isnan is declared... yes
  2318. checking whether isinf is declared... yes
  2319. checking whether fp_except is defined... no
  2320. checking for usable _FPU_SETCW... no
  2321. checking for usable fpsetprec... no
  2322. checking for usable _controlfp... no
  2323. checking for usable _controlfp_s... no
  2324. checking whether FPU control word can be manipulated by inline assembler... no
  2325. checking whether double cast to long preserves least significant bits... no
  2326. checking for dlfcn.h... (cached) yes
  2327. checking whether dlsym() requires a leading underscore in symbol names... no
  2328. checking whether to enable thread-safety... no
  2329. checking whether to enable inline optimization for GCC... yes
  2330. checking whether to enable Zend debugging... no
  2331. checking for inline... (cached) inline
  2332. checking target system is Darwin... no
  2333. checking for MM alignment and log values... done
  2334. checking for memory allocation using mmap(MAP_ANON)... yes
  2335. checking for memory allocation using mmap("/dev/zero")... yes
  2336. checking for mremap... yes
  2337. checking for sigaction... (cached) yes
  2338. checking whether to enable zend signal handling... yes
  2339.  
  2340. Configuring TSRM
  2341. checking for stdarg.h... (cached) yes
  2342. checking for sigprocmask... (cached) yes
  2343. checking how many arguments gethostbyname_r() takes... six
  2344.  
  2345. Configuring libtool
  2346. checking for ld used by ccache /opt/rh/devtoolset-8/root/usr/bin/gcc... /opt/rh/devtoolset-8/root/usr/libexec/gcc/x86_64-redhat-linux/8/ld
  2347. checking if the linker (/opt/rh/devtoolset-8/root/usr/libexec/gcc/x86_64-redhat-linux/8/ld) is GNU ld... yes
  2348. checking for /opt/rh/devtoolset-8/root/usr/libexec/gcc/x86_64-redhat-linux/8/ld option to reload object files... -r
  2349. checking for BSD-compatible nm... /opt/rh/devtoolset-8/root/usr/bin/nm -B
  2350. checking how to recognize dependent libraries... pass_all
  2351. checking how to run the C++ preprocessor... ccache /opt/rh/devtoolset-8/root/usr/bin/g++ -E
  2352. checking the maximum length of command line arguments... 1572864
  2353. checking command to parse /opt/rh/devtoolset-8/root/usr/bin/nm -B output from ccache /opt/rh/devtoolset-8/root/usr/bin/gcc object... ok
  2354. checking for objdir... .libs
  2355. checking for ar... ar
  2356. checking for ranlib... (cached) ranlib
  2357. checking for strip... strip
  2358. checking if ccache /opt/rh/devtoolset-8/root/usr/bin/gcc supports -fno-rtti -fno-exceptions... no
  2359. checking for ccache /opt/rh/devtoolset-8/root/usr/bin/gcc option to produce PIC... -fPIC
  2360. checking if ccache /opt/rh/devtoolset-8/root/usr/bin/gcc PIC flag -fPIC works... yes
  2361. checking if ccache /opt/rh/devtoolset-8/root/usr/bin/gcc static flag -static works... no
  2362. checking if ccache /opt/rh/devtoolset-8/root/usr/bin/gcc supports -c -o file.o... yes
  2363. checking whether the ccache /opt/rh/devtoolset-8/root/usr/bin/gcc linker (/opt/rh/devtoolset-8/root/usr/libexec/gcc/x86_64-redhat-linux/8/ld -m elf_x86_64) supports shared libraries... yes
  2364. checking whether -lc should be explicitly linked in... no
  2365. checking dynamic linker characteristics... GNU/Linux ld.so
  2366. checking how to hardcode library paths into programs... immediate
  2367. checking whether stripping libraries is possible... yes
  2368. checking if libtool supports shared libraries... yes
  2369. checking whether to build shared libraries... yes
  2370. checking whether to build static libraries... no
  2371.  
  2372. creating libtool
  2373. appending configuration tag "CXX" to libtool
  2374. checking for ld used by ccache /opt/rh/devtoolset-8/root/usr/bin/g++... /opt/rh/devtoolset-8/root/usr/libexec/gcc/x86_64-redhat-linux/8/ld -m elf_x86_64
  2375. checking if the linker (/opt/rh/devtoolset-8/root/usr/libexec/gcc/x86_64-redhat-linux/8/ld -m elf_x86_64) is GNU ld... yes
  2376. checking whether the ccache /opt/rh/devtoolset-8/root/usr/bin/g++ linker (/opt/rh/devtoolset-8/root/usr/libexec/gcc/x86_64-redhat-linux/8/ld -m elf_x86_64) supports shared libraries... yes
  2377. checking for ccache /opt/rh/devtoolset-8/root/usr/bin/g++ option to produce PIC... -fPIC
  2378. checking if ccache /opt/rh/devtoolset-8/root/usr/bin/g++ PIC flag -fPIC works... yes
  2379. checking if ccache /opt/rh/devtoolset-8/root/usr/bin/g++ static flag -static works... no
  2380. checking if ccache /opt/rh/devtoolset-8/root/usr/bin/g++ supports -c -o file.o... yes
  2381. checking whether the ccache /opt/rh/devtoolset-8/root/usr/bin/g++ linker (/opt/rh/devtoolset-8/root/usr/libexec/gcc/x86_64-redhat-linux/8/ld -m elf_x86_64) supports shared libraries... yes
  2382. checking dynamic linker characteristics... GNU/Linux ld.so
  2383. (cached) (cached) checking how to hardcode library paths into programs... immediate
  2384.  
  2385. Generating files
  2386. configure: creating ./config.status
  2387. creating main/internal_functions.c
  2388. creating main/internal_functions_cli.c
  2389. +--------------------------------------------------------------------+
  2390. | License:                                                           |
  2391. | This software is subject to the PHP License, available in this     |
  2392. | distribution in the file LICENSE.  By continuing this installation |
  2393. | process, you are bound by the terms of this license agreement.     |
  2394. | If you do not agree with the terms of this license, you must abort |
  2395. | the installation process at this point.                            |
  2396. +--------------------------------------------------------------------+
  2397.  
  2398. Thank you for using PHP.
  2399.  
  2400. config.status: creating php7.spec
  2401. config.status: creating main/build-defs.h
  2402. config.status: creating scripts/phpize
  2403. config.status: creating scripts/man1/phpize.1
  2404. config.status: creating scripts/php-config
  2405. config.status: creating scripts/man1/php-config.1
  2406. config.status: creating sapi/cli/php.1
  2407. config.status: creating sapi/fpm/php-fpm.conf
  2408. config.status: creating sapi/fpm/www.conf
  2409. config.status: creating sapi/fpm/init.d.php-fpm
  2410. config.status: creating sapi/fpm/php-fpm.service
  2411. config.status: creating sapi/fpm/php-fpm.8
  2412. config.status: creating sapi/fpm/status.html
  2413. config.status: creating sapi/phpdbg/phpdbg.1
  2414. config.status: creating sapi/cgi/php-cgi.1
  2415. config.status: creating ext/phar/phar.1
  2416. config.status: creating ext/phar/phar.phar.1
  2417. config.status: creating main/php_config.h
  2418. config.status: executing default commands
  2419. configure: WARNING: unrecognized options: --with-mcrypt, --with-mysql, --enable-gd-native-ttf, --with-t1lib
  2420.  
  2421. Fri Mar  8 21:49:07 CET 2019
  2422. Success: PHP configure ok
  2423.  
  2424. service php-fpm restart
  2425. Gracefully shutting down php-fpm . done
  2426. Starting php-fpm  done
  2427.                ____   _   _  ____       __  __         _        
  2428.               |  _ \ | | | ||  _ \  _  |  \/  |  __ _ | | __ ___
  2429.               | |_) || |_| || |_) |(_) | |\/| | / _` || |/ // _ \
  2430.               |  __/ |  _  ||  __/  _  | |  | || (_| ||   <|  __/
  2431.               |_|    |_| |_||_|    (_) |_|  |_| \__,_||_|\_\\___|
  2432.                                                                  
  2433. PHPMUVER = 7.3
  2434. PHP_PGO = y
  2435. make -j4 prof-gen
  2436. CCACHE_DISABLE=1 make PROF_FLAGS=-fprofile-generate all
  2437. make[1]: Entering directory `/svr-setup/php-7.3.2/fpm-build'
  2438. /bin/sh /svr-setup/php-7.3.2/fpm-build/libtool --silent --preserve-dup-deps --mode=compile ccache /opt/rh/devtoolset-8/root/usr/bin/gcc -Iext/date/lib -DZEND_ENABLE_STATIC_TSRMLS_CACHE=1 -DHAVE_TIMELIB_CONFIG_H=1 -Iext/date/ -I/svr-setup/php-7.3.2/ext/date/ -DPHP_ATOM_INC -I/svr-setup/php-7.3.2/fpm-build/include -I/svr-setup/php-7.3.2/fpm-build/main -I/svr-setup/php-7.3.2 -I/svr-setup/php-7.3.2/fpm-build/ext/date/lib -I/svr-setup/php-7.3.2/ext/date/lib -I/usr/include/libxml2 -I/usr/include/enchant -I/usr/X11 -I/usr/include/freetype2 -I/usr/include/libpng15 -I/usr/local/include -I/usr/include/imap -I/svr-setup/php-7.3.2/ext/mbstring/oniguruma -I/svr-setup/php-7.3.2/fpm-build/ext/mbstring/oniguruma -I/svr-setup/php-7.3.2/ext/mbstring/libmbfl -I/svr-setup/php-7.3.2/fpm-build/ext/mbstring/libmbfl -I/svr-setup/php-7.3.2/ext/mbstring/libmbfl/mbfl -I/svr-setup/php-7.3.2/fpm-build/ext/mbstring/libmbfl/mbfl -I/svr-setup/php-7.3.2/ext/sqlite3/libsqlite -I/usr/include/pspell -I/svr-setup/php-7.3.2/fpm-build/TSRM -I/svr-setup/php-7.3.2/fpm-build/Zend -I/svr-setup/php-7.3.2/main -I/svr-setup/php-7.3.2/Zend -I/svr-setup/php-7.3.2/TSRM -I/svr-setup/php-7.3.2/fpm-build/    -I/usr/include -O3 -m64 -march=x86-64 -pipe -gsplit-dwarf -Wno-deprecated-declarations -Wimplicit-fallthrough=0 -fcode-hoisting -Wno-cast-function-type -Wno-error=cast-align -Wno-implicit-function-declaration -Wno-builtin-declaration-mismatch -fvisibility=hidden -DZEND_SIGNALS -fprofile-generate  -c /svr-setup/php-7.3.2/ext/date/php_date.c -o ext/date/php_date.lo
  2439. /bin/sh /svr-setup/php-7.3.2/fpm-build/libtool --silent --preserve-dup-deps --mode=compile ccache /opt/rh/devtoolset-8/root/usr/bin/gcc -Iext/date/lib -DZEND_ENABLE_STATIC_TSRMLS_CACHE=1 -DHAVE_TIMELIB_CONFIG_H=1 -Iext/date/ -I/svr-setup/php-7.3.2/ext/date/ -DPHP_ATOM_INC -I/svr-setup/php-7.3.2/fpm-build/include -I/svr-setup/php-7.3.2/fpm-build/main -I/svr-setup/php-7.3.2 -I/svr-setup/php-7.3.2/fpm-build/ext/date/lib -I/svr-setup/php-7.3.2/ext/date/lib -I/usr/include/libxml2 -I/usr/include/enchant -I/usr/X11 -I/usr/include/freetype2 -I/usr/include/libpng15 -I/usr/local/include -I/usr/include/imap -I/svr-setup/php-7.3.2/ext/mbstring/oniguruma -I/svr-setup/php-7.3.2/fpm-build/ext/mbstring/oniguruma -I/svr-setup/php-7.3.2/ext/mbstring/libmbfl -I/svr-setup/php-7.3.2/fpm-build/ext/mbstring/libmbfl -I/svr-setup/php-7.3.2/ext/mbstring/libmbfl/mbfl -I/svr-setup/php-7.3.2/fpm-build/ext/mbstring/libmbfl/mbfl -I/svr-setup/php-7.3.2/ext/sqlite3/libsqlite -I/usr/include/pspell -I/svr-setup/php-7.3.2/fpm-build/TSRM -I/svr-setup/php-7.3.2/fpm-build/Zend -I/svr-setup/php-7.3.2/main -I/svr-setup/php-7.3.2/Zend -I/svr-setup/php-7.3.2/TSRM -I/svr-setup/php-7.3.2/fpm-build/    -I/usr/include -O3 -m64 -march=x86-64 -pipe -gsplit-dwarf -Wno-deprecated-declarations -Wimplicit-fallthrough=0 -fcode-hoisting -Wno-cast-function-type -Wno-error=cast-align -Wno-implicit-function-declaration -Wno-builtin-declaration-mismatch -fvisibility=hidden -DZEND_SIGNALS -fprofile-generate  -c /svr-setup/php-7.3.2/ext/date/lib/astro.c -o ext/date/lib/astro.lo
  2440. /bin/sh /svr-setup/php-7.3.2/fpm-build/libtool --silent --preserve-dup-deps --mode=compile ccache /opt/rh/devtoolset-8/root/usr/bin/gcc -Iext/date/lib -DZEND_ENABLE_STATIC_TSRMLS_CACHE=1 -DHAVE_TIMELIB_CONFIG_H=1 -Iext/date/ -I/svr-setup/php-7.3.2/ext/date/ -DPHP_ATOM_INC -I/svr-setup/php-7.3.2/fpm-build/include -I/svr-setup/php-7.3.2/fpm-build/main -I/svr-setup/php-7.3.2 -I/svr-setup/php-7.3.2/fpm-build/ext/date/lib -I/svr-setup/php-7.3.2/ext/date/lib -I/usr/include/libxml2 -I/usr/include/enchant -I/usr/X11 -I/usr/include/freetype2 -I/usr/include/libpng15 -I/usr/local/include -I/usr/include/imap -I/svr-setup/php-7.3.2/ext/mbstring/oniguruma -I/svr-setup/php-7.3.2/fpm-build/ext/mbstring/oniguruma -I/svr-setup/php-7.3.2/ext/mbstring/libmbfl -I/svr-setup/php-7.3.2/fpm-build/ext/mbstring/libmbfl -I/svr-setup/php-7.3.2/ext/mbstring/libmbfl/mbfl -I/svr-setup/php-7.3.2/fpm-build/ext/mbstring/libmbfl/mbfl -I/svr-setup/php-7.3.2/ext/sqlite3/libsqlite -I/usr/include/pspell -I/svr-setup/php-7.3.2/fpm-build/TSRM -I/svr-setup/php-7.3.2/fpm-build/Zend -I/svr-setup/php-7.3.2/main -I/svr-setup/php-7.3.2/Zend -I/svr-setup/php-7.3.2/TSRM -I/svr-setup/php-7.3.2/fpm-build/    -I/usr/include -O3 -m64 -march=x86-64 -pipe -gsplit-dwarf -Wno-deprecated-declarations -Wimplicit-fallthrough=0 -fcode-hoisting -Wno-cast-function-type -Wno-error=cast-align -Wno-implicit-function-declaration -Wno-builtin-declaration-mismatch -fvisibility=hidden -DZEND_SIGNALS -fprofile-generate  -c /svr-setup/php-7.3.2/ext/date/lib/dow.c -o ext/date/lib/dow.lo
  2441. /bin/sh /svr-setup/php-7.3.2/fpm-build/libtool --silent --preserve-dup-deps --mode=compile ccache /opt/rh/devtoolset-8/root/usr/bin/gcc -Iext/date/lib -DZEND_ENABLE_STATIC_TSRMLS_CACHE=1 -DHAVE_TIMELIB_CONFIG_H=1 -Iext/date/ -I/svr-setup/php-7.3.2/ext/date/ -DPHP_ATOM_INC -I/svr-setup/php-7.3.2/fpm-build/include -I/svr-setup/php-7.3.2/fpm-build/main -I/svr-setup/php-7.3.2 -I/svr-setup/php-7.3.2/fpm-build/ext/date/lib -I/svr-setup/php-7.3.2/ext/date/lib -I/usr/include/libxml2 -I/usr/include/enchant -I/usr/X11 -I/usr/include/freetype2 -I/usr/include/libpng15 -I/usr/local/include -I/usr/include/imap -I/svr-setup/php-7.3.2/ext/mbstring/oniguruma -I/svr-setup/php-7.3.2/fpm-build/ext/mbstring/oniguruma -I/svr-setup/php-7.3.2/ext/mbstring/libmbfl -I/svr-setup/php-7.3.2/fpm-build/ext/mbstring/libmbfl -I/svr-setup/php-7.3.2/ext/mbstring/libmbfl/mbfl -I/svr-setup/php-7.3.2/fpm-build/ext/mbstring/libmbfl/mbfl -I/svr-setup/php-7.3.2/ext/sqlite3/libsqlite -I/usr/include/pspell -I/svr-setup/php-7.3.2/fpm-build/TSRM -I/svr-setup/php-7.3.2/fpm-build/Zend -I/svr-setup/php-7.3.2/main -I/svr-setup/php-7.3.2/Zend -I/svr-setup/php-7.3.2/TSRM -I/svr-setup/php-7.3.2/fpm-build/    -I/usr/include -O3 -m64 -march=x86-64 -pipe -gsplit-dwarf -Wno-deprecated-declarations -Wimplicit-fallthrough=0 -fcode-hoisting -Wno-cast-function-type -Wno-error=cast-align -Wno-implicit-function-declaration -Wno-builtin-declaration-mismatch -fvisibility=hidden -DZEND_SIGNALS -fprofile-generate  -c /svr-setup/php-7.3.2/ext/date/lib/parse_date.c -o ext/date/lib/parse_date.lo
  2442. /svr-setup/php-7.3.2/ext/date/lib/astro.c: In function ‘astro_revolution’:
  2443. /svr-setup/php-7.3.2/ext/date/lib/astro.c:76:2: internal compiler error: Illegal instruction
  2444.  return (x - 360.0 * floor(x * INV360));
  2445.  ^~~~~~
  2446. Please submit a full bug report,
  2447. with preprocessed source if appropriate.
  2448. See <http://bugzilla.redhat.com/bugzilla> for instructions.
  2449. /svr-setup/php-7.3.2/ext/date/php_date.c: In function ‘date_object_get_properties_interval’:
  2450. /svr-setup/php-7.3.2/ext/date/php_date.c:2491:2: internal compiler error: Illegal instruction
  2451.  ZVAL_DOUBLE(&zv, (double)intervalobj->diff->us / 1000000.0);
  2452.  ^~~~~~~~~~~
  2453. Please submit a full bug report,
  2454. with preprocessed source if appropriate.
  2455. See <http://bugzilla.redhat.com/bugzilla> for instructions.
  2456. /bin/sh /svr-setup/php-7.3.2/fpm-build/libtool --silent --preserve-dup-deps --mode=compile ccache /opt/rh/devtoolset-8/root/usr/bin/gcc -Iext/date/lib -DZEND_ENABLE_STATIC_TSRMLS_CACHE=1 -DHAVE_TIMELIB_CONFIG_H=1 -Iext/date/ -I/svr-setup/php-7.3.2/ext/date/ -DPHP_ATOM_INC -I/svr-setup/php-7.3.2/fpm-build/include -I/svr-setup/php-7.3.2/fpm-build/main -I/svr-setup/php-7.3.2 -I/svr-setup/php-7.3.2/fpm-build/ext/date/lib -I/svr-setup/php-7.3.2/ext/date/lib -I/usr/include/libxml2 -I/usr/include/enchant -I/usr/X11 -I/usr/include/freetype2 -I/usr/include/libpng15 -I/usr/local/include -I/usr/include/imap -I/svr-setup/php-7.3.2/ext/mbstring/oniguruma -I/svr-setup/php-7.3.2/fpm-build/ext/mbstring/oniguruma -I/svr-setup/php-7.3.2/ext/mbstring/libmbfl -I/svr-setup/php-7.3.2/fpm-build/ext/mbstring/libmbfl -I/svr-setup/php-7.3.2/ext/mbstring/libmbfl/mbfl -I/svr-setup/php-7.3.2/fpm-build/ext/mbstring/libmbfl/mbfl -I/svr-setup/php-7.3.2/ext/sqlite3/libsqlite -I/usr/include/pspell -I/svr-setup/php-7.3.2/fpm-build/TSRM -I/svr-setup/php-7.3.2/fpm-build/Zend -I/svr-setup/php-7.3.2/main -I/svr-setup/php-7.3.2/Zend -I/svr-setup/php-7.3.2/TSRM -I/svr-setup/php-7.3.2/fpm-build/    -I/usr/include -O3 -m64 -march=x86-64 -pipe -gsplit-dwarf -Wno-deprecated-declarations -Wimplicit-fallthrough=0 -fcode-hoisting -Wno-cast-function-type -Wno-error=cast-align -Wno-implicit-function-declaration -Wno-builtin-declaration-mismatch -fvisibility=hidden -DZEND_SIGNALS -fprofile-generate  -c /svr-setup/php-7.3.2/ext/date/lib/parse_tz.c -o ext/date/lib/parse_tz.lo
  2457. Preprocessed source stored into /tmp/ccSEJDHo.out file, please attach this to your bugreport.
  2458. make[1]: *** [ext/date/lib/astro.lo] Error 1
  2459. make[1]: *** Waiting for unfinished jobs....
  2460. Preprocessed source stored into /tmp/ccyBFytz.out file, please attach this to your bugreport.
  2461. make[1]: *** [ext/date/php_date.lo] Error 1
  2462. make[1]: Leaving directory `/svr-setup/php-7.3.2/fpm-build'
  2463. make: *** [prof-gen] Error 2
  2464.  
  2465. real    0m20.458s
  2466. user    0m22.428s
  2467. sys     0m1.587s
  2468. /svr-setup/php_pgo_training_scripts /svr-setup/php-7.3.2/fpm-build
  2469. Saved working directory and index state WIP on master: 3f4a289 Merge pull request #1 from bogdanandone/master
  2470. HEAD is now at 3f4a289 Merge pull request #1 from bogdanandone/master
  2471. Already up-to-date.
  2472. /svr-setup/php-7.3.2/fpm-build
  2473. inc/php_upgrade.inc: line 625: ./sapi/cli/php: No such file or directory
  2474. time ./sapi/cgi/php-cgi -T2,80 ../Zend/bench.php
  2475. inc/php_upgrade.inc: line 627: ./sapi/cgi/php-cgi: No such file or directory
  2476.  
  2477. real    0m0.001s
  2478. user    0m0.001s
  2479. sys     0m0.000s
  2480. time ./sapi/cgi/php-cgi -T2,80 ../Zend/micro_bench.php
  2481. inc/php_upgrade.inc: line 629: ./sapi/cgi/php-cgi: No such file or directory
  2482.  
  2483. real    0m0.001s
  2484. user    0m0.001s
  2485. sys     0m0.000s
  2486. ./sapi/cgi/php-cgi -T80 /svr-setup/php_pgo_training_scripts/index.php
  2487. inc/php_upgrade.inc: line 631: ./sapi/cgi/php-cgi: No such file or directory
  2488.  
  2489. real    0m0.001s
  2490. user    0m0.000s
  2491. sys     0m0.001s
  2492. ./sapi/cgi/php-cgi -T80 /home/nginx/domains/pijanitvor.com/public/index.php
  2493. inc/php_upgrade.inc: line 634: ./sapi/cgi/php-cgi: No such file or directory
  2494.  
  2495. real    0m0.001s
  2496. user    0m0.001s
  2497. sys     0m0.000s
  2498. make prof-clean
  2499. find . -name \*.lo -o -name \*.o | xargs rm -f
  2500. find . -name \*.la -o -name \*.a | xargs rm -f
  2501. find . -name \*.so | xargs rm -f
  2502. rm -f libphp7.la sapi/cli/php sapi/cgi/php-cgi  sapi/fpm/php-fpm libphp7.la modules/* libs/*
  2503.  
  2504. real    0m0.029s
  2505. user    0m0.015s
  2506. sys     0m0.018s
  2507. make -j4 prof-use
  2508. CCACHE_DISABLE=1 make PROF_FLAGS=-fprofile-use all
  2509. make[1]: Entering directory `/svr-setup/php-7.3.2/fpm-build'
  2510. /bin/sh /svr-setup/php-7.3.2/fpm-build/libtool --silent --preserve-dup-deps --mode=compile ccache /opt/rh/devtoolset-8/root/usr/bin/gcc -Iext/date/lib -DZEND_ENABLE_STATIC_TSRMLS_CACHE=1 -DHAVE_TIMELIB_CONFIG_H=1 -Iext/date/ -I/svr-setup/php-7.3.2/ext/date/ -DPHP_ATOM_INC -I/svr-setup/php-7.3.2/fpm-build/include -I/svr-setup/php-7.3.2/fpm-build/main -I/svr-setup/php-7.3.2 -I/svr-setup/php-7.3.2/fpm-build/ext/date/lib -I/svr-setup/php-7.3.2/ext/date/lib -I/usr/include/libxml2 -I/usr/include/enchant -I/usr/X11 -I/usr/include/freetype2 -I/usr/include/libpng15 -I/usr/local/include -I/usr/include/imap -I/svr-setup/php-7.3.2/ext/mbstring/oniguruma -I/svr-setup/php-7.3.2/fpm-build/ext/mbstring/oniguruma -I/svr-setup/php-7.3.2/ext/mbstring/libmbfl -I/svr-setup/php-7.3.2/fpm-build/ext/mbstring/libmbfl -I/svr-setup/php-7.3.2/ext/mbstring/libmbfl/mbfl -I/svr-setup/php-7.3.2/fpm-build/ext/mbstring/libmbfl/mbfl -I/svr-setup/php-7.3.2/ext/sqlite3/libsqlite -I/usr/include/pspell -I/svr-setup/php-7.3.2/fpm-build/TSRM -I/svr-setup/php-7.3.2/fpm-build/Zend -I/svr-setup/php-7.3.2/main -I/svr-setup/php-7.3.2/Zend -I/svr-setup/php-7.3.2/TSRM -I/svr-setup/php-7.3.2/fpm-build/    -I/usr/include -O3 -m64 -march=x86-64 -pipe -gsplit-dwarf -Wno-deprecated-declarations -Wimplicit-fallthrough=0 -fcode-hoisting -Wno-cast-function-type -Wno-error=cast-align -Wno-implicit-function-declaration -Wno-builtin-declaration-mismatch -fvisibility=hidden -DZEND_SIGNALS -fprofile-use  -c /svr-setup/php-7.3.2/ext/date/php_date.c -o ext/date/php_date.lo
  2511. /bin/sh /svr-setup/php-7.3.2/fpm-build/libtool --silent --preserve-dup-deps --mode=compile ccache /opt/rh/devtoolset-8/root/usr/bin/gcc -Iext/date/lib -DZEND_ENABLE_STATIC_TSRMLS_CACHE=1 -DHAVE_TIMELIB_CONFIG_H=1 -Iext/date/ -I/svr-setup/php-7.3.2/ext/date/ -DPHP_ATOM_INC -I/svr-setup/php-7.3.2/fpm-build/include -I/svr-setup/php-7.3.2/fpm-build/main -I/svr-setup/php-7.3.2 -I/svr-setup/php-7.3.2/fpm-build/ext/date/lib -I/svr-setup/php-7.3.2/ext/date/lib -I/usr/include/libxml2 -I/usr/include/enchant -I/usr/X11 -I/usr/include/freetype2 -I/usr/include/libpng15 -I/usr/local/include -I/usr/include/imap -I/svr-setup/php-7.3.2/ext/mbstring/oniguruma -I/svr-setup/php-7.3.2/fpm-build/ext/mbstring/oniguruma -I/svr-setup/php-7.3.2/ext/mbstring/libmbfl -I/svr-setup/php-7.3.2/fpm-build/ext/mbstring/libmbfl -I/svr-setup/php-7.3.2/ext/mbstring/libmbfl/mbfl -I/svr-setup/php-7.3.2/fpm-build/ext/mbstring/libmbfl/mbfl -I/svr-setup/php-7.3.2/ext/sqlite3/libsqlite -I/usr/include/pspell -I/svr-setup/php-7.3.2/fpm-build/TSRM -I/svr-setup/php-7.3.2/fpm-build/Zend -I/svr-setup/php-7.3.2/main -I/svr-setup/php-7.3.2/Zend -I/svr-setup/php-7.3.2/TSRM -I/svr-setup/php-7.3.2/fpm-build/    -I/usr/include -O3 -m64 -march=x86-64 -pipe -gsplit-dwarf -Wno-deprecated-declarations -Wimplicit-fallthrough=0 -fcode-hoisting -Wno-cast-function-type -Wno-error=cast-align -Wno-implicit-function-declaration -Wno-builtin-declaration-mismatch -fvisibility=hidden -DZEND_SIGNALS -fprofile-use  -c /svr-setup/php-7.3.2/ext/date/lib/astro.c -o ext/date/lib/astro.lo
  2512. /bin/sh /svr-setup/php-7.3.2/fpm-build/libtool --silent --preserve-dup-deps --mode=compile ccache /opt/rh/devtoolset-8/root/usr/bin/gcc -Iext/date/lib -DZEND_ENABLE_STATIC_TSRMLS_CACHE=1 -DHAVE_TIMELIB_CONFIG_H=1 -Iext/date/ -I/svr-setup/php-7.3.2/ext/date/ -DPHP_ATOM_INC -I/svr-setup/php-7.3.2/fpm-build/include -I/svr-setup/php-7.3.2/fpm-build/main -I/svr-setup/php-7.3.2 -I/svr-setup/php-7.3.2/fpm-build/ext/date/lib -I/svr-setup/php-7.3.2/ext/date/lib -I/usr/include/libxml2 -I/usr/include/enchant -I/usr/X11 -I/usr/include/freetype2 -I/usr/include/libpng15 -I/usr/local/include -I/usr/include/imap -I/svr-setup/php-7.3.2/ext/mbstring/oniguruma -I/svr-setup/php-7.3.2/fpm-build/ext/mbstring/oniguruma -I/svr-setup/php-7.3.2/ext/mbstring/libmbfl -I/svr-setup/php-7.3.2/fpm-build/ext/mbstring/libmbfl -I/svr-setup/php-7.3.2/ext/mbstring/libmbfl/mbfl -I/svr-setup/php-7.3.2/fpm-build/ext/mbstring/libmbfl/mbfl -I/svr-setup/php-7.3.2/ext/sqlite3/libsqlite -I/usr/include/pspell -I/svr-setup/php-7.3.2/fpm-build/TSRM -I/svr-setup/php-7.3.2/fpm-build/Zend -I/svr-setup/php-7.3.2/main -I/svr-setup/php-7.3.2/Zend -I/svr-setup/php-7.3.2/TSRM -I/svr-setup/php-7.3.2/fpm-build/    -I/usr/include -O3 -m64 -march=x86-64 -pipe -gsplit-dwarf -Wno-deprecated-declarations -Wimplicit-fallthrough=0 -fcode-hoisting -Wno-cast-function-type -Wno-error=cast-align -Wno-implicit-function-declaration -Wno-builtin-declaration-mismatch -fvisibility=hidden -DZEND_SIGNALS -fprofile-use  -c /svr-setup/php-7.3.2/ext/date/lib/dow.c -o ext/date/lib/dow.lo
  2513. /bin/sh /svr-setup/php-7.3.2/fpm-build/libtool --silent --preserve-dup-deps --mode=compile ccache /opt/rh/devtoolset-8/root/usr/bin/gcc -Iext/date/lib -DZEND_ENABLE_STATIC_TSRMLS_CACHE=1 -DHAVE_TIMELIB_CONFIG_H=1 -Iext/date/ -I/svr-setup/php-7.3.2/ext/date/ -DPHP_ATOM_INC -I/svr-setup/php-7.3.2/fpm-build/include -I/svr-setup/php-7.3.2/fpm-build/main -I/svr-setup/php-7.3.2 -I/svr-setup/php-7.3.2/fpm-build/ext/date/lib -I/svr-setup/php-7.3.2/ext/date/lib -I/usr/include/libxml2 -I/usr/include/enchant -I/usr/X11 -I/usr/include/freetype2 -I/usr/include/libpng15 -I/usr/local/include -I/usr/include/imap -I/svr-setup/php-7.3.2/ext/mbstring/oniguruma -I/svr-setup/php-7.3.2/fpm-build/ext/mbstring/oniguruma -I/svr-setup/php-7.3.2/ext/mbstring/libmbfl -I/svr-setup/php-7.3.2/fpm-build/ext/mbstring/libmbfl -I/svr-setup/php-7.3.2/ext/mbstring/libmbfl/mbfl -I/svr-setup/php-7.3.2/fpm-build/ext/mbstring/libmbfl/mbfl -I/svr-setup/php-7.3.2/ext/sqlite3/libsqlite -I/usr/include/pspell -I/svr-setup/php-7.3.2/fpm-build/TSRM -I/svr-setup/php-7.3.2/fpm-build/Zend -I/svr-setup/php-7.3.2/main -I/svr-setup/php-7.3.2/Zend -I/svr-setup/php-7.3.2/TSRM -I/svr-setup/php-7.3.2/fpm-build/    -I/usr/include -O3 -m64 -march=x86-64 -pipe -gsplit-dwarf -Wno-deprecated-declarations -Wimplicit-fallthrough=0 -fcode-hoisting -Wno-cast-function-type -Wno-error=cast-align -Wno-implicit-function-declaration -Wno-builtin-declaration-mismatch -fvisibility=hidden -DZEND_SIGNALS -fprofile-use  -c /svr-setup/php-7.3.2/ext/date/lib/parse_date.c -o ext/date/lib/parse_date.lo
  2514. /svr-setup/php-7.3.2/ext/date/lib/astro.c: In function ‘astro_revolution’:
  2515. /svr-setup/php-7.3.2/ext/date/lib/astro.c:76:2: internal compiler error: Illegal instruction
  2516.  return (x - 360.0 * floor(x * INV360));
  2517.  ^~~~~~
  2518. Please submit a full bug report,
  2519. with preprocessed source if appropriate.
  2520. See <http://bugzilla.redhat.com/bugzilla> for instructions.
  2521. /svr-setup/php-7.3.2/ext/date/php_date.c: In function ‘date_object_get_properties_interval’:
  2522. /svr-setup/php-7.3.2/ext/date/php_date.c:2491:2: internal compiler error: Illegal instruction
  2523.  ZVAL_DOUBLE(&zv, (double)intervalobj->diff->us / 1000000.0);
  2524.  ^~~~~~~~~~~
  2525. Please submit a full bug report,
  2526. with preprocessed source if appropriate.
  2527. See <http://bugzilla.redhat.com/bugzilla> for instructions.
  2528. /bin/sh /svr-setup/php-7.3.2/fpm-build/libtool --silent --preserve-dup-deps --mode=compile ccache /opt/rh/devtoolset-8/root/usr/bin/gcc -Iext/date/lib -DZEND_ENABLE_STATIC_TSRMLS_CACHE=1 -DHAVE_TIMELIB_CONFIG_H=1 -Iext/date/ -I/svr-setup/php-7.3.2/ext/date/ -DPHP_ATOM_INC -I/svr-setup/php-7.3.2/fpm-build/include -I/svr-setup/php-7.3.2/fpm-build/main -I/svr-setup/php-7.3.2 -I/svr-setup/php-7.3.2/fpm-build/ext/date/lib -I/svr-setup/php-7.3.2/ext/date/lib -I/usr/include/libxml2 -I/usr/include/enchant -I/usr/X11 -I/usr/include/freetype2 -I/usr/include/libpng15 -I/usr/local/include -I/usr/include/imap -I/svr-setup/php-7.3.2/ext/mbstring/oniguruma -I/svr-setup/php-7.3.2/fpm-build/ext/mbstring/oniguruma -I/svr-setup/php-7.3.2/ext/mbstring/libmbfl -I/svr-setup/php-7.3.2/fpm-build/ext/mbstring/libmbfl -I/svr-setup/php-7.3.2/ext/mbstring/libmbfl/mbfl -I/svr-setup/php-7.3.2/fpm-build/ext/mbstring/libmbfl/mbfl -I/svr-setup/php-7.3.2/ext/sqlite3/libsqlite -I/usr/include/pspell -I/svr-setup/php-7.3.2/fpm-build/TSRM -I/svr-setup/php-7.3.2/fpm-build/Zend -I/svr-setup/php-7.3.2/main -I/svr-setup/php-7.3.2/Zend -I/svr-setup/php-7.3.2/TSRM -I/svr-setup/php-7.3.2/fpm-build/    -I/usr/include -O3 -m64 -march=x86-64 -pipe -gsplit-dwarf -Wno-deprecated-declarations -Wimplicit-fallthrough=0 -fcode-hoisting -Wno-cast-function-type -Wno-error=cast-align -Wno-implicit-function-declaration -Wno-builtin-declaration-mismatch -fvisibility=hidden -DZEND_SIGNALS -fprofile-use  -c /svr-setup/php-7.3.2/ext/date/lib/parse_tz.c -o ext/date/lib/parse_tz.lo
  2529. Preprocessed source stored into /tmp/cc342wps.out file, please attach this to your bugreport.
  2530. make[1]: *** [ext/date/lib/astro.lo] Error 1
  2531. make[1]: *** Waiting for unfinished jobs....
  2532. Preprocessed source stored into /tmp/cch0hYXA.out file, please attach this to your bugreport.
  2533. make[1]: *** [ext/date/php_date.lo] Error 1
  2534. make[1]: Leaving directory `/svr-setup/php-7.3.2/fpm-build'
  2535. make: *** [prof-use] Error 2
  2536.  
  2537. real    0m24.573s
  2538. user    0m26.824s
  2539. sys     0m1.200s
  2540.  
  2541. Fri Mar  8 21:49:54 CET 2019
  2542. Error: 2, PHP make failed (123.09beta01.b109)
  2543.  
  2544.               total        used        free      shared  buff/cache   available
  2545. Mem:           7821        3477        1432          33        2911        3888
  2546. Swap:          1023           0        1023
  2547.  
  2548. report errors on the forums at community.centminmod.com/forums/8/
  2549.  
  2550.               total        used        free      shared  buff/cache   available
  2551. Mem:           7821        3477        1431          33        2911        3887
  2552. Swap:          1023           0        1023
  2553.  
  2554. Filesystem     Type      Size  Used Avail Use% Mounted on
  2555. /dev/vda1      xfs       160G   81G   80G  51% /
  2556. devtmpfs       devtmpfs  3.9G     0  3.9G   0% /dev
  2557. tmpfs          tmpfs     3.9G     0  3.9G   0% /dev/shm
  2558. tmpfs          tmpfs     3.9G   17M  3.9G   1% /run
  2559. tmpfs          tmpfs     3.9G     0  3.9G   0% /sys/fs/cgroup
  2560. tmpfs          tmpfs     783M     0  783M   0% /run/user/0
  2561.  
  2562. CPU: Intel(R) Xeon(R) CPU E5-2687W v3 @ 3.10GHz (4)
  2563.  
  2564. version increment history
  2565. 123.09beta01.b108 #Fri Mar  8 01:18:34 CET 2019
  2566. 123.09beta01.b109 #Fri Mar  8 01:18:47 CET 2019
  2567. 123.09beta01.b109 #Fri Mar  8 21:45:00 CET 2019
  2568. 123.09beta01.b109 #Fri Mar  8 21:45:16 CET 2019
  2569. 123.09beta01.b109 #Fri Mar  8 21:47:08 CET 2019
  2570.  
  2571. last Centmin Mod local git commit entry
  2572. /usr/local/src/centminmod /svr-setup/php-7.3.2/fpm-build
  2573.  
  2574. 17d671b George Liu Fri, 8 Mar 2019 22:57:26 +1000
  2575. move disk_cleanups function to end of routine in 123.09beta01
  2576.  
  2577. 1       0       centmin.sh
  2578. 0       1       inc/centminfinish.inc
  2579.  2 files changed, 1 insertion(+), 1 deletion(-)
  2580. /svr-setup/php-7.3.2/fpm-build
  2581.  
  2582. Total PHP Upgrade Time: 159.046876601 seconds
RAW Paste Data
We use cookies for various purposes including analytics. By continuing to use Pastebin, you agree to our use of cookies as described in the Cookies Policy. OK, I Understand
 
Top