SHARE
TWEET

Untitled

a guest Mar 11th, 2017 125 Never
Not a member of Pastebin yet? Sign Up, it unlocks many cool features!
  1. RTEMS Tools Project - Source Builder Error Report
  2.  Build: error: building sparc-rtems4.12-gdb-7.12-x86_64-linux-gnu-1
  3.  Command Line: ../source-builder/sb-set-builder --prefix=/home/pitersk/development/rtems/4.12 4.12/rtems-sparc
  4.  Python: 2.7.12+ (default, Sep 17 2016, 12:08:02) [GCC 6.2.0 20160914]
  5.  git://git.rtems.org/rtems-source-builder.git/origin/10d9e2dfacf7211ea323d6d89b3a0552b8b0b597-modified
  6.  Linux pitersk-GL62-6QD 4.8.0-39-generic #42-Ubuntu SMP Mon Feb 20 11:47:27 UTC 2017 x86_64
  7. Tail of the build log:
  8. checking for struct ptrace_lwpinfo.pl_tdname... no
  9. checking for struct ptrace_lwpinfo.pl_syscall_code... no
  10. checking for gregset_t in sys/procfs.h... no
  11. checking for fpregset_t in sys/procfs.h... no
  12. checking for prgregset_t in sys/procfs.h... yes
  13. checking for prfpregset_t in sys/procfs.h... yes
  14. checking for prgregset32_t in sys/procfs.h... no
  15. checking for lwpid_t in sys/procfs.h... yes
  16. checking for psaddr_t in sys/procfs.h... yes
  17. checking for prsysent_t in sys/procfs.h... no
  18. checking for pr_sigset_t in sys/procfs.h... no
  19. checking for pr_sigaction64_t in sys/procfs.h... no
  20. checking for pr_siginfo64_t in sys/procfs.h... no
  21. checking whether prfpregset_t type is broken... no
  22. checking for long long support in compiler... yes
  23. checking for long long support in printf... yes
  24. checking for decfloat support in printf... no
  25. checking for long double support in compiler... yes
  26. checking for long double support in printf... yes
  27. checking for long double support in scanf... yes
  28. checking for the dynamic export flag... -rdynamic
  29. checking whether <thread_db.h> has TD_NOTALLOC... yes
  30. checking whether <thread_db.h> has TD_VERSION... yes
  31. checking whether <thread_db.h> has TD_NOTLS... yes
  32. checking whether ADDR_NO_RANDOMIZE is declared... yes
  33. checking compiler warning flags...  -Wall -Wpointer-arith -Wno-unused -Wunused-value -Wunused-function -Wno-switch -Wno-char-subscripts -Wempty-body -Wunused-but-set-parameter -Wunused-but-set-variable -Wno-sign-compare -Wno-write-strings -Wno-narrowing -Wformat-nonliteral
  34. checking for cygwin... no
  35. checking for ELF support in BFD... yes
  36. checking for library containing dlopen... (cached) -ldl
  37. checking for Mach-O support in BFD... no
  38. checking whether to use lzma... auto
  39. checking for liblzma... no
  40. checking for X... no
  41. enable_sim = yes
  42. enableval = yes
  43. checking whether to use babeltrace... auto
  44. checking for libbabeltrace... no
  45. configure: WARNING: babeltrace is missing or unusable; GDB is unable to read CTF data.
  46. checking for xsltproc... no
  47. configure: updating cache ./config.cache
  48. configure: creating ./config.status
  49. config.status: creating jit-reader.h
  50. config.status: creating gcore
  51. config.status: creating Makefile
  52. config.status: creating gdb-gdb.gdb
  53. config.status: creating doc/Makefile
  54. config.status: creating data-directory/Makefile
  55. config.status: creating config.h
  56. config.status: executing depdir commands
  57. mkdir -p -- .deps
  58. === configuring in testsuite (/home/pitersk/development/development2/rtems/rsb/rtems-source-builder/rtems/build/sparc-rtems4.12-gdb-7.12-x86_64-linux-gnu-1/build/gdb/testsuite)
  59. configure: running /bin/bash ../../../gdb-7.12/gdb/testsuite/configure --disable-option-checking '--prefix=/home/pitersk/development/rtems/4.12'  '--verbose' '--disable-nls' '--without-included-gettext' '--disable-win32-registry' '--disable-werror' '--enable-sim' '--without-zlib' '--with-expat' '--with-python' '--bindir=/home/pitersk/development/rtems/4.12/bin' '--exec-prefix=/home/pitersk/development/rtems/4.12' '--includedir=/home/pitersk/development/rtems/4.12/include' '--libdir=/home/pitersk/development/rtems/4.12/lib' '--mandir=/home/pitersk/development/rtems/4.12/share/man' '--infodir=/home/pitersk/development/rtems/4.12/share/info' '--program-transform-name=s&^&sparc-rtems4.12-&' '--build=x86_64-linux-gnu' '--host=x86_64-linux-gnu' '--target=sparc-rtems4.12' 'build_alias=x86_64-linux-gnu' 'host_alias=x86_64-linux-gnu' 'target_alias=sparc-rtems4.12' 'CC=/usr/bin/gcc -O2 -pipe -I/home/pitersk/development/development2/rtems/rsb/rtems-source-builder/rtems/build/tmp/sb-pitersk/4.12/rtems-sparc/home/pitersk/development/rtems/4.12/include' 'CFLAGS=-g -O2' 'LDFLAGS=-static-libstdc++ -static-libgcc -L/home/pitersk/development/development2/rtems/rsb/rtems-source-builder/rtems/build/tmp/sb-pitersk/4.12/rtems-sparc/home/pitersk/development/rtems/4.12/lib' 'CXX=/usr/bin/g++ -O2 -pipe -I/home/pitersk/development/development2/rtems/rsb/rtems-source-builder/rtems/build/tmp/sb-pitersk/4.12/rtems-sparc/home/pitersk/development/rtems/4.12/include' 'CXXFLAGS=-g -O2' 'MAKEINFO=makeinfo --split-size=5000000' 'YACC=bison -y' --cache-file=.././config.cache --srcdir=../../../gdb-7.12/gdb/testsuite
  60. configure: loading cache .././config.cache
  61. checking build system type... (cached) x86_64-pc-linux-gnu
  62. checking host system type... (cached) x86_64-pc-linux-gnu
  63. checking target system type... (cached) sparc-unknown-rtems4.12
  64. checking for make... (cached) make
  65. checking whether make sets $(MAKE)... (cached) yes
  66. checking for x86_64-linux-gnu-gcc... (cached) /usr/bin/gcc -O2 -pipe -I/home/pitersk/development/development2/rtems/rsb/rtems-source-builder/rtems/build/tmp/sb-pitersk/4.12/rtems-sparc/home/pitersk/development/rtems/4.12/include
  67. checking for C compiler default output file name... a.out
  68. checking whether the C compiler works... yes
  69. checking whether we are cross compiling... no
  70. checking for suffix of executables...
  71. checking for suffix of object files... (cached) o
  72. checking whether we are using the GNU C compiler... (cached) yes
  73. checking whether /usr/bin/gcc -O2 -pipe -I/home/pitersk/development/development2/rtems/rsb/rtems-source-builder/rtems/build/tmp/sb-pitersk/4.12/rtems-sparc/home/pitersk/development/rtems/4.12/include accepts -g... (cached) yes
  74. checking for /usr/bin/gcc -O2 -pipe -I/home/pitersk/development/development2/rtems/rsb/rtems-source-builder/rtems/build/tmp/sb-pitersk/4.12/rtems-sparc/home/pitersk/development/rtems/4.12/include option to accept ISO C89... (cached) none needed
  75. checking how to run the C preprocessor... (cached) /usr/bin/gcc -O2 -pipe -I/home/pitersk/development/development2/rtems/rsb/rtems-source-builder/rtems/build/tmp/sb-pitersk/4.12/rtems-sparc/home/pitersk/development/rtems/4.12/include -E
  76. checking for grep that handles long lines and -e... (cached) /bin/grep
  77. checking for egrep... (cached) /bin/grep -E
  78. checking for ANSI C header files... (cached) yes
  79. checking for sys/types.h... (cached) yes
  80. checking for sys/stat.h... (cached) yes
  81. checking for stdlib.h... (cached) yes
  82. checking for string.h... (cached) yes
  83. checking for memory.h... (cached) yes
  84. checking for strings.h... (cached) yes
  85. checking for inttypes.h... (cached) yes
  86. checking for stdint.h... (cached) yes
  87. checking for unistd.h... (cached) yes
  88. checking pthread.h usability... yes
  89. checking pthread.h presence... yes
  90. checking for pthread.h... yes
  91. configure: updating cache .././config.cache
  92. configure: creating ./config.status
  93. config.status: creating lib/pdtrace
  94. config.status: creating Makefile
  95. make[2]: Entering directory '/home/pitersk/development/development2/rtems/rsb/rtems-source-builder/rtems/build/sparc-rtems4.12-gdb-7.12-x86_64-linux-gnu-1/build/sim'
  96. make[3]: Entering directory '/home/pitersk/development/development2/rtems/rsb/rtems-source-builder/rtems/build/sparc-rtems4.12-gdb-7.12-x86_64-linux-gnu-1/build/sim/erc32'
  97. /usr/bin/gcc -O2 -pipe -I/home/pitersk/development/development2/rtems/rsb/rtems-source-builder/rtems/build/tmp/sb-pitersk/4.12/rtems-sparc/home/pitersk/development/rtems/4.12/include -DHAVE_CONFIG_H       -DDEFAULT_INLINE=0      -DFAST_UART -I../../../gdb-7.12/sim/erc32/../..   -I. -I../../../gdb-7.12/sim/erc32 -I../common -I../../../gdb-7.12/sim/erc32/../common -I../../include -I../../../gdb-7.12/sim/erc32/../../include -I../../bfd -I../../../gdb-7.12/sim/erc32/../../bfd -I../../opcodes -I../../../gdb-7.12/sim/erc32/../../opcodes  -g -O2 -c -o sis.o -MT sis.o -MMD -MP -MF .deps/sis.Tpo ../../../gdb-7.12/sim/erc32/sis.c
  98. rm -f tmp-hw.h
  99. /usr/bin/gcc -O2 -pipe -I/home/pitersk/development/development2/rtems/rsb/rtems-source-builder/rtems/build/tmp/sb-pitersk/4.12/rtems-sparc/home/pitersk/development/rtems/4.12/include ../../../gdb-7.12/sim/erc32/../common/gentmap.c -o gentmap -g -O -I. -I../../../gdb-7.12/sim/erc32 -I../common -I../../../gdb-7.12/sim/erc32/../common -I../../include -I../../../gdb-7.12/sim/erc32/../../include -I../../bfd -I../../../gdb-7.12/sim/erc32/../../bfd -I../../opcodes -I../../../gdb-7.12/sim/erc32/../../opcodes  
  100. echo "/* generated by Makefile */" > tmp-hw.h
  101. /bin/bash ../../../gdb-7.12/sim/erc32/../../gdb/common/create-version.sh ../../../gdb-7.12/sim/erc32/../../gdb \
  102.     x86_64-linux-gnu sparc-rtems4.12 version.c
  103. sim_hw=""; \
  104. for hw in $sim_hw ; do \
  105.   echo "extern const struct hw_descriptor dv_${hw}_descriptor[];" ; \
  106. done >> tmp-hw.h
  107. echo "const struct hw_descriptor *hw_descriptors[] = {" >> tmp-hw.h
  108. sim_hw=""; \
  109. for hw in $sim_hw ; do \
  110.   echo "  dv_${hw}_descriptor," ; \
  111. done >> tmp-hw.h
  112. echo "  NULL," >> tmp-hw.h
  113. echo "};" >> tmp-hw.h
  114. mv tmp-hw.h hw-config.h
  115. rm -f tmp-tvals.h tmp-tmap.c
  116. ./gentmap -h >tmp-tvals.h
  117. /bin/bash ../../../gdb-7.12/sim/erc32/../../move-if-change tmp-tvals.h targ-vals.h
  118. ./gentmap -c >tmp-tmap.c
  119. /bin/bash ../../../gdb-7.12/sim/erc32/../../move-if-change tmp-tmap.c targ-map.c
  120. touch stamp-tvals
  121. /usr/bin/gcc -O2 -pipe -I/home/pitersk/development/development2/rtems/rsb/rtems-source-builder/rtems/build/tmp/sb-pitersk/4.12/rtems-sparc/home/pitersk/development/rtems/4.12/include -DHAVE_CONFIG_H       -DDEFAULT_INLINE=0      -DFAST_UART -I../../../gdb-7.12/sim/erc32/../..   -I. -I../../../gdb-7.12/sim/erc32 -I../common -I../../../gdb-7.12/sim/erc32/../common -I../../include -I../../../gdb-7.12/sim/erc32/../../include -I../../bfd -I../../../gdb-7.12/sim/erc32/../../bfd -I../../opcodes -I../../../gdb-7.12/sim/erc32/../../opcodes  -g -O2 -c -o exec.o -MT exec.o -MMD -MP -MF .deps/exec.Tpo ../../../gdb-7.12/sim/erc32/exec.c
  122. /usr/bin/gcc -O2 -pipe -I/home/pitersk/development/development2/rtems/rsb/rtems-source-builder/rtems/build/tmp/sb-pitersk/4.12/rtems-sparc/home/pitersk/development/rtems/4.12/include -DHAVE_CONFIG_H       -DDEFAULT_INLINE=0      -DFAST_UART -I../../../gdb-7.12/sim/erc32/../..   -I. -I../../../gdb-7.12/sim/erc32 -I../common -I../../../gdb-7.12/sim/erc32/../common -I../../include -I../../../gdb-7.12/sim/erc32/../../include -I../../bfd -I../../../gdb-7.12/sim/erc32/../../bfd -I../../opcodes -I../../../gdb-7.12/sim/erc32/../../opcodes  -g -O2 -c -o erc32.o -MT erc32.o -MMD -MP -MF .deps/erc32.Tpo ../../../gdb-7.12/sim/erc32/erc32.c
  123. /usr/bin/gcc -O2 -pipe -I/home/pitersk/development/development2/rtems/rsb/rtems-source-builder/rtems/build/tmp/sb-pitersk/4.12/rtems-sparc/home/pitersk/development/rtems/4.12/include -DHAVE_CONFIG_H       -DDEFAULT_INLINE=0      -DFAST_UART -I../../../gdb-7.12/sim/erc32/../..   -I. -I../../../gdb-7.12/sim/erc32 -I../common -I../../../gdb-7.12/sim/erc32/../common -I../../include -I../../../gdb-7.12/sim/erc32/../../include -I../../bfd -I../../../gdb-7.12/sim/erc32/../../bfd -I../../opcodes -I../../../gdb-7.12/sim/erc32/../../opcodes  -g -O2 -c -o func.o -MT func.o -MMD -MP -MF .deps/func.Tpo ../../../gdb-7.12/sim/erc32/func.c
  124. /usr/bin/gcc -O2 -pipe -I/home/pitersk/development/development2/rtems/rsb/rtems-source-builder/rtems/build/tmp/sb-pitersk/4.12/rtems-sparc/home/pitersk/development/rtems/4.12/include -DHAVE_CONFIG_H       -DDEFAULT_INLINE=0      -DFAST_UART -I../../../gdb-7.12/sim/erc32/../..   -I. -I../../../gdb-7.12/sim/erc32 -I../common -I../../../gdb-7.12/sim/erc32/../common -I../../include -I../../../gdb-7.12/sim/erc32/../../include -I../../bfd -I../../../gdb-7.12/sim/erc32/../../bfd -I../../opcodes -I../../../gdb-7.12/sim/erc32/../../opcodes  -g -O2 -c -o help.o -MT help.o -MMD -MP -MF .deps/help.Tpo ../../../gdb-7.12/sim/erc32/help.c
  125. /usr/bin/gcc -O2 -pipe -I/home/pitersk/development/development2/rtems/rsb/rtems-source-builder/rtems/build/tmp/sb-pitersk/4.12/rtems-sparc/home/pitersk/development/rtems/4.12/include -DHAVE_CONFIG_H       -DDEFAULT_INLINE=0      -DFAST_UART -I../../../gdb-7.12/sim/erc32/../..   -I. -I../../../gdb-7.12/sim/erc32 -I../common -I../../../gdb-7.12/sim/erc32/../common -I../../include -I../../../gdb-7.12/sim/erc32/../../include -I../../bfd -I../../../gdb-7.12/sim/erc32/../../bfd -I../../opcodes -I../../../gdb-7.12/sim/erc32/../../opcodes  -g -O2 -c -o float.o -MT float.o -MMD -MP -MF .deps/float.Tpo ../../../gdb-7.12/sim/erc32/float.c
  126. /usr/bin/gcc -O2 -pipe -I/home/pitersk/development/development2/rtems/rsb/rtems-source-builder/rtems/build/tmp/sb-pitersk/4.12/rtems-sparc/home/pitersk/development/rtems/4.12/include -DHAVE_CONFIG_H       -DDEFAULT_INLINE=0      -DFAST_UART -I../../../gdb-7.12/sim/erc32/../..   -I. -I../../../gdb-7.12/sim/erc32 -I../common -I../../../gdb-7.12/sim/erc32/../common -I../../include -I../../../gdb-7.12/sim/erc32/../../include -I../../bfd -I../../../gdb-7.12/sim/erc32/../../bfd -I../../opcodes -I../../../gdb-7.12/sim/erc32/../../opcodes  -g -O2 -c -o grlib.o -MT grlib.o -MMD -MP -MF .deps/grlib.Tpo ../../../gdb-7.12/sim/erc32/grlib.c
  127. /usr/bin/gcc -O2 -pipe -I/home/pitersk/development/development2/rtems/rsb/rtems-source-builder/rtems/build/tmp/sb-pitersk/4.12/rtems-sparc/home/pitersk/development/rtems/4.12/include -DHAVE_CONFIG_H       -DDEFAULT_INLINE=0      -DFAST_UART -I../../../gdb-7.12/sim/erc32/../..   -I. -I../../../gdb-7.12/sim/erc32 -I../common -I../../../gdb-7.12/sim/erc32/../common -I../../include -I../../../gdb-7.12/sim/erc32/../../include -I../../bfd -I../../../gdb-7.12/sim/erc32/../../bfd -I../../opcodes -I../../../gdb-7.12/sim/erc32/../../opcodes  -g -O2 -c -o leon3.o -MT leon3.o -MMD -MP -MF .deps/leon3.Tpo ../../../gdb-7.12/sim/erc32/leon3.c
  128. /usr/bin/gcc -O2 -pipe -I/home/pitersk/development/development2/rtems/rsb/rtems-source-builder/rtems/build/tmp/sb-pitersk/4.12/rtems-sparc/home/pitersk/development/rtems/4.12/include -DHAVE_CONFIG_H       -DDEFAULT_INLINE=0      -DFAST_UART -I../../../gdb-7.12/sim/erc32/../..   -I. -I../../../gdb-7.12/sim/erc32 -I../common -I../../../gdb-7.12/sim/erc32/../common -I../../include -I../../../gdb-7.12/sim/erc32/../../include -I../../bfd -I../../../gdb-7.12/sim/erc32/../../bfd -I../../opcodes -I../../../gdb-7.12/sim/erc32/../../opcodes  -g -O2 -c -o leon2.o -MT leon2.o -MMD -MP -MF .deps/leon2.Tpo ../../../gdb-7.12/sim/erc32/leon2.c
  129. /usr/bin/gcc -O2 -pipe -I/home/pitersk/development/development2/rtems/rsb/rtems-source-builder/rtems/build/tmp/sb-pitersk/4.12/rtems-sparc/home/pitersk/development/rtems/4.12/include -DHAVE_CONFIG_H       -DDEFAULT_INLINE=0      -DFAST_UART -I../../../gdb-7.12/sim/erc32/../..   -I. -I../../../gdb-7.12/sim/erc32 -I../common -I../../../gdb-7.12/sim/erc32/../common -I../../include -I../../../gdb-7.12/sim/erc32/../../include -I../../bfd -I../../../gdb-7.12/sim/erc32/../../bfd -I../../opcodes -I../../../gdb-7.12/sim/erc32/../../opcodes  -g -O2 -c -o callback.o -MT callback.o -MMD -MP -MF .deps/callback.Tpo ../../../gdb-7.12/sim/erc32/../common/callback.c
  130. /usr/bin/gcc -O2 -pipe -I/home/pitersk/development/development2/rtems/rsb/rtems-source-builder/rtems/build/tmp/sb-pitersk/4.12/rtems-sparc/home/pitersk/development/rtems/4.12/include -DHAVE_CONFIG_H       -DDEFAULT_INLINE=0      -DFAST_UART -I../../../gdb-7.12/sim/erc32/../..   -I. -I../../../gdb-7.12/sim/erc32 -I../common -I../../../gdb-7.12/sim/erc32/../common -I../../include -I../../../gdb-7.12/sim/erc32/../../include -I../../bfd -I../../../gdb-7.12/sim/erc32/../../bfd -I../../opcodes -I../../../gdb-7.12/sim/erc32/../../opcodes  -g -O2 -c -o syscall.o -MT syscall.o -MMD -MP -MF .deps/syscall.Tpo ../../../gdb-7.12/sim/erc32/../common/syscall.c
  131. /usr/bin/gcc -O2 -pipe -I/home/pitersk/development/development2/rtems/rsb/rtems-source-builder/rtems/build/tmp/sb-pitersk/4.12/rtems-sparc/home/pitersk/development/rtems/4.12/include -DHAVE_CONFIG_H       -DDEFAULT_INLINE=0      -DFAST_UART -I../../../gdb-7.12/sim/erc32/../..   -I. -I../../../gdb-7.12/sim/erc32 -I../common -I../../../gdb-7.12/sim/erc32/../common -I../../include -I../../../gdb-7.12/sim/erc32/../../include -I../../bfd -I../../../gdb-7.12/sim/erc32/../../bfd -I../../opcodes -I../../../gdb-7.12/sim/erc32/../../opcodes  -g -O2 -c -o targ-map.o -MT targ-map.o -MMD -MP -MF .deps/targ-map.Tpo targ-map.c
  132. /usr/bin/gcc -O2 -pipe -I/home/pitersk/development/development2/rtems/rsb/rtems-source-builder/rtems/build/tmp/sb-pitersk/4.12/rtems-sparc/home/pitersk/development/rtems/4.12/include -DHAVE_CONFIG_H       -DDEFAULT_INLINE=0      -DFAST_UART -I../../../gdb-7.12/sim/erc32/../..   -I. -I../../../gdb-7.12/sim/erc32 -I../common -I../../../gdb-7.12/sim/erc32/../common -I../../include -I../../../gdb-7.12/sim/erc32/../../include -I../../bfd -I../../../gdb-7.12/sim/erc32/../../bfd -I../../opcodes -I../../../gdb-7.12/sim/erc32/../../opcodes  -g -O2 -c -o version.o -MT version.o -MMD -MP -MF .deps/version.Tpo version.c
  133. /usr/bin/gcc -O2 -pipe -I/home/pitersk/development/development2/rtems/rsb/rtems-source-builder/rtems/build/tmp/sb-pitersk/4.12/rtems-sparc/home/pitersk/development/rtems/4.12/include -DHAVE_CONFIG_H       -DDEFAULT_INLINE=0      -DFAST_UART -I../../../gdb-7.12/sim/erc32/../..   -I. -I../../../gdb-7.12/sim/erc32 -I../common -I../../../gdb-7.12/sim/erc32/../common -I../../include -I../../../gdb-7.12/sim/erc32/../../include -I../../bfd -I../../../gdb-7.12/sim/erc32/../../bfd -I../../opcodes -I../../../gdb-7.12/sim/erc32/../../opcodes  -g -O2 -c -o interf.o -MT interf.o -MMD -MP -MF .deps/interf.Tpo ../../../gdb-7.12/sim/erc32/interf.c
  134. /usr/bin/gcc -O2 -pipe -I/home/pitersk/development/development2/rtems/rsb/rtems-source-builder/rtems/build/tmp/sb-pitersk/4.12/rtems-sparc/home/pitersk/development/rtems/4.12/include -DHAVE_CONFIG_H       -DDEFAULT_INLINE=0      -DFAST_UART -I../../../gdb-7.12/sim/erc32/../..   -I. -I../../../gdb-7.12/sim/erc32 -I../common -I../../../gdb-7.12/sim/erc32/../common -I../../include -I../../../gdb-7.12/sim/erc32/../../include -I../../bfd -I../../../gdb-7.12/sim/erc32/../../bfd -I../../opcodes -I../../../gdb-7.12/sim/erc32/../../opcodes  -g -O2 -c -o run.o -MT run.o -MMD -MP -MF .deps/run.Tpo ../../../gdb-7.12/sim/erc32/run.c
  135. /usr/bin/gcc -O2 -pipe -I/home/pitersk/development/development2/rtems/rsb/rtems-source-builder/rtems/build/tmp/sb-pitersk/4.12/rtems-sparc/home/pitersk/development/rtems/4.12/include -DHAVE_CONFIG_H       -DDEFAULT_INLINE=0      -DFAST_UART -I../../../gdb-7.12/sim/erc32/../..   -I. -I../../../gdb-7.12/sim/erc32 -I../common -I../../../gdb-7.12/sim/erc32/../common -I../../include -I../../../gdb-7.12/sim/erc32/../../include -I../../bfd -I../../../gdb-7.12/sim/erc32/../../bfd -I../../opcodes -I../../../gdb-7.12/sim/erc32/../../opcodes  -g -O2 -o sis \
  136.   sis.o exec.o erc32.o func.o help.o float.o grlib.o leon3.o leon2.o  ../../bfd/libbfd.a ../../opcodes/libopcodes.a  ../../libiberty/libiberty.a -ldl -lnsl  -L../../zlib -lz ../../readline/libreadline.a  -lm
  137. rm -f libsim.a
  138. x86_64-linux-gnu-ar rc libsim.a callback.o syscall.o targ-map.o version.o exec.o erc32.o func.o help.o float.o grlib.o leon3.o leon2.o interf.o
  139. x86_64-linux-gnu-ranlib libsim.a
  140. /usr/bin/gcc -O2 -pipe -I/home/pitersk/development/development2/rtems/rsb/rtems-source-builder/rtems/build/tmp/sb-pitersk/4.12/rtems-sparc/home/pitersk/development/rtems/4.12/include -DHAVE_CONFIG_H       -DDEFAULT_INLINE=0      -DFAST_UART -I../../../gdb-7.12/sim/erc32/../..   -I. -I../../../gdb-7.12/sim/erc32 -I../common -I../../../gdb-7.12/sim/erc32/../common -I../../include -I../../../gdb-7.12/sim/erc32/../../include -I../../bfd -I../../../gdb-7.12/sim/erc32/../../bfd -I../../opcodes -I../../../gdb-7.12/sim/erc32/../../opcodes  -g -O2 -static-libstdc++ -static-libgcc -L/home/pitersk/development/development2/rtems/rsb/rtems-source-builder/rtems/build/tmp/sb-pitersk/4.12/rtems-sparc/home/pitersk/development/rtems/4.12/lib -o run \
  141.   run.o libsim.a ../../bfd/libbfd.a ../../opcodes/libopcodes.a  ../../libiberty/libiberty.a -ldl -lnsl  -L../../zlib -lz ../../readline/libreadline.a  -lm
  142. ../../readline/libreadline.a(display.o): In function `_rl_move_cursor_relative':
  143. /home/pitersk/development/development2/rtems/rsb/rtems-source-builder/rtems/build/sparc-rtems4.12-gdb-7.12-x86_64-linux-gnu-1/build/readline/../../gdb-7.12/readline/display.c:1985: undefined reference to `tputs'
  144. /home/pitersk/development/development2/rtems/rsb/rtems-source-builder/rtems/build/sparc-rtems4.12-gdb-7.12-x86_64-linux-gnu-1/build/readline/../../gdb-7.12/readline/display.c:2014: undefined reference to `tputs'
  145. /home/pitersk/development/development2/rtems/rsb/rtems-source-builder/rtems/build/sparc-rtems4.12-gdb-7.12-x86_64-linux-gnu-1/build/readline/../../gdb-7.12/readline/display.c:2018: undefined reference to `tputs'
  146. ../../readline/libreadline.a(display.o): In function `_rl_move_vert':
  147. /home/pitersk/development/development2/rtems/rsb/rtems-source-builder/rtems/build/sparc-rtems4.12-gdb-7.12-x86_64-linux-gnu-1/build/readline/../../gdb-7.12/readline/display.c:2057: undefined reference to `tputs'
  148. /home/pitersk/development/development2/rtems/rsb/rtems-source-builder/rtems/build/sparc-rtems4.12-gdb-7.12-x86_64-linux-gnu-1/build/readline/../../gdb-7.12/readline/display.c:2073: undefined reference to `tputs'
  149. ../../readline/libreadline.a(display.o): In function `insert_some_chars':
  150. /home/pitersk/development/development2/rtems/rsb/rtems-source-builder/rtems/build/sparc-rtems4.12-gdb-7.12-x86_64-linux-gnu-1/build/readline/../../gdb-7.12/readline/display.c:2390: undefined reference to `tgoto'
  151. /home/pitersk/development/development2/rtems/rsb/rtems-source-builder/rtems/build/sparc-rtems4.12-gdb-7.12-x86_64-linux-gnu-1/build/readline/../../gdb-7.12/readline/display.c:2391: undefined reference to `tputs'
  152. ../../readline/libreadline.a(display.o): In function `update_line':
  153. /home/pitersk/development/development2/rtems/rsb/rtems-source-builder/rtems/build/sparc-rtems4.12-gdb-7.12-x86_64-linux-gnu-1/build/readline/../../gdb-7.12/readline/display.c:1528: undefined reference to `tputs'
  154. ../../readline/libreadline.a(display.o): In function `delete_chars':
  155. /home/pitersk/development/development2/rtems/rsb/rtems-source-builder/rtems/build/sparc-rtems4.12-gdb-7.12-x86_64-linux-gnu-1/build/readline/../../gdb-7.12/readline/display.c:2440: undefined reference to `tputs'
  156. /home/pitersk/development/development2/rtems/rsb/rtems-source-builder/rtems/build/sparc-rtems4.12-gdb-7.12-x86_64-linux-gnu-1/build/readline/../../gdb-7.12/readline/display.c:2433: undefined reference to `tgoto'
  157. /home/pitersk/development/development2/rtems/rsb/rtems-source-builder/rtems/build/sparc-rtems4.12-gdb-7.12-x86_64-linux-gnu-1/build/readline/../../gdb-7.12/readline/display.c:2434: undefined reference to `tputs'
  158. ../../readline/libreadline.a(display.o): In function `insert_some_chars':
  159. /home/pitersk/development/development2/rtems/rsb/rtems-source-builder/rtems/build/sparc-rtems4.12-gdb-7.12-x86_64-linux-gnu-1/build/readline/../../gdb-7.12/readline/display.c:2407: undefined reference to `tputs'
  160. /home/pitersk/development/development2/rtems/rsb/rtems-source-builder/rtems/build/sparc-rtems4.12-gdb-7.12-x86_64-linux-gnu-1/build/readline/../../gdb-7.12/readline/display.c:2416: undefined reference to `tputs'
  161. /home/pitersk/development/development2/rtems/rsb/rtems-source-builder/rtems/build/sparc-rtems4.12-gdb-7.12-x86_64-linux-gnu-1/build/readline/../../gdb-7.12/readline/display.c:2400: undefined reference to `tputs'
  162. ../../readline/libreadline.a(display.o): In function `rl_redisplay':
  163. /home/pitersk/development/development2/rtems/rsb/rtems-source-builder/rtems/build/sparc-rtems4.12-gdb-7.12-x86_64-linux-gnu-1/build/readline/../../gdb-7.12/readline/display.c:1087: undefined reference to `tputs'
  164. Makefile:609: recipe for target 'sis' failed
  165. ../../readline/libreadline.a(display.o):/home/pitersk/development/development2/rtems/rsb/rtems-source-builder/rtems/build/sparc-rtems4.12-gdb-7.12-x86_64-linux-gnu-1/build/readline/../../gdb-7.12/readline/display.c:2486: more undefined references to `tputs' follow
  166. ../../readline/libreadline.a(terminal.o): In function `_rl_get_screen_size':
  167. /home/pitersk/development/development2/rtems/rsb/rtems-source-builder/rtems/build/sparc-rtems4.12-gdb-7.12-x86_64-linux-gnu-1/build/readline/../../gdb-7.12/readline/terminal.c:297: undefined reference to `tgetnum'
  168. /home/pitersk/development/development2/rtems/rsb/rtems-source-builder/rtems/build/sparc-rtems4.12-gdb-7.12-x86_64-linux-gnu-1/build/readline/../../gdb-7.12/readline/terminal.c:278: undefined reference to `tgetnum'
  169. ../../readline/libreadline.a(terminal.o): In function `_rl_init_terminal_io':
  170. /home/pitersk/development/development2/rtems/rsb/rtems-source-builder/rtems/build/sparc-rtems4.12-gdb-7.12-x86_64-linux-gnu-1/build/readline/../../gdb-7.12/readline/terminal.c:527: undefined reference to `PC'
  171. /home/pitersk/development/development2/rtems/rsb/rtems-source-builder/rtems/build/sparc-rtems4.12-gdb-7.12-x86_64-linux-gnu-1/build/readline/../../gdb-7.12/readline/terminal.c:528: undefined reference to `BC'
  172. /home/pitersk/development/development2/rtems/rsb/rtems-source-builder/rtems/build/sparc-rtems4.12-gdb-7.12-x86_64-linux-gnu-1/build/readline/../../gdb-7.12/readline/terminal.c:529: undefined reference to `UP'
  173. /home/pitersk/development/development2/rtems/rsb/rtems-source-builder/rtems/build/sparc-rtems4.12-gdb-7.12-x86_64-linux-gnu-1/build/readline/../../gdb-7.12/readline/terminal.c:481: undefined reference to `tgetent'
  174. ../../readline/libreadline.a(terminal.o): In function `get_term_capabilities':
  175. /home/pitersk/development/development2/rtems/rsb/rtems-source-builder/rtems/build/sparc-rtems4.12-gdb-7.12-x86_64-linux-gnu-1/build/readline/../../gdb-7.12/readline/terminal.c:427: undefined reference to `tgetstr'
  176. ../../readline/libreadline.a(terminal.o): In function `_rl_init_terminal_io':
  177. /home/pitersk/development/development2/rtems/rsb/rtems-source-builder/rtems/build/sparc-rtems4.12-gdb-7.12-x86_64-linux-gnu-1/build/readline/../../gdb-7.12/readline/terminal.c:538: undefined reference to `PC'
  178. /home/pitersk/development/development2/rtems/rsb/rtems-source-builder/rtems/build/sparc-rtems4.12-gdb-7.12-x86_64-linux-gnu-1/build/readline/../../gdb-7.12/readline/terminal.c:539: undefined reference to `BC'
  179. /home/pitersk/development/development2/rtems/rsb/rtems-source-builder/rtems/build/sparc-rtems4.12-gdb-7.12-x86_64-linux-gnu-1/build/readline/../../gdb-7.12/readline/terminal.c:540: undefined reference to `UP'
  180. /home/pitersk/development/development2/rtems/rsb/rtems-source-builder/rtems/build/sparc-rtems4.12-gdb-7.12-x86_64-linux-gnu-1/build/readline/../../gdb-7.12/readline/terminal.c:545: undefined reference to `tgetflag'
  181. /home/pitersk/development/development2/rtems/rsb/rtems-source-builder/rtems/build/sparc-rtems4.12-gdb-7.12-x86_64-linux-gnu-1/build/readline/../../gdb-7.12/readline/terminal.c:560: undefined reference to `tgetflag'
  182. /home/pitersk/development/development2/rtems/rsb/rtems-source-builder/rtems/build/sparc-rtems4.12-gdb-7.12-x86_64-linux-gnu-1/build/readline/../../gdb-7.12/readline/terminal.c:545: undefined reference to `tgetflag'
  183. ../../readline/libreadline.a(terminal.o): In function `_rl_backspace':
  184. /home/pitersk/development/development2/rtems/rsb/rtems-source-builder/rtems/build/sparc-rtems4.12-gdb-7.12-x86_64-linux-gnu-1/build/readline/../../gdb-7.12/readline/terminal.c:665: undefined reference to `tputs'
  185. ../../readline/libreadline.a(terminal.o): In function `rl_ding':
  186. /home/pitersk/development/development2/rtems/rsb/rtems-source-builder/rtems/build/sparc-rtems4.12-gdb-7.12-x86_64-linux-gnu-1/build/readline/../../gdb-7.12/readline/terminal.c:703: undefined reference to `tputs'
  187. ../../readline/libreadline.a(terminal.o): In function `_rl_enable_meta_key':
  188. /home/pitersk/development/development2/rtems/rsb/rtems-source-builder/rtems/build/sparc-rtems4.12-gdb-7.12-x86_64-linux-gnu-1/build/readline/../../gdb-7.12/readline/terminal.c:729: undefined reference to `tputs'
  189. ../../readline/libreadline.a(terminal.o): In function `_rl_control_keypad':
  190. /home/pitersk/development/development2/rtems/rsb/rtems-source-builder/rtems/build/sparc-rtems4.12-gdb-7.12-x86_64-linux-gnu-1/build/readline/../../gdb-7.12/readline/terminal.c:741: undefined reference to `tputs'
  191. ../../readline/libreadline.a(terminal.o): In function `_rl_set_cursor':
  192. /home/pitersk/development/development2/rtems/rsb/rtems-source-builder/rtems/build/sparc-rtems4.12-gdb-7.12-x86_64-linux-gnu-1/build/readline/../../gdb-7.12/readline/terminal.c:767: undefined reference to `tputs'
  193. ../../readline/libreadline.a(terminal.o):/home/pitersk/development/development2/rtems/rsb/rtems-source-builder/rtems/build/sparc-rtems4.12-gdb-7.12-x86_64-linux-gnu-1/build/readline/../../gdb-7.12/readline/terminal.c:765: more undefined references to `tputs' follow
  194. collect2: error: ld returned 1 exit status
  195. make[3]: *** [sis] Error 1
  196. make[3]: *** Waiting for unfinished jobs....
  197. make[3]: Leaving directory '/home/pitersk/development/development2/rtems/rsb/rtems-source-builder/rtems/build/sparc-rtems4.12-gdb-7.12-x86_64-linux-gnu-1/build/sim/erc32'
  198. Makefile:129: recipe for target 'all' failed
  199. make[2]: *** [all] Error 1
  200. make[2]: Leaving directory '/home/pitersk/development/development2/rtems/rsb/rtems-source-builder/rtems/build/sparc-rtems4.12-gdb-7.12-x86_64-linux-gnu-1/build/sim'
  201. make[1]: *** [all-sim] Error 2
  202. Makefile:8272: recipe for target 'all-sim' failed
  203. make[1]: Leaving directory '/home/pitersk/development/development2/rtems/rsb/rtems-source-builder/rtems/build/sparc-rtems4.12-gdb-7.12-x86_64-linux-gnu-1/build'
  204. make: *** [all] Error 2
  205. Makefile:849: recipe for target 'all' failed
  206. shell cmd failed: /bin/sh -ex  /home/pitersk/development/development2/rtems/rsb/rtems-source-builder/rtems/build/sparc-rtems4.12-gdb-7.12-x86_64-linux-gnu-1/doit
  207. error: building sparc-rtems4.12-gdb-7.12-x86_64-linux-gnu-1
RAW Paste Data
We use cookies for various purposes including analytics. By continuing to use Pastebin, you agree to our use of cookies as described in the Cookies Policy. OK, I Understand
Top