SHARE
TWEET

Untitled

a guest Jun 26th, 2019 66 Never
Not a member of Pastebin yet? Sign Up, it unlocks many cool features!
  1. arenson@shun:~/code/dbus-cxx/build$ cmake -DENABLE_TOOLS=ON ..
  2. -- The C compiler identification is GNU 7.4.0
  3. -- The CXX compiler identification is GNU 7.4.0
  4. -- Check for working C compiler: /usr/bin/cc
  5. -- Check for working C compiler: /usr/bin/cc -- works
  6. -- Detecting C compiler ABI info
  7. -- Detecting C compiler ABI info - done
  8. -- Detecting C compile features
  9. -- Detecting C compile features - done
  10. -- Check for working CXX compiler: /usr/bin/c++
  11. -- Check for working CXX compiler: /usr/bin/c++ -- works
  12. -- Detecting CXX compiler ABI info
  13. -- Detecting CXX compiler ABI info - done
  14. -- Detecting CXX compile features
  15. -- Detecting CXX compile features - done
  16. -- Found PkgConfig: /usr/bin/pkg-config (found version "0.29.1")
  17. -- Checking for module 'dbus-1>=1.3'
  18. --   Found dbus-1, version 1.12.2
  19. -- Checking for module 'sigc++-2.0'
  20. --   Found sigc++-2.0, version 2.10.0
  21. -- Looking for sys/types.h
  22. -- Looking for sys/types.h - found
  23. -- Looking for stdint.h
  24. -- Looking for stdint.h - found
  25. -- Looking for stddef.h
  26. -- Looking for stddef.h - found
  27. -- Check size of long int
  28. -- Check size of long int - done
  29. -- Checking for module 'popt'
  30. --   Found popt, version 1.16
  31. -- Checking for module 'expat'
  32. --   Found expat, version 2.2.5
  33. --
  34. --
  35. -- dbus-cxx configuration summary:
  36. --
  37. --   Build type ...................... :
  38. --   Install prefix .................. : /usr/local
  39. --   Library location ................ : /usr/local/lib
  40. --   C++ compiler .................... : /usr/bin/c++
  41. --   Build examples .................. : ON
  42. --   Build tests ..................... : OFF
  43. --   Build tools ..................... : ON
  44. --   Use bundled cppgenerate ......... : ON
  45. --   Enable GLibmm support ........... : OFF
  46. --   Build website ................... : OFF
  47. -- Configuring done
  48. -- Generating done
  49. -- Build files have been written to: /home/ANT.AMAZON.COM/arenson/code/dbus-cxx/build
  50. arenson@shun:~/code/dbus-cxx/build$ make -j3
  51. Scanning dependencies of target generate-interface.h
  52. Scanning dependencies of target generate-interfaceproxy.h
  53. Scanning dependencies of target generate-method.h
  54. [  0%] Generating dbus-cxx/interface.h
  55. [  1%] Generating dbus-cxx/method.h
  56. [  2%] Generating dbus-cxx/interfaceproxy.h
  57. [  2%] Built target generate-interfaceproxy.h
  58. Scanning dependencies of target generate-methodproxybase.h
  59. [  2%] Built target generate-method.h
  60. [  2%] Generating dbus-cxx/methodproxybase.h
  61. [  2%] Built target generate-interface.h
  62. Scanning dependencies of target generate-signal_proxy.h
  63. [  2%] Built target generate-methodproxybase.h
  64. Scanning dependencies of target generate-object.h
  65. [  3%] Generating dbus-cxx/signal_proxy.h
  66. [  4%] Generating dbus-cxx/object.h
  67. Scanning dependencies of target generate-methodproxy.h
  68. [  4%] Built target generate-signal_proxy.h
  69. [  5%] Generating dbus-cxx/methodproxy.h
  70. [  5%] Built target generate-object.h
  71. Scanning dependencies of target generate-objectproxy.h
  72. Scanning dependencies of target generate-connection.h
  73. [  5%] Built target generate-methodproxy.h
  74. [  6%] Generating dbus-cxx/connection.h
  75. [  7%] Generating dbus-cxx/objectproxy.h
  76. Scanning dependencies of target generate-method_impl.h
  77. [  7%] Built target generate-connection.h
  78. [  8%] Generating dbus-cxx/method_impl.h
  79. [  8%] Built target generate-objectproxy.h
  80. [  8%] Built target generate-method_impl.h
  81. Scanning dependencies of target generate-dbus_signal.h
  82. Scanning dependencies of target cppgenerate
  83. [  9%] Generating dbus-cxx/dbus_signal.h
  84. [ 10%] Creating directories for 'cppgenerate'
  85. [ 10%] Built target generate-dbus_signal.h
  86. Scanning dependencies of target dbus-cxx
  87. [ 11%] No download step for 'cppgenerate'
  88. [ 12%] Building CXX object CMakeFiles/dbus-cxx.dir/dbus-cxx/connection.cpp.o
  89. [ 13%] No patch step for 'cppgenerate'
  90. [ 14%] Building CXX object CMakeFiles/dbus-cxx.dir/dbus-cxx/callmessage.cpp.o
  91. [ 15%] No update step for 'cppgenerate'
  92. [ 15%] Performing configure step for 'cppgenerate'
  93. -- The C compiler identification is GNU 7.4.0
  94. -- The CXX compiler identification is GNU 7.4.0
  95. -- Check for working C compiler: /usr/bin/cc
  96. -- Check for working C compiler: /usr/bin/cc -- works
  97. -- Detecting C compiler ABI info
  98. -- Detecting C compiler ABI info - done
  99. -- Detecting C compile features
  100. -- Detecting C compile features - done
  101. -- Check for working CXX compiler: /usr/bin/c++
  102. -- Check for working CXX compiler: /usr/bin/c++ -- works
  103. -- Detecting CXX compiler ABI info
  104. -- Detecting CXX compiler ABI info - done
  105. -- Detecting CXX compile features
  106. [ 16%] Building CXX object CMakeFiles/dbus-cxx.dir/dbus-cxx/dispatcher.cpp.o
  107. -- Detecting CXX compile features - done
  108. CMake command /usr/bin/cmake
  109. CMake generator Unix Makefiles
  110. -- Configuring done
  111. -- Generating done
  112. -- Build files have been written to: /home/ANT.AMAZON.COM/arenson/code/dbus-cxx/build/tools/cppgenerate-prefix/src/cppgenerate-build
  113. [ 17%] Performing build step for 'cppgenerate'
  114. Scanning dependencies of target objlib
  115. [  8%] Building CXX object CMakeFiles/objlib.dir/cppgenerate/class.cpp.o
  116. [ 16%] Building CXX object CMakeFiles/objlib.dir/cppgenerate/method.cpp.o
  117. [ 25%] Building CXX object CMakeFiles/objlib.dir/cppgenerate/variable.cpp.o
  118. [ 17%] Building CXX object CMakeFiles/dbus-cxx.dir/dbus-cxx/error.cpp.o
  119. [ 33%] Building CXX object CMakeFiles/objlib.dir/cppgenerate/membervariable.cpp.o
  120. [ 41%] Building CXX object CMakeFiles/objlib.dir/cppgenerate/enum.cpp.o
  121. [ 18%] Building CXX object CMakeFiles/dbus-cxx.dir/dbus-cxx/errormessage.cpp.o
  122. [ 50%] Building CXX object CMakeFiles/objlib.dir/cppgenerate/codeblock.cpp.o
  123. [ 19%] Building CXX object CMakeFiles/dbus-cxx.dir/dbus-cxx/interface.cpp.o
  124. [ 58%] Building CXX object CMakeFiles/objlib.dir/cppgenerate/cppgenerateutils.cpp.o
  125. [ 66%] Building CXX object CMakeFiles/objlib.dir/cppgenerate/printer.cpp.o
  126. [ 20%] Building CXX object CMakeFiles/dbus-cxx.dir/dbus-cxx/interfaceproxy.cpp.o
  127. [ 75%] Building CXX object CMakeFiles/objlib.dir/cppgenerate/argument.cpp.o
  128. [ 83%] Building CXX object CMakeFiles/objlib.dir/cppgenerate/constructor.cpp.o
  129. [ 83%] Built target objlib
  130. Scanning dependencies of target cppgenerate
  131. [ 91%] Linking CXX shared library libcppgenerate.so
  132. [ 91%] Built target cppgenerate
  133. Scanning dependencies of target cppgenerate_static
  134. [100%] Linking CXX static library libcppgenerate.a
  135. [100%] Built target cppgenerate_static
  136. [ 20%] No install step for 'cppgenerate'
  137. [ 21%] Completed 'cppgenerate'
  138. [ 21%] Built target cppgenerate
  139. [ 22%] Building CXX object CMakeFiles/dbus-cxx.dir/dbus-cxx/messageappenditerator.cpp.o
  140. [ 22%] Building CXX object CMakeFiles/dbus-cxx.dir/dbus-cxx/message.cpp.o
  141. [ 23%] Building CXX object CMakeFiles/dbus-cxx.dir/dbus-cxx/messagefilter.cpp.o
  142. [ 24%] Building CXX object CMakeFiles/dbus-cxx.dir/dbus-cxx/messagehandler.cpp.o
  143. [ 25%] Building CXX object CMakeFiles/dbus-cxx.dir/dbus-cxx/messageiterator.cpp.o
  144. [ 26%] Building CXX object CMakeFiles/dbus-cxx.dir/dbus-cxx/methodbase.cpp.o
  145. [ 26%] Building CXX object CMakeFiles/dbus-cxx.dir/dbus-cxx/methodproxybase.cpp.o
  146. [ 27%] Building CXX object CMakeFiles/dbus-cxx.dir/dbus-cxx/object.cpp.o
  147. [ 28%] Building CXX object CMakeFiles/dbus-cxx.dir/dbus-cxx/objectpathhandler.cpp.o
  148. [ 29%] Building CXX object CMakeFiles/dbus-cxx.dir/dbus-cxx/objectproxy.cpp.o
  149. [ 30%] Building CXX object CMakeFiles/dbus-cxx.dir/dbus-cxx/path.cpp.o
  150. [ 30%] Building CXX object CMakeFiles/dbus-cxx.dir/dbus-cxx/pendingcall.cpp.o
  151. [ 31%] Building CXX object CMakeFiles/dbus-cxx.dir/dbus-cxx/returnmessage.cpp.o
  152. [ 32%] Building CXX object CMakeFiles/dbus-cxx.dir/dbus-cxx/signal_base.cpp.o
  153. [ 33%] Building CXX object CMakeFiles/dbus-cxx.dir/dbus-cxx/signalmessage.cpp.o
  154. [ 34%] Building CXX object CMakeFiles/dbus-cxx.dir/dbus-cxx/signal_proxy_base.cpp.o
  155. [ 34%] Building CXX object CMakeFiles/dbus-cxx.dir/dbus-cxx/signalreceiver.cpp.o
  156. [ 35%] Building CXX object CMakeFiles/dbus-cxx.dir/dbus-cxx/signature.cpp.o
  157. [ 36%] Building CXX object CMakeFiles/dbus-cxx.dir/dbus-cxx/signatureiterator.cpp.o
  158. [ 37%] Building CXX object CMakeFiles/dbus-cxx.dir/dbus-cxx/timeout.cpp.o
  159. [ 38%] Building CXX object CMakeFiles/dbus-cxx.dir/dbus-cxx/utility.cpp.o
  160. [ 38%] Building CXX object CMakeFiles/dbus-cxx.dir/dbus-cxx/watch.cpp.o
  161. /home/ANT.AMAZON.COM/arenson/code/dbus-cxx/dbus-cxx/utility.cpp: In function ‘void DBus::logStdErr(const char*, const SL_LogLocation*, SL_LogLevel, const char*)’:
  162. /home/ANT.AMAZON.COM/arenson/code/dbus-cxx/dbus-cxx/utility.cpp:87:29: warning: format ‘%X’ expects argument of type ‘unsigned int’, but argument 4 has type ‘std::thread::id’ [-Wformat=]
  163.        location->line_number );
  164.                              ^
  165. [ 39%] Linking CXX shared library libdbus-cxx.so
  166. [ 39%] Built target dbus-cxx
  167. Scanning dependencies of target filedescriptor-server
  168. Scanning dependencies of target quickstart-client
  169. Scanning dependencies of target quickstart-server
  170. [ 40%] Building CXX object examples/quick-start/CMakeFiles/quickstart-server.dir/quickstart_server_0.cpp.o
  171. [ 41%] Building CXX object examples/quick-start/CMakeFiles/quickstart-client.dir/quickstart_client_0.cpp.o
  172. [ 42%] Building CXX object examples/basics/filedescriptors/CMakeFiles/filedescriptor-server.dir/filedescriptor_server.cpp.o
  173. [ 43%] Linking CXX executable quickstart-server
  174. [ 43%] Linking CXX executable quickstart-client
  175. [ 43%] Built target quickstart-server
  176. [ 43%] Built target quickstart-client
  177. Scanning dependencies of target filedescriptor-client
  178. [ 44%] Building CXX object examples/basics/filedescriptors/CMakeFiles/filedescriptor-client.dir/filedescriptor_client.cpp.o
  179. Scanning dependencies of target callee-raw
  180. [ 45%] Building CXX object examples/basics/methods/CMakeFiles/callee-raw.dir/callee_raw.cpp.o
  181. [ 46%] Linking CXX executable filedescriptor-server
  182. [ 46%] Built target filedescriptor-server
  183. Scanning dependencies of target caller-dispatched
  184. [ 47%] Building CXX object examples/basics/methods/CMakeFiles/caller-dispatched.dir/caller_dispatched.cpp.o
  185. [ 48%] Linking CXX executable callee-raw
  186. [ 48%] Linking CXX executable filedescriptor-client
  187. [ 48%] Built target filedescriptor-client
  188. Scanning dependencies of target callee-2
  189. [ 48%] Built target callee-raw
  190. Scanning dependencies of target caller-raw
  191. [ 49%] Building CXX object examples/basics/methods/CMakeFiles/callee-2.dir/callee_2.cpp.o
  192. [ 50%] Building CXX object examples/basics/methods/CMakeFiles/caller-raw.dir/caller_raw.cpp.o
  193. [ 51%] Linking CXX executable caller-dispatched
  194. [ 51%] Built target caller-dispatched
  195. Scanning dependencies of target callee-dispatched
  196. [ 52%] Building CXX object examples/basics/methods/CMakeFiles/callee-dispatched.dir/callee_dispatched.cpp.o
  197. [ 53%] Linking CXX executable caller-raw
  198. [ 53%] Built target caller-raw
  199. Scanning dependencies of target caller
  200. [ 54%] Building CXX object examples/basics/methods/CMakeFiles/caller.dir/caller.cpp.o
  201. [ 55%] Linking CXX executable callee-2
  202. [ 55%] Built target callee-2
  203. Scanning dependencies of target caller-c
  204. [ 56%] Building CXX object examples/basics/methods/CMakeFiles/caller-c.dir/caller_c.cpp.o
  205. [ 57%] Linking CXX executable caller-c
  206. [ 57%] Built target caller-c
  207. Scanning dependencies of target callee-c
  208. [ 58%] Building CXX object examples/basics/methods/CMakeFiles/callee-c.dir/callee_c.cpp.o
  209. [ 58%] Linking CXX executable callee-c
  210. [ 58%] Built target callee-c
  211. Scanning dependencies of target callee-object
  212. [ 59%] Building CXX object examples/basics/methods/CMakeFiles/callee-object.dir/callee_object.cpp.o
  213. [ 60%] Linking CXX executable callee-dispatched
  214. [ 60%] Built target callee-dispatched
  215. Scanning dependencies of target callee
  216. [ 60%] Building CXX object examples/basics/methods/CMakeFiles/callee.dir/callee.cpp.o
  217. [ 60%] Linking CXX executable caller
  218. [ 60%] Built target caller
  219. Scanning dependencies of target callee-object-inherited
  220. [ 60%] Building CXX object examples/basics/methods/CMakeFiles/callee-object-inherited.dir/callee_object_inherited.cpp.o
  221. [ 61%] Linking CXX executable callee
  222. [ 61%] Built target callee
  223. [ 62%] Linking CXX executable callee-object
  224. Scanning dependencies of target caller-object
  225. [ 62%] Building CXX object examples/basics/methods/CMakeFiles/caller-object.dir/caller_object.cpp.o
  226. [ 62%] Built target callee-object
  227. Scanning dependencies of target signal-emitter2
  228. [ 63%] Building CXX object examples/basics/signals/CMakeFiles/signal-emitter2.dir/signal_emitter_2.cpp.o
  229. [ 64%] Linking CXX executable callee-object-inherited
  230. [ 64%] Built target callee-object-inherited
  231. Scanning dependencies of target signal-receiver-raw
  232. [ 64%] Building CXX object examples/basics/signals/CMakeFiles/signal-receiver-raw.dir/signal_receiver_raw.cpp.o
  233. [ 65%] Linking CXX executable caller-object
  234. [ 65%] Built target caller-object
  235. Scanning dependencies of target signal-receiver2
  236. [ 66%] Building CXX object examples/basics/signals/CMakeFiles/signal-receiver2.dir/signal_receiver_2.cpp.o
  237. [ 67%] Linking CXX executable signal-emitter2
  238. [ 67%] Built target signal-emitter2
  239. Scanning dependencies of target signal-emitter-object
  240. [ 68%] Building CXX object examples/basics/signals/CMakeFiles/signal-emitter-object.dir/signal_emitter_object.cpp.o
  241. [ 69%] Linking CXX executable signal-receiver-raw
  242. [ 69%] Built target signal-receiver-raw
  243. Scanning dependencies of target signal-emitter-raw
  244. [ 70%] Building CXX object examples/basics/signals/CMakeFiles/signal-emitter-raw.dir/signal_emitter_raw.cpp.o
  245. [ 71%] Linking CXX executable signal-receiver2
  246. [ 71%] Built target signal-receiver2
  247. Scanning dependencies of target signal-receiver-c
  248. [ 72%] Building CXX object examples/basics/signals/CMakeFiles/signal-receiver-c.dir/signal_receiver_c.cpp.o
  249. [ 73%] Linking CXX executable signal-receiver-c
  250. [ 73%] Built target signal-receiver-c
  251. Scanning dependencies of target signal-emitter3
  252. [ 73%] Building CXX object examples/basics/signals/CMakeFiles/signal-emitter3.dir/signal_emitter_3.cpp.o
  253. [ 73%] Linking CXX executable signal-emitter-object
  254. [ 73%] Built target signal-emitter-object
  255. Scanning dependencies of target signal-receiver
  256. [ 74%] Building CXX object examples/basics/signals/CMakeFiles/signal-receiver.dir/signal_receiver.cpp.o
  257. [ 75%] Linking CXX executable signal-emitter-raw
  258. [ 75%] Built target signal-emitter-raw
  259. Scanning dependencies of target signal-emitter-c
  260. [ 76%] Building CXX object examples/basics/signals/CMakeFiles/signal-emitter-c.dir/signal_emitter_c.cpp.o
  261. [ 77%] Linking CXX executable signal-emitter-c
  262. [ 77%] Built target signal-emitter-c
  263. Scanning dependencies of target signal-receiver-object
  264. [ 78%] Building CXX object examples/basics/signals/CMakeFiles/signal-receiver-object.dir/signal_receiver_object.cpp.o
  265. [ 79%] Linking CXX executable signal-emitter3
  266. [ 79%] Built target signal-emitter3
  267. Scanning dependencies of target signal-emitter-array
  268. [ 79%] Building CXX object examples/basics/signals/CMakeFiles/signal-emitter-array.dir/signal_emitter_array.cpp.o
  269. [ 80%] Linking CXX executable signal-receiver
  270. [ 80%] Built target signal-receiver
  271. Scanning dependencies of target signal-receiver-array
  272. [ 81%] Building CXX object examples/basics/signals/CMakeFiles/signal-receiver-array.dir/signal_receiver_array.cpp.o
  273. [ 82%] Linking CXX executable signal-receiver-object
  274. [ 82%] Built target signal-receiver-object
  275. Scanning dependencies of target signal-emitter
  276. [ 83%] Building CXX object examples/basics/signals/CMakeFiles/signal-emitter.dir/signal_emitter.cpp.o
  277. [ 84%] Linking CXX executable signal-emitter-array
  278. [ 84%] Built target signal-emitter-array
  279. Scanning dependencies of target time-server
  280. [ 85%] Building CXX object examples/basics/types/CMakeFiles/time-server.dir/timeval_dbus.cpp.o
  281. [ 85%] Linking CXX executable signal-receiver-array
  282. [ 85%] Built target signal-receiver-array
  283. Scanning dependencies of target time-client
  284. [ 86%] Building CXX object examples/basics/types/CMakeFiles/time-client.dir/timeval_dbus.cpp.o
  285. [ 87%] Linking CXX executable signal-emitter
  286. [ 87%] Built target signal-emitter
  287. Scanning dependencies of target dbus-cxx-xml2cpp
  288. [ 88%] Building CXX object examples/basics/types/CMakeFiles/time-server.dir/time_server.cpp.o
  289. [ 89%] Building CXX object tools/CMakeFiles/dbus-cxx-xml2cpp.dir/generate_adapter.cpp.o
  290. [ 89%] Building CXX object examples/basics/types/CMakeFiles/time-client.dir/time_client.cpp.o
  291. [ 89%] Building CXX object tools/CMakeFiles/dbus-cxx-xml2cpp.dir/generate_proxy.cpp.o
  292. [ 90%] Linking CXX executable time-server
  293. [ 90%] Built target time-server
  294. Scanning dependencies of target dbus-cxx-introspect
  295. [ 91%] Building CXX object tools/CMakeFiles/dbus-cxx-introspect.dir/introspect.cpp.o
  296. [ 92%] Linking CXX executable time-client
  297. [ 92%] Built target time-client
  298. [ 93%] Building CXX object tools/CMakeFiles/dbus-cxx-xml2cpp.dir/parsed_object.cpp.o
  299. [ 94%] Building CXX object tools/CMakeFiles/dbus-cxx-xml2cpp.dir/xml2cpp.cpp.o
  300. [ 95%] Linking CXX executable dbus-cxx-introspect
  301. [ 95%] Built target dbus-cxx-introspect
  302. [ 96%] Building CXX object tools/CMakeFiles/dbus-cxx-xml2cpp.dir/xml_parser.cpp.o
  303. /home/ANT.AMAZON.COM/arenson/code/dbus-cxx/tools/xml2cpp.cpp:26:10: fatal error: cppgenerate/class.h: No such file or directory
  304.  #include <cppgenerate/class.h>
  305.           ^~~~~~~~~~~~~~~~~~~~~
  306. compilation terminated.
  307. tools/CMakeFiles/dbus-cxx-xml2cpp.dir/build.make:134: recipe for target 'tools/CMakeFiles/dbus-cxx-xml2cpp.dir/xml2cpp.cpp.o' failed
  308. make[2]: *** [tools/CMakeFiles/dbus-cxx-xml2cpp.dir/xml2cpp.cpp.o] Error 1
  309. make[2]: *** Waiting for unfinished jobs....
  310. /home/ANT.AMAZON.COM/arenson/code/dbus-cxx/tools/parsed_object.cpp: In member function ‘std::vector<std::__cxx11::basic_string<char> > Node::namespaces()’:
  311. /home/ANT.AMAZON.COM/arenson/code/dbus-cxx/tools/parsed_object.cpp:266:19: error: ISO C++ forbids comparison between pointer and integer [-fpermissive]
  312.    if ( current != '\0' ) ns.push_back( std::string( current ) );
  313.                    ^~~~
  314. tools/CMakeFiles/dbus-cxx-xml2cpp.dir/build.make:110: recipe for target 'tools/CMakeFiles/dbus-cxx-xml2cpp.dir/parsed_object.cpp.o' failed
  315. make[2]: *** [tools/CMakeFiles/dbus-cxx-xml2cpp.dir/parsed_object.cpp.o] Error 1
  316. CMakeFiles/Makefile2:1808: recipe for target 'tools/CMakeFiles/dbus-cxx-xml2cpp.dir/all' failed
  317. make[1]: *** [tools/CMakeFiles/dbus-cxx-xml2cpp.dir/all] Error 2
  318. Makefile:151: recipe for target 'all' failed
  319. make: *** [all] Error 2
  320.  
  321. arenson@shun:~/code/dbus-cxx/build$ gcc --version
  322. gcc (Ubuntu 7.4.0-1ubuntu1~18.04) 7.4.0
  323. Copyright (C) 2017 Free Software Foundation, Inc.
  324. This is free software; see the source for copying conditions.  There is NO
  325. warranty; not even for MERCHANTABILITY or FITNESS FOR A PARTICULAR PURPOSE.
RAW Paste Data
We use cookies for various purposes including analytics. By continuing to use Pastebin, you agree to our use of cookies as described in the Cookies Policy. OK, I Understand
Not a member of Pastebin yet?
Sign Up, it unlocks many cool features!
 
Top