Advertisement
Guest User

vbm

a guest
Jun 21st, 2012
189
Never
Not a member of Pastebin yet? Sign Up, it unlocks many cool features!
text 6.63 KB | None
  1. * IMPORTANT: 2 news items need reading for repository 'gentoo'.
  2. * Use eselect news to read news items.
  3.  
  4. Calculating dependencies... done!
  5.  
  6. >>> Verifying ebuild manifests
  7.  
  8. >>> Emerging (1 of 1) app-emulation/virtualbox-modules-4.1.12
  9. * vbox-kernel-module-src-4.1.12.tar.xz RMD160 SHA1 SHA256 size ;-) ... [ ok ]
  10. * Determining the location of the kernel source code
  11. * Found kernel source directory:
  12. * /usr/src/linux
  13. * Found kernel object directory:
  14. * /lib/modules/3.2.12-gentoo/build
  15. * Found sources for kernel version:
  16. * 3.2.12-gentoo
  17. >>> Unpacking source...
  18. >>> Unpacking vbox-kernel-module-src-4.1.12.tar.xz to /var/tmp/portage/app-emulation/virtualbox-modules-4.1.12/work
  19. >>> Source unpacked in /var/tmp/portage/app-emulation/virtualbox-modules-4.1.12/work
  20. >>> Preparing source in /var/tmp/portage/app-emulation/virtualbox-modules-4.1.12/work ...
  21. * Applying virtualbox-modules-4.1.4-pax-const.patch ... [ ok ]
  22. >>> Source prepared.
  23. >>> Configuring source in /var/tmp/portage/app-emulation/virtualbox-modules-4.1.12/work ...
  24. >>> Source configured.
  25. >>> Compiling source in /var/tmp/portage/app-emulation/virtualbox-modules-4.1.12/work ...
  26. ln: failed to create symbolic link `Module.symvers': File exists
  27. * Preparing vboxdrv module
  28. make -j10 HOSTCC=x86_64-pc-linux-gnu-gcc CROSS_COMPILE=x86_64-pc-linux-gnu- 'LDFLAGS=-m elf_x86_64' KERN_DIR=/usr/src/linux KERNOUT=/lib/modules/3.2.12-gentoo/build all
  29. *** Building 'vboxdrv' module ***
  30. make[1]: Entering directory `/var/tmp/portage/app-emulation/virtualbox-modules-4.1.12/work/vboxdrv'
  31. make KBUILD_VERBOSE= SUBDIRS=/var/tmp/portage/app-emulation/virtualbox-modules-4.1.12/work/vboxdrv SRCROOT=/var/tmp/portage/app-emulation/virtualbox-modules-4.1.12/work/vboxdrv CONFIG_MODULE_SIG= -C /usr/src/linux modules
  32. make[2]: Entering directory `/usr/src/linux-3.2.12-gentoo'
  33. CC [M] /var/tmp/portage/app-emulation/virtualbox-modules-4.1.12/work/vboxdrv/linux/SUPDrv-linux.o
  34. CC [M] /var/tmp/portage/app-emulation/virtualbox-modules-4.1.12/work/vboxdrv/SUPDrv.o
  35. CC [M] /var/tmp/portage/app-emulation/virtualbox-modules-4.1.12/work/vboxdrv/SUPDrvSem.o
  36. CC [M] /var/tmp/portage/app-emulation/virtualbox-modules-4.1.12/work/vboxdrv/r0drv/alloc-r0drv.o
  37. CC [M] /var/tmp/portage/app-emulation/virtualbox-modules-4.1.12/work/vboxdrv/r0drv/initterm-r0drv.o
  38. CC [M] /var/tmp/portage/app-emulation/virtualbox-modules-4.1.12/work/vboxdrv/r0drv/memobj-r0drv.o
  39. CC [M] /var/tmp/portage/app-emulation/virtualbox-modules-4.1.12/work/vboxdrv/r0drv/mpnotification-r0drv.o
  40. CC [M] /var/tmp/portage/app-emulation/virtualbox-modules-4.1.12/work/vboxdrv/r0drv/powernotification-r0drv.o
  41. CC [M] /var/tmp/portage/app-emulation/virtualbox-modules-4.1.12/work/vboxdrv/r0drv/linux/assert-r0drv-linux.o
  42. CC [M] /var/tmp/portage/app-emulation/virtualbox-modules-4.1.12/work/vboxdrv/r0drv/linux/alloc-r0drv-linux.o
  43. In file included from /var/tmp/portage/app-emulation/virtualbox-modules-4.1.12/work/vboxdrv/SUPDrvInternal.h:146:0,
  44. from /var/tmp/portage/app-emulation/virtualbox-modules-4.1.12/work/vboxdrv/SUPDrv.c:32:
  45. /var/tmp/portage/app-emulation/virtualbox-modules-4.1.12/work/vboxdrv/SUPDrvIDC.h:163:22: error: expected ':', ',', ';', '}' or '__attribute__' before 'Out'
  46. In file included from /var/tmp/portage/app-emulation/virtualbox-modules-4.1.12/work/vboxdrv/SUPDrvInternal.h:146:0,
  47. from /var/tmp/portage/app-emulation/virtualbox-modules-4.1.12/work/vboxdrv/SUPDrvSem.c:32:
  48. /var/tmp/portage/app-emulation/virtualbox-modules-4.1.12/work/vboxdrv/SUPDrvIDC.h:163:22: error: expected ':', ',', ';', '}' or '__attribute__' before 'Out'
  49. make[3]: *** [/var/tmp/portage/app-emulation/virtualbox-modules-4.1.12/work/vboxdrv/SUPDrvSem.o] Error 1
  50. make[3]: *** Waiting for unfinished jobs....
  51. /var/tmp/portage/app-emulation/virtualbox-modules-4.1.12/work/vboxdrv/SUPDrv.c: In function 'supdrvIDC_LdrGetSymbol':
  52. /var/tmp/portage/app-emulation/virtualbox-modules-4.1.12/work/vboxdrv/SUPDrv.c:4345:24: error: 'union <anonymous>' has no member named 'Out'
  53. /var/tmp/portage/app-emulation/virtualbox-modules-4.1.12/work/vboxdrv/SUPDrv.c:4376:28: error: 'union <anonymous>' has no member named 'Out'
  54. In file included from /var/tmp/portage/app-emulation/virtualbox-modules-4.1.12/work/vboxdrv/linux/../SUPDrvInternal.h:146:0,
  55. from /var/tmp/portage/app-emulation/virtualbox-modules-4.1.12/work/vboxdrv/linux/SUPDrv-linux.c:31:
  56. /var/tmp/portage/app-emulation/virtualbox-modules-4.1.12/work/vboxdrv/linux/../SUPDrvIDC.h:163:22: error: expected ':', ',', ';', '}' or '__attribute__' before 'Out'
  57. make[3]: *** [/var/tmp/portage/app-emulation/virtualbox-modules-4.1.12/work/vboxdrv/SUPDrv.o] Error 1
  58. make[3]: *** [/var/tmp/portage/app-emulation/virtualbox-modules-4.1.12/work/vboxdrv/linux/SUPDrv-linux.o] Error 1
  59. make[2]: *** [_module_/var/tmp/portage/app-emulation/virtualbox-modules-4.1.12/work/vboxdrv] Error 2
  60. make[2]: Leaving directory `/usr/src/linux-3.2.12-gentoo'
  61. make[1]: *** [vboxdrv] Error 2
  62. make[1]: Leaving directory `/var/tmp/portage/app-emulation/virtualbox-modules-4.1.12/work/vboxdrv'
  63. make: *** [all] Error 2
  64. * ERROR: app-emulation/virtualbox-modules-4.1.12 failed (compile phase):
  65. * emake failed
  66. *
  67. * If you need support, post the output of 'emerge --info =app-emulation/virtualbox-modules-4.1.12',
  68. * the complete build log and the output of 'emerge -pqv =app-emulation/virtualbox-modules-4.1.12'.
  69. * The complete build log is located at '/var/tmp/portage/app-emulation/virtualbox-modules-4.1.12/temp/build.log'.
  70. * The ebuild environment file is located at '/var/tmp/portage/app-emulation/virtualbox-modules-4.1.12/temp/environment'.
  71. * S: '/var/tmp/portage/app-emulation/virtualbox-modules-4.1.12/work'
  72.  
  73. >>> Failed to emerge app-emulation/virtualbox-modules-4.1.12, Log file:
  74.  
  75. >>> '/var/tmp/portage/app-emulation/virtualbox-modules-4.1.12/temp/build.log'
  76.  
  77. * Messages for package app-emulation/virtualbox-modules-4.1.12:
  78.  
  79. * ERROR: app-emulation/virtualbox-modules-4.1.12 failed (compile phase):
  80. * emake failed
  81. *
  82. * If you need support, post the output of 'emerge --info =app-emulation/virtualbox-modules-4.1.12',
  83. * the complete build log and the output of 'emerge -pqv =app-emulation/virtualbox-modules-4.1.12'.
  84. * The complete build log is located at '/var/tmp/portage/app-emulation/virtualbox-modules-4.1.12/temp/build.log'.
  85. * The ebuild environment file is located at '/var/tmp/portage/app-emulation/virtualbox-modules-4.1.12/temp/environment'.
  86. * S: '/var/tmp/portage/app-emulation/virtualbox-modules-4.1.12/work'
  87.  
  88. * IMPORTANT: 2 news items need reading for repository 'gentoo'.
  89. * Use eselect news to read news items.
Advertisement
RAW Paste Data Copied
Advertisement