Guest User

Untitled

a guest
Jul 10th, 2013
401
Never
Not a member of Pastebin yet? Sign Up, it unlocks many cool features!
  1. [WARNING] Error injecting: org.apache.maven.shared.dependency.graph.internal.Mav
  2. en3DependencyGraphBuilder
  3. java.lang.NoClassDefFoundError: org/sonatype/aether/graph/DependencyNode
  4. at java.lang.Class.getDeclaredMethods0(Native Method)
  5. at java.lang.Class.privateGetDeclaredMethods(Class.java:2521)
  6. at java.lang.Class.getDeclaredMethods(Class.java:1845)
  7. at com.google.inject.spi.InjectionPoint.getInjectionPoints(InjectionPoin
  8. t.java:674)
  9. at com.google.inject.spi.InjectionPoint.forInstanceMethodsAndFields(Inje
  10. ctionPoint.java:366)
  11. at com.google.inject.internal.ConstructorBindingImpl.getInternalDependen
  12. cies(ConstructorBindingImpl.java:165)
  13. at com.google.inject.internal.InjectorImpl.getInternalDependencies(Injec
  14. torImpl.java:609)
  15. at com.google.inject.internal.InjectorImpl.cleanup(InjectorImpl.java:565
  16. )
  17. at com.google.inject.internal.InjectorImpl.initializeJitBinding(Injector
  18. Impl.java:551)
  19. at com.google.inject.internal.InjectorImpl.createJustInTimeBinding(Injec
  20. torImpl.java:865)
  21. at com.google.inject.internal.InjectorImpl.createJustInTimeBindingRecurs
  22. ive(InjectorImpl.java:790)
  23. at com.google.inject.internal.InjectorImpl.getJustInTimeBinding(Injector
  24. Impl.java:278)
  25. at com.google.inject.internal.InjectorImpl.getBindingOrThrow(InjectorImp
  26. l.java:210)
  27. at com.google.inject.internal.InjectorImpl.getProviderOrThrow(InjectorIm
  28. pl.java:986)
  29. at com.google.inject.internal.InjectorImpl.getProvider(InjectorImpl.java
  30. :1019)
  31. at com.google.inject.internal.InjectorImpl.getProvider(InjectorImpl.java
  32. :982)
  33. at com.google.inject.internal.InjectorImpl.getInstance(InjectorImpl.java
  34. :1032)
  35. at org.eclipse.sisu.reflect.AbstractDeferredClass.get(AbstractDeferredCl
  36. ass.java:44)
  37. at com.google.inject.internal.ProviderInternalFactory.provision(Provider
  38. InternalFactory.java:86)
  39. at com.google.inject.internal.InternalFactoryToInitializableAdapter.prov
  40. ision(InternalFactoryToInitializableAdapter.java:55)
  41. at com.google.inject.internal.ProviderInternalFactory$1.call(ProviderInt
  42. ernalFactory.java:70)
  43. at com.google.inject.internal.ProvisionListenerStackCallback$Provision.p
  44. rovision(ProvisionListenerStackCallback.java:100)
  45. at org.eclipse.sisu.plexus.lifecycles.PlexusLifecycleManager.onProvision
  46. (PlexusLifecycleManager.java:134)
  47. at com.google.inject.internal.ProvisionListenerStackCallback$Provision.p
  48. rovision(ProvisionListenerStackCallback.java:109)
  49. at com.google.inject.internal.ProvisionListenerStackCallback.provision(P
  50. rovisionListenerStackCallback.java:55)
  51. at com.google.inject.internal.ProviderInternalFactory.circularGet(Provid
  52. erInternalFactory.java:68)
  53. at com.google.inject.internal.InternalFactoryToInitializableAdapter.get(
  54. InternalFactoryToInitializableAdapter.java:47)
  55. at com.google.inject.internal.ProviderToInternalFactoryAdapter$1.call(Pr
  56. oviderToInternalFactoryAdapter.java:46)
  57. at com.google.inject.internal.InjectorImpl.callInContext(InjectorImpl.ja
  58. va:1054)
  59. at com.google.inject.internal.ProviderToInternalFactoryAdapter.get(Provi
  60. derToInternalFactoryAdapter.java:40)
  61. at com.google.inject.Scopes$1$1.get(Scopes.java:59)
  62. at com.google.inject.internal.InternalFactoryToProviderAdapter.get(Inter
  63. nalFactoryToProviderAdapter.java:41)
  64. at com.google.inject.internal.InjectorImpl$2$1.call(InjectorImpl.java:99
  65. 7)
  66. at com.google.inject.internal.InjectorImpl.callInContext(InjectorImpl.ja
  67. va:1047)
  68. at com.google.inject.internal.InjectorImpl$2.get(InjectorImpl.java:993)
  69. at org.eclipse.sisu.locators.LazyBeanEntry.getValue(LazyBeanEntry.java:8
  70. 2)
  71. at org.eclipse.sisu.plexus.locators.LazyPlexusBean.getValue(LazyPlexusBe
  72. an.java:52)
  73. at org.codehaus.plexus.DefaultPlexusContainer.lookup(DefaultPlexusContai
  74. ner.java:259)
  75. at org.codehaus.plexus.DefaultPlexusContainer.lookup(DefaultPlexusContai
  76. ner.java:239)
  77. at org.apache.maven.shared.dependency.graph.internal.DefaultDependencyGr
  78. aphBuilder.buildDependencyGraph(DefaultDependencyGraphBuilder.java:60)
  79. at org.apache.maven.plugins.shade.mojo.ShadeMojo.updateExcludesInDeps(Sh
  80. adeMojo.java:965)
  81. at org.apache.maven.plugins.shade.mojo.ShadeMojo.createDependencyReduced
  82. Pom(ShadeMojo.java:938)
  83. at org.apache.maven.plugins.shade.mojo.ShadeMojo.execute(ShadeMojo.java:
  84. 544)
  85. at org.apache.maven.plugin.DefaultBuildPluginManager.executeMojo(Default
  86. BuildPluginManager.java:106)
  87. at org.apache.maven.lifecycle.internal.MojoExecutor.execute(MojoExecutor
  88. .java:208)
  89. at org.apache.maven.lifecycle.internal.MojoExecutor.execute(MojoExecutor
  90. .java:153)
  91. at org.apache.maven.lifecycle.internal.MojoExecutor.execute(MojoExecutor
  92. .java:145)
  93. at org.apache.maven.lifecycle.internal.LifecycleModuleBuilder.buildProje
  94. ct(LifecycleModuleBuilder.java:84)
  95. at org.apache.maven.lifecycle.internal.LifecycleModuleBuilder.buildProje
  96. ct(LifecycleModuleBuilder.java:59)
  97. at org.apache.maven.lifecycle.internal.LifecycleStarter.singleThreadedBu
  98. ild(LifecycleStarter.java:183)
  99. at org.apache.maven.lifecycle.internal.LifecycleStarter.execute(Lifecycl
  100. eStarter.java:161)
  101. at org.apache.maven.DefaultMaven.doExecute(DefaultMaven.java:318)
  102. at org.apache.maven.DefaultMaven.execute(DefaultMaven.java:153)
  103. at org.apache.maven.cli.MavenCli.execute(MavenCli.java:555)
  104. at org.apache.maven.cli.MavenCli.doMain(MavenCli.java:214)
  105. at org.apache.maven.cli.MavenCli.main(MavenCli.java:158)
  106. at sun.reflect.NativeMethodAccessorImpl.invoke0(Native Method)
  107. at sun.reflect.NativeMethodAccessorImpl.invoke(NativeMethodAccessorImpl.
  108. java:57)
  109. at sun.reflect.DelegatingMethodAccessorImpl.invoke(DelegatingMethodAcces
  110. sorImpl.java:43)
  111. at java.lang.reflect.Method.invoke(Method.java:606)
  112. at org.codehaus.plexus.classworlds.launcher.Launcher.launchEnhanced(Laun
  113. cher.java:290)
  114. at org.codehaus.plexus.classworlds.launcher.Launcher.launch(Launcher.jav
  115. a:230)
  116. at org.codehaus.plexus.classworlds.launcher.Launcher.mainWithExitCode(La
  117. uncher.java:414)
  118. at org.codehaus.plexus.classworlds.launcher.Launcher.main(Launcher.java:
  119. 357)
  120. Caused by: java.lang.ClassNotFoundException: org.sonatype.aether.graph.Dependenc
  121. yNode
  122. at org.codehaus.plexus.classworlds.strategy.SelfFirstStrategy.loadClass(
  123. SelfFirstStrategy.java:50)
  124. at org.codehaus.plexus.classworlds.realm.ClassRealm.loadClass(ClassRealm
  125. .java:244)
  126. at org.codehaus.plexus.classworlds.realm.ClassRealm.loadClass(ClassRealm
  127. .java:230)
  128. ... 64 more
  129. [INFO] ------------------------------------------------------------------------
  130. [INFO] BUILD FAILURE
  131. [INFO] ------------------------------------------------------------------------
  132. [INFO] Total time: 47.283s
  133. [INFO] Finished at: Wed Jul 10 12:46:48 EDT 2013
  134. [INFO] Final Memory: 6M/32M
  135. [INFO] ------------------------------------------------------------------------
  136. [ERROR] Failed to execute goal org.apache.maven.plugins:maven-shade-plugin:2.0:s
  137. hade (default) on project spigot: Execution default of goal org.apache.maven.plu
  138. gins:maven-shade-plugin:2.0:shade failed: A required class was missing while exe
  139. cuting org.apache.maven.plugins:maven-shade-plugin:2.0:shade: org/sonatype/aethe
  140. r/graph/DependencyNode
  141. [ERROR] -----------------------------------------------------
  142. [ERROR] realm = plugin>org.apache.maven.plugins:maven-shade-plugin:2.0
  143. [ERROR] strategy = org.codehaus.plexus.classworlds.strategy.SelfFirstStrategy
  144. [ERROR] urls[0] = file:/C:/Users/Robert/.m2/repository/org/apache/maven/plugins/
  145. maven-shade-plugin/2.0/maven-shade-plugin-2.0.jar
  146. [ERROR] urls[1] = file:/C:/Users/Robert/.m2/repository/org/sonatype/sisu/sisu-in
  147. ject-bean/1.4.2/sisu-inject-bean-1.4.2.jar
  148. [ERROR] urls[2] = file:/C:/Users/Robert/.m2/repository/org/sonatype/sisu/sisu-gu
  149. ice/2.1.7/sisu-guice-2.1.7-noaop.jar
  150. [ERROR] urls[3] = file:/C:/Users/Robert/.m2/repository/org/sonatype/aether/aethe
  151. r-util/1.7/aether-util-1.7.jar
  152. [ERROR] urls[4] = file:/C:/Users/Robert/.m2/repository/org/codehaus/plexus/plexu
  153. s-interpolation/1.14/plexus-interpolation-1.14.jar
  154. [ERROR] urls[5] = file:/C:/Users/Robert/.m2/repository/org/codehaus/plexus/plexu
  155. s-component-annotations/1.5.5/plexus-component-annotations-1.5.5.jar
  156. [ERROR] urls[6] = file:/C:/Users/Robert/.m2/repository/org/sonatype/plexus/plexu
  157. s-sec-dispatcher/1.3/plexus-sec-dispatcher-1.3.jar
  158. [ERROR] urls[7] = file:/C:/Users/Robert/.m2/repository/org/sonatype/plexus/plexu
  159. s-cipher/1.4/plexus-cipher-1.4.jar
  160. [ERROR] urls[8] = file:/C:/Users/Robert/.m2/repository/junit/junit/3.8.1/junit-3
  161. .8.1.jar
  162. [ERROR] urls[9] = file:/C:/Users/Robert/.m2/repository/org/codehaus/plexus/plexu
  163. s-utils/3.0.1/plexus-utils-3.0.1.jar
  164. [ERROR] urls[10] = file:/C:/Users/Robert/.m2/repository/asm/asm/3.3.1/asm-3.3.1.
  165. jar
  166. [ERROR] urls[11] = file:/C:/Users/Robert/.m2/repository/asm/asm-commons/3.3.1/as
  167. m-commons-3.3.1.jar
  168. [ERROR] urls[12] = file:/C:/Users/Robert/.m2/repository/asm/asm-tree/3.3.1/asm-t
  169. ree-3.3.1.jar
  170. [ERROR] urls[13] = file:/C:/Users/Robert/.m2/repository/org/jdom/jdom/1.1/jdom-1
  171. .1.jar
  172. [ERROR] urls[14] = file:/C:/Users/Robert/.m2/repository/org/apache/maven/shared/
  173. maven-dependency-tree/2.0/maven-dependency-tree-2.0.jar
  174. [ERROR] urls[15] = file:/C:/Users/Robert/.m2/repository/backport-util-concurrent
  175. /backport-util-concurrent/3.1/backport-util-concurrent-3.1.jar
  176. [ERROR] urls[16] = file:/C:/Users/Robert/.m2/repository/org/vafer/jdependency/0.
  177. 7/jdependency-0.7.jar
  178. [ERROR] urls[17] = file:/C:/Users/Robert/.m2/repository/commons-io/commons-io/1.
  179. 3.2/commons-io-1.3.2.jar
  180. [ERROR] urls[18] = file:/C:/Users/Robert/.m2/repository/asm/asm-analysis/3.2/asm
  181. -analysis-3.2.jar
  182. [ERROR] urls[19] = file:/C:/Users/Robert/.m2/repository/asm/asm-util/3.2/asm-uti
  183. l-3.2.jar
  184. [ERROR] Number of foreign imports: 1
  185. [ERROR] import: Entry[import from realm ClassRealm[maven.api, parent: null]]
  186. [ERROR]
  187. [ERROR] -----------------------------------------------------: org.sonatype.aeth
  188. er.graph.DependencyNode
  189. [ERROR] -> [Help 1]
  190. [ERROR]
  191. [ERROR] To see the full stack trace of the errors, re-run Maven with the -e swit
  192. ch.
  193. [ERROR] Re-run Maven using the -X switch to enable full debug logging.
  194. [ERROR]
  195. [ERROR] For more information about the errors and possible solutions, please rea
  196. d the following articles:
  197. [ERROR] [Help 1] http://cwiki.apache.org/confluence/display/MAVEN/AetherClassNot
  198. Found
RAW Paste Data