Guest User

Untitled

a guest
May 12th, 2013
218
Never
Not a member of Pastebin yet? Sign Up, it unlocks many cool features!
  1. DKMS make.log for nvidia-319.17 for kernel 3.10.0-rc1-core2duo (x86_64)
  2. Sun May 12 12:19:51 CEST 2013
  3. NVIDIA: calling KBUILD...
  4. make -C /lib/modules/3.10.0-rc1-core2duo/build \
  5. KBUILD_SRC=/home/sdcafe/Kompajlirani_programi/KERNEL/linux-3.10-rc1 \
  6. KBUILD_EXTMOD="/var/lib/dkms/nvidia/319.17/build" -f /home/sdcafe/Kompajlirani_programi/KERNEL/linux-3.10-rc1/Makefile \
  7. modules
  8. test -e include/generated/autoconf.h -a -e include/config/auto.conf || ( \
  9. echo >&2; \
  10. echo >&2 " ERROR: Kernel configuration is invalid."; \
  11. echo >&2 " include/generated/autoconf.h or include/config/auto.conf are missing.";\
  12. echo >&2 " Run 'make oldconfig && make prepare' on kernel src to fix it."; \
  13. echo >&2 ; \
  14. /bin/false)
  15. mkdir -p /var/lib/dkms/nvidia/319.17/build/.tmp_versions ; rm -f /var/lib/dkms/nvidia/319.17/build/.tmp_versions/*
  16. make -f /home/sdcafe/Kompajlirani_programi/KERNEL/linux-3.10-rc1/scripts/Makefile.build obj=/var/lib/dkms/nvidia/319.17/build
  17. cc -Wp,-MD,/var/lib/dkms/nvidia/319.17/build/.nv.o.d -nostdinc -isystem /usr/lib/gcc/x86_64-linux-gnu/4.7/include -I/home/sdcafe/Kompajlirani_programi/KERNEL/linux-3.10-rc1/arch/x86/include -Iarch/x86/include/generated -I/home/sdcafe/Kompajlirani_programi/KERNEL/linux-3.10-rc1/include -Iinclude -I/home/sdcafe/Kompajlirani_programi/KERNEL/linux-3.10-rc1/arch/x86/include/uapi -Iarch/x86/include/generated/uapi -I/home/sdcafe/Kompajlirani_programi/KERNEL/linux-3.10-rc1/include/uapi -Iinclude/generated/uapi -include /home/sdcafe/Kompajlirani_programi/KERNEL/linux-3.10-rc1/include/linux/kconfig.h -I/var/lib/dkms/nvidia/319.17/build -D__KERNEL__ -Wall -Wundef -Wstrict-prototypes -Wno-trigraphs -fno-strict-aliasing -fno-common -Werror-implicit-function-declaration -Wno-format-security -fno-delete-null-pointer-checks -Os -Wno-maybe-uninitialized -m64 -mno-sse -mpreferred-stack-boundary=3 -march=core2 -mno-red-zone -mcmodel=kernel -funit-at-a-time -maccumulate-outgoing-args -fstack-protector -DCONFIG_AS_CFI=1 -DCONFIG_AS_CFI_SIGNAL_FRAME=1 -DCONFIG_AS_CFI_SECTIONS=1 -DCONFIG_AS_FXSAVEQ=1 -DCONFIG_AS_AVX=1 -DCONFIG_AS_AVX2=1 -pipe -Wno-sign-compare -fno-asynchronous-unwind-tables -mno-sse -mno-mmx -mno-sse2 -mno-3dnow -mno-avx -Wframe-larger-than=1024 -Wno-unused-but-set-variable -fno-omit-frame-pointer -fno-optimize-sibling-calls -Wdeclaration-after-statement -Wno-pointer-sign -fno-strict-overflow -fconserve-stack -DCC_HAVE_ASM_GOTO -I/var/lib/dkms/nvidia/319.17/build -Wall -MD -Wsign-compare -Wno-cast-qual -Wno-error -D__KERNEL__ -DMODULE -DNVRM -DNV_VERSION_STRING=\"319.17\" -Wno-unused-function -Wuninitialized -mno-red-zone -mcmodel=kernel -UDEBUG -U_DEBUG -DNDEBUG -D__linux__ -DMODULE -D"KBUILD_STR(s)=#s" -D"KBUILD_BASENAME=KBUILD_STR(nv)" -D"KBUILD_MODNAME=KBUILD_STR(nvidia)" -c -o /var/lib/dkms/nvidia/319.17/build/.tmp_nv.o /var/lib/dkms/nvidia/319.17/build/nv.c
  18. In file included from /home/sdcafe/Kompajlirani_programi/KERNEL/linux-3.10-rc1/include/linux/kernel.h:10:0,
  19. from /home/sdcafe/Kompajlirani_programi/KERNEL/linux-3.10-rc1/include/linux/sched.h:15,
  20. from /home/sdcafe/Kompajlirani_programi/KERNEL/linux-3.10-rc1/include/linux/utsname.h:5,
  21. from /var/lib/dkms/nvidia/319.17/build/nv-linux.h:44,
  22. from /var/lib/dkms/nvidia/319.17/build/nv.c:13:
  23. /home/sdcafe/Kompajlirani_programi/KERNEL/linux-3.10-rc1/include/linux/bitops.h: In function ‘hweight_long’:
  24. /home/sdcafe/Kompajlirani_programi/KERNEL/linux-3.10-rc1/include/linux/bitops.h:66:41: warning: signed and unsigned type in conditional expression [-Wsign-compare]
  25. In file included from /home/sdcafe/Kompajlirani_programi/KERNEL/linux-3.10-rc1/arch/x86/include/asm/cpumask.h:4:0,
  26. from /home/sdcafe/Kompajlirani_programi/KERNEL/linux-3.10-rc1/arch/x86/include/asm/msr.h:10,
  27. from /home/sdcafe/Kompajlirani_programi/KERNEL/linux-3.10-rc1/arch/x86/include/asm/processor.h:20,
  28. from /home/sdcafe/Kompajlirani_programi/KERNEL/linux-3.10-rc1/arch/x86/include/asm/thread_info.h:22,
  29. from /home/sdcafe/Kompajlirani_programi/KERNEL/linux-3.10-rc1/include/linux/thread_info.h:54,
  30. from /home/sdcafe/Kompajlirani_programi/KERNEL/linux-3.10-rc1/include/linux/preempt.h:9,
  31. from /home/sdcafe/Kompajlirani_programi/KERNEL/linux-3.10-rc1/include/linux/spinlock.h:50,
  32. from /home/sdcafe/Kompajlirani_programi/KERNEL/linux-3.10-rc1/include/linux/seqlock.h:29,
  33. from /home/sdcafe/Kompajlirani_programi/KERNEL/linux-3.10-rc1/include/linux/time.h:5,
  34. from /home/sdcafe/Kompajlirani_programi/KERNEL/linux-3.10-rc1/include/uapi/linux/timex.h:56,
  35. from /home/sdcafe/Kompajlirani_programi/KERNEL/linux-3.10-rc1/include/linux/timex.h:56,
  36. from /home/sdcafe/Kompajlirani_programi/KERNEL/linux-3.10-rc1/include/linux/sched.h:17,
  37. from /home/sdcafe/Kompajlirani_programi/KERNEL/linux-3.10-rc1/include/linux/utsname.h:5,
  38. from /var/lib/dkms/nvidia/319.17/build/nv-linux.h:44,
  39. from /var/lib/dkms/nvidia/319.17/build/nv.c:13:
  40. /home/sdcafe/Kompajlirani_programi/KERNEL/linux-3.10-rc1/include/linux/cpumask.h: In function ‘cpumask_parse’:
  41. /home/sdcafe/Kompajlirani_programi/KERNEL/linux-3.10-rc1/include/linux/cpumask.h:603:26: warning: signed and unsigned type in conditional expression [-Wsign-compare]
  42. In file included from /home/sdcafe/Kompajlirani_programi/KERNEL/linux-3.10-rc1/arch/x86/include/asm/uaccess.h:539:0,
  43. from /home/sdcafe/Kompajlirani_programi/KERNEL/linux-3.10-rc1/include/linux/poll.h:11,
  44. from /var/lib/dkms/nvidia/319.17/build/nv-linux.h:115,
  45. from /var/lib/dkms/nvidia/319.17/build/nv.c:13:
  46. /home/sdcafe/Kompajlirani_programi/KERNEL/linux-3.10-rc1/arch/x86/include/asm/uaccess_64.h: In function ‘copy_from_user’:
  47. /home/sdcafe/Kompajlirani_programi/KERNEL/linux-3.10-rc1/arch/x86/include/asm/uaccess_64.h:62:6: warning: comparison between signed and unsigned integer expressions [-Wsign-compare]
  48. cc -Wp,-MD,/var/lib/dkms/nvidia/319.17/build/.nv-acpi.o.d -nostdinc -isystem /usr/lib/gcc/x86_64-linux-gnu/4.7/include -I/home/sdcafe/Kompajlirani_programi/KERNEL/linux-3.10-rc1/arch/x86/include -Iarch/x86/include/generated -I/home/sdcafe/Kompajlirani_programi/KERNEL/linux-3.10-rc1/include -Iinclude -I/home/sdcafe/Kompajlirani_programi/KERNEL/linux-3.10-rc1/arch/x86/include/uapi -Iarch/x86/include/generated/uapi -I/home/sdcafe/Kompajlirani_programi/KERNEL/linux-3.10-rc1/include/uapi -Iinclude/generated/uapi -include /home/sdcafe/Kompajlirani_programi/KERNEL/linux-3.10-rc1/include/linux/kconfig.h -I/var/lib/dkms/nvidia/319.17/build -D__KERNEL__ -Wall -Wundef -Wstrict-prototypes -Wno-trigraphs -fno-strict-aliasing -fno-common -Werror-implicit-function-declaration -Wno-format-security -fno-delete-null-pointer-checks -Os -Wno-maybe-uninitialized -m64 -mno-sse -mpreferred-stack-boundary=3 -march=core2 -mno-red-zone -mcmodel=kernel -funit-at-a-time -maccumulate-outgoing-args -fstack-protector -DCONFIG_AS_CFI=1 -DCONFIG_AS_CFI_SIGNAL_FRAME=1 -DCONFIG_AS_CFI_SECTIONS=1 -DCONFIG_AS_FXSAVEQ=1 -DCONFIG_AS_AVX=1 -DCONFIG_AS_AVX2=1 -pipe -Wno-sign-compare -fno-asynchronous-unwind-tables -mno-sse -mno-mmx -mno-sse2 -mno-3dnow -mno-avx -Wframe-larger-than=1024 -Wno-unused-but-set-variable -fno-omit-frame-pointer -fno-optimize-sibling-calls -Wdeclaration-after-statement -Wno-pointer-sign -fno-strict-overflow -fconserve-stack -DCC_HAVE_ASM_GOTO -I/var/lib/dkms/nvidia/319.17/build -Wall -MD -Wsign-compare -Wno-cast-qual -Wno-error -D__KERNEL__ -DMODULE -DNVRM -DNV_VERSION_STRING=\"319.17\" -Wno-unused-function -Wuninitialized -mno-red-zone -mcmodel=kernel -UDEBUG -U_DEBUG -DNDEBUG -D__linux__ -DMODULE -D"KBUILD_STR(s)=#s" -D"KBUILD_BASENAME=KBUILD_STR(nv_acpi)" -D"KBUILD_MODNAME=KBUILD_STR(nvidia)" -c -o /var/lib/dkms/nvidia/319.17/build/.tmp_nv-acpi.o /var/lib/dkms/nvidia/319.17/build/nv-acpi.c
  49. In file included from /home/sdcafe/Kompajlirani_programi/KERNEL/linux-3.10-rc1/include/linux/kernel.h:10:0,
  50. from /home/sdcafe/Kompajlirani_programi/KERNEL/linux-3.10-rc1/include/linux/sched.h:15,
  51. from /home/sdcafe/Kompajlirani_programi/KERNEL/linux-3.10-rc1/include/linux/utsname.h:5,
  52. from /var/lib/dkms/nvidia/319.17/build/nv-linux.h:44,
  53. from /var/lib/dkms/nvidia/319.17/build/nv-acpi.c:15:
  54. /home/sdcafe/Kompajlirani_programi/KERNEL/linux-3.10-rc1/include/linux/bitops.h: In function ‘hweight_long’:
  55. /home/sdcafe/Kompajlirani_programi/KERNEL/linux-3.10-rc1/include/linux/bitops.h:66:41: warning: signed and unsigned type in conditional expression [-Wsign-compare]
  56. In file included from /home/sdcafe/Kompajlirani_programi/KERNEL/linux-3.10-rc1/arch/x86/include/asm/cpumask.h:4:0,
  57. from /home/sdcafe/Kompajlirani_programi/KERNEL/linux-3.10-rc1/arch/x86/include/asm/msr.h:10,
  58. from /home/sdcafe/Kompajlirani_programi/KERNEL/linux-3.10-rc1/arch/x86/include/asm/processor.h:20,
  59. from /home/sdcafe/Kompajlirani_programi/KERNEL/linux-3.10-rc1/arch/x86/include/asm/thread_info.h:22,
  60. from /home/sdcafe/Kompajlirani_programi/KERNEL/linux-3.10-rc1/include/linux/thread_info.h:54,
  61. from /home/sdcafe/Kompajlirani_programi/KERNEL/linux-3.10-rc1/include/linux/preempt.h:9,
  62. from /home/sdcafe/Kompajlirani_programi/KERNEL/linux-3.10-rc1/include/linux/spinlock.h:50,
  63. from /home/sdcafe/Kompajlirani_programi/KERNEL/linux-3.10-rc1/include/linux/seqlock.h:29,
  64. from /home/sdcafe/Kompajlirani_programi/KERNEL/linux-3.10-rc1/include/linux/time.h:5,
  65. from /home/sdcafe/Kompajlirani_programi/KERNEL/linux-3.10-rc1/include/uapi/linux/timex.h:56,
  66. from /home/sdcafe/Kompajlirani_programi/KERNEL/linux-3.10-rc1/include/linux/timex.h:56,
  67. from /home/sdcafe/Kompajlirani_programi/KERNEL/linux-3.10-rc1/include/linux/sched.h:17,
  68. from /home/sdcafe/Kompajlirani_programi/KERNEL/linux-3.10-rc1/include/linux/utsname.h:5,
  69. from /var/lib/dkms/nvidia/319.17/build/nv-linux.h:44,
  70. from /var/lib/dkms/nvidia/319.17/build/nv-acpi.c:15:
  71. /home/sdcafe/Kompajlirani_programi/KERNEL/linux-3.10-rc1/include/linux/cpumask.h: In function ‘cpumask_parse’:
  72. /home/sdcafe/Kompajlirani_programi/KERNEL/linux-3.10-rc1/include/linux/cpumask.h:603:26: warning: signed and unsigned type in conditional expression [-Wsign-compare]
  73. In file included from /home/sdcafe/Kompajlirani_programi/KERNEL/linux-3.10-rc1/arch/x86/include/asm/uaccess.h:539:0,
  74. from /home/sdcafe/Kompajlirani_programi/KERNEL/linux-3.10-rc1/include/linux/poll.h:11,
  75. from /var/lib/dkms/nvidia/319.17/build/nv-linux.h:115,
  76. from /var/lib/dkms/nvidia/319.17/build/nv-acpi.c:15:
  77. /home/sdcafe/Kompajlirani_programi/KERNEL/linux-3.10-rc1/arch/x86/include/asm/uaccess_64.h: In function ‘copy_from_user’:
  78. /home/sdcafe/Kompajlirani_programi/KERNEL/linux-3.10-rc1/arch/x86/include/asm/uaccess_64.h:62:6: warning: comparison between signed and unsigned integer expressions [-Wsign-compare]
  79. /var/lib/dkms/nvidia/319.17/build/nv-acpi.c: At top level:
  80. /var/lib/dkms/nvidia/319.17/build/nv-acpi.c:70:9: warning: initialization from incompatible pointer type [enabled by default]
  81. /var/lib/dkms/nvidia/319.17/build/nv-acpi.c:70:9: warning: (near initialization for ‘nv_acpi_driver_template.ops.remove’) [enabled by default]
  82. cc -Wp,-MD,/var/lib/dkms/nvidia/319.17/build/.nv-chrdev.o.d -nostdinc -isystem /usr/lib/gcc/x86_64-linux-gnu/4.7/include -I/home/sdcafe/Kompajlirani_programi/KERNEL/linux-3.10-rc1/arch/x86/include -Iarch/x86/include/generated -I/home/sdcafe/Kompajlirani_programi/KERNEL/linux-3.10-rc1/include -Iinclude -I/home/sdcafe/Kompajlirani_programi/KERNEL/linux-3.10-rc1/arch/x86/include/uapi -Iarch/x86/include/generated/uapi -I/home/sdcafe/Kompajlirani_programi/KERNEL/linux-3.10-rc1/include/uapi -Iinclude/generated/uapi -include /home/sdcafe/Kompajlirani_programi/KERNEL/linux-3.10-rc1/include/linux/kconfig.h -I/var/lib/dkms/nvidia/319.17/build -D__KERNEL__ -Wall -Wundef -Wstrict-prototypes -Wno-trigraphs -fno-strict-aliasing -fno-common -Werror-implicit-function-declaration -Wno-format-security -fno-delete-null-pointer-checks -Os -Wno-maybe-uninitialized -m64 -mno-sse -mpreferred-stack-boundary=3 -march=core2 -mno-red-zone -mcmodel=kernel -funit-at-a-time -maccumulate-outgoing-args -fstack-protector -DCONFIG_AS_CFI=1 -DCONFIG_AS_CFI_SIGNAL_FRAME=1 -DCONFIG_AS_CFI_SECTIONS=1 -DCONFIG_AS_FXSAVEQ=1 -DCONFIG_AS_AVX=1 -DCONFIG_AS_AVX2=1 -pipe -Wno-sign-compare -fno-asynchronous-unwind-tables -mno-sse -mno-mmx -mno-sse2 -mno-3dnow -mno-avx -Wframe-larger-than=1024 -Wno-unused-but-set-variable -fno-omit-frame-pointer -fno-optimize-sibling-calls -Wdeclaration-after-statement -Wno-pointer-sign -fno-strict-overflow -fconserve-stack -DCC_HAVE_ASM_GOTO -I/var/lib/dkms/nvidia/319.17/build -Wall -MD -Wsign-compare -Wno-cast-qual -Wno-error -D__KERNEL__ -DMODULE -DNVRM -DNV_VERSION_STRING=\"319.17\" -Wno-unused-function -Wuninitialized -mno-red-zone -mcmodel=kernel -UDEBUG -U_DEBUG -DNDEBUG -D__linux__ -DMODULE -D"KBUILD_STR(s)=#s" -D"KBUILD_BASENAME=KBUILD_STR(nv_chrdev)" -D"KBUILD_MODNAME=KBUILD_STR(nvidia)" -c -o /var/lib/dkms/nvidia/319.17/build/.tmp_nv-chrdev.o /var/lib/dkms/nvidia/319.17/build/nv-chrdev.c
  83. In file included from /home/sdcafe/Kompajlirani_programi/KERNEL/linux-3.10-rc1/include/linux/kernel.h:10:0,
  84. from /home/sdcafe/Kompajlirani_programi/KERNEL/linux-3.10-rc1/include/linux/sched.h:15,
  85. from /home/sdcafe/Kompajlirani_programi/KERNEL/linux-3.10-rc1/include/linux/utsname.h:5,
  86. from /var/lib/dkms/nvidia/319.17/build/nv-linux.h:44,
  87. from /var/lib/dkms/nvidia/319.17/build/nv-chrdev.c:15:
  88. /home/sdcafe/Kompajlirani_programi/KERNEL/linux-3.10-rc1/include/linux/bitops.h: In function ‘hweight_long’:
  89. /home/sdcafe/Kompajlirani_programi/KERNEL/linux-3.10-rc1/include/linux/bitops.h:66:41: warning: signed and unsigned type in conditional expression [-Wsign-compare]
  90. In file included from /home/sdcafe/Kompajlirani_programi/KERNEL/linux-3.10-rc1/arch/x86/include/asm/cpumask.h:4:0,
  91. from /home/sdcafe/Kompajlirani_programi/KERNEL/linux-3.10-rc1/arch/x86/include/asm/msr.h:10,
  92. from /home/sdcafe/Kompajlirani_programi/KERNEL/linux-3.10-rc1/arch/x86/include/asm/processor.h:20,
  93. from /home/sdcafe/Kompajlirani_programi/KERNEL/linux-3.10-rc1/arch/x86/include/asm/thread_info.h:22,
  94. from /home/sdcafe/Kompajlirani_programi/KERNEL/linux-3.10-rc1/include/linux/thread_info.h:54,
  95. from /home/sdcafe/Kompajlirani_programi/KERNEL/linux-3.10-rc1/include/linux/preempt.h:9,
  96. from /home/sdcafe/Kompajlirani_programi/KERNEL/linux-3.10-rc1/include/linux/spinlock.h:50,
  97. from /home/sdcafe/Kompajlirani_programi/KERNEL/linux-3.10-rc1/include/linux/seqlock.h:29,
  98. from /home/sdcafe/Kompajlirani_programi/KERNEL/linux-3.10-rc1/include/linux/time.h:5,
  99. from /home/sdcafe/Kompajlirani_programi/KERNEL/linux-3.10-rc1/include/uapi/linux/timex.h:56,
  100. from /home/sdcafe/Kompajlirani_programi/KERNEL/linux-3.10-rc1/include/linux/timex.h:56,
  101. from /home/sdcafe/Kompajlirani_programi/KERNEL/linux-3.10-rc1/include/linux/sched.h:17,
  102. from /home/sdcafe/Kompajlirani_programi/KERNEL/linux-3.10-rc1/include/linux/utsname.h:5,
  103. from /var/lib/dkms/nvidia/319.17/build/nv-linux.h:44,
  104. from /var/lib/dkms/nvidia/319.17/build/nv-chrdev.c:15:
  105. /home/sdcafe/Kompajlirani_programi/KERNEL/linux-3.10-rc1/include/linux/cpumask.h: In function ‘cpumask_parse’:
  106. /home/sdcafe/Kompajlirani_programi/KERNEL/linux-3.10-rc1/include/linux/cpumask.h:603:26: warning: signed and unsigned type in conditional expression [-Wsign-compare]
  107. In file included from /home/sdcafe/Kompajlirani_programi/KERNEL/linux-3.10-rc1/arch/x86/include/asm/uaccess.h:539:0,
  108. from /home/sdcafe/Kompajlirani_programi/KERNEL/linux-3.10-rc1/include/linux/poll.h:11,
  109. from /var/lib/dkms/nvidia/319.17/build/nv-linux.h:115,
  110. from /var/lib/dkms/nvidia/319.17/build/nv-chrdev.c:15:
  111. /home/sdcafe/Kompajlirani_programi/KERNEL/linux-3.10-rc1/arch/x86/include/asm/uaccess_64.h: In function ‘copy_from_user’:
  112. /home/sdcafe/Kompajlirani_programi/KERNEL/linux-3.10-rc1/arch/x86/include/asm/uaccess_64.h:62:6: warning: comparison between signed and unsigned integer expressions [-Wsign-compare]
  113. cc -Wp,-MD,/var/lib/dkms/nvidia/319.17/build/.nv-cray.o.d -nostdinc -isystem /usr/lib/gcc/x86_64-linux-gnu/4.7/include -I/home/sdcafe/Kompajlirani_programi/KERNEL/linux-3.10-rc1/arch/x86/include -Iarch/x86/include/generated -I/home/sdcafe/Kompajlirani_programi/KERNEL/linux-3.10-rc1/include -Iinclude -I/home/sdcafe/Kompajlirani_programi/KERNEL/linux-3.10-rc1/arch/x86/include/uapi -Iarch/x86/include/generated/uapi -I/home/sdcafe/Kompajlirani_programi/KERNEL/linux-3.10-rc1/include/uapi -Iinclude/generated/uapi -include /home/sdcafe/Kompajlirani_programi/KERNEL/linux-3.10-rc1/include/linux/kconfig.h -I/var/lib/dkms/nvidia/319.17/build -D__KERNEL__ -Wall -Wundef -Wstrict-prototypes -Wno-trigraphs -fno-strict-aliasing -fno-common -Werror-implicit-function-declaration -Wno-format-security -fno-delete-null-pointer-checks -Os -Wno-maybe-uninitialized -m64 -mno-sse -mpreferred-stack-boundary=3 -march=core2 -mno-red-zone -mcmodel=kernel -funit-at-a-time -maccumulate-outgoing-args -fstack-protector -DCONFIG_AS_CFI=1 -DCONFIG_AS_CFI_SIGNAL_FRAME=1 -DCONFIG_AS_CFI_SECTIONS=1 -DCONFIG_AS_FXSAVEQ=1 -DCONFIG_AS_AVX=1 -DCONFIG_AS_AVX2=1 -pipe -Wno-sign-compare -fno-asynchronous-unwind-tables -mno-sse -mno-mmx -mno-sse2 -mno-3dnow -mno-avx -Wframe-larger-than=1024 -Wno-unused-but-set-variable -fno-omit-frame-pointer -fno-optimize-sibling-calls -Wdeclaration-after-statement -Wno-pointer-sign -fno-strict-overflow -fconserve-stack -DCC_HAVE_ASM_GOTO -I/var/lib/dkms/nvidia/319.17/build -Wall -MD -Wsign-compare -Wno-cast-qual -Wno-error -D__KERNEL__ -DMODULE -DNVRM -DNV_VERSION_STRING=\"319.17\" -Wno-unused-function -Wuninitialized -mno-red-zone -mcmodel=kernel -UDEBUG -U_DEBUG -DNDEBUG -D__linux__ -DMODULE -D"KBUILD_STR(s)=#s" -D"KBUILD_BASENAME=KBUILD_STR(nv_cray)" -D"KBUILD_MODNAME=KBUILD_STR(nvidia)" -c -o /var/lib/dkms/nvidia/319.17/build/.tmp_nv-cray.o /var/lib/dkms/nvidia/319.17/build/nv-cray.c
  114. In file included from /home/sdcafe/Kompajlirani_programi/KERNEL/linux-3.10-rc1/include/linux/kernel.h:10:0,
  115. from /home/sdcafe/Kompajlirani_programi/KERNEL/linux-3.10-rc1/include/linux/sched.h:15,
  116. from /home/sdcafe/Kompajlirani_programi/KERNEL/linux-3.10-rc1/include/linux/utsname.h:5,
  117. from /var/lib/dkms/nvidia/319.17/build/nv-linux.h:44,
  118. from /var/lib/dkms/nvidia/319.17/build/nv-cray.c:15:
  119. /home/sdcafe/Kompajlirani_programi/KERNEL/linux-3.10-rc1/include/linux/bitops.h: In function ‘hweight_long’:
  120. /home/sdcafe/Kompajlirani_programi/KERNEL/linux-3.10-rc1/include/linux/bitops.h:66:41: warning: signed and unsigned type in conditional expression [-Wsign-compare]
  121. In file included from /home/sdcafe/Kompajlirani_programi/KERNEL/linux-3.10-rc1/arch/x86/include/asm/cpumask.h:4:0,
  122. from /home/sdcafe/Kompajlirani_programi/KERNEL/linux-3.10-rc1/arch/x86/include/asm/msr.h:10,
  123. from /home/sdcafe/Kompajlirani_programi/KERNEL/linux-3.10-rc1/arch/x86/include/asm/processor.h:20,
  124. from /home/sdcafe/Kompajlirani_programi/KERNEL/linux-3.10-rc1/arch/x86/include/asm/thread_info.h:22,
  125. from /home/sdcafe/Kompajlirani_programi/KERNEL/linux-3.10-rc1/include/linux/thread_info.h:54,
  126. from /home/sdcafe/Kompajlirani_programi/KERNEL/linux-3.10-rc1/include/linux/preempt.h:9,
  127. from /home/sdcafe/Kompajlirani_programi/KERNEL/linux-3.10-rc1/include/linux/spinlock.h:50,
  128. from /home/sdcafe/Kompajlirani_programi/KERNEL/linux-3.10-rc1/include/linux/seqlock.h:29,
  129. from /home/sdcafe/Kompajlirani_programi/KERNEL/linux-3.10-rc1/include/linux/time.h:5,
  130. from /home/sdcafe/Kompajlirani_programi/KERNEL/linux-3.10-rc1/include/uapi/linux/timex.h:56,
  131. from /home/sdcafe/Kompajlirani_programi/KERNEL/linux-3.10-rc1/include/linux/timex.h:56,
  132. from /home/sdcafe/Kompajlirani_programi/KERNEL/linux-3.10-rc1/include/linux/sched.h:17,
  133. from /home/sdcafe/Kompajlirani_programi/KERNEL/linux-3.10-rc1/include/linux/utsname.h:5,
  134. from /var/lib/dkms/nvidia/319.17/build/nv-linux.h:44,
  135. from /var/lib/dkms/nvidia/319.17/build/nv-cray.c:15:
  136. /home/sdcafe/Kompajlirani_programi/KERNEL/linux-3.10-rc1/include/linux/cpumask.h: In function ‘cpumask_parse’:
  137. /home/sdcafe/Kompajlirani_programi/KERNEL/linux-3.10-rc1/include/linux/cpumask.h:603:26: warning: signed and unsigned type in conditional expression [-Wsign-compare]
  138. In file included from /home/sdcafe/Kompajlirani_programi/KERNEL/linux-3.10-rc1/arch/x86/include/asm/uaccess.h:539:0,
  139. from /home/sdcafe/Kompajlirani_programi/KERNEL/linux-3.10-rc1/include/linux/poll.h:11,
  140. from /var/lib/dkms/nvidia/319.17/build/nv-linux.h:115,
  141. from /var/lib/dkms/nvidia/319.17/build/nv-cray.c:15:
  142. /home/sdcafe/Kompajlirani_programi/KERNEL/linux-3.10-rc1/arch/x86/include/asm/uaccess_64.h: In function ‘copy_from_user’:
  143. /home/sdcafe/Kompajlirani_programi/KERNEL/linux-3.10-rc1/arch/x86/include/asm/uaccess_64.h:62:6: warning: comparison between signed and unsigned integer expressions [-Wsign-compare]
  144. cc -Wp,-MD,/var/lib/dkms/nvidia/319.17/build/.nv-drm.o.d -nostdinc -isystem /usr/lib/gcc/x86_64-linux-gnu/4.7/include -I/home/sdcafe/Kompajlirani_programi/KERNEL/linux-3.10-rc1/arch/x86/include -Iarch/x86/include/generated -I/home/sdcafe/Kompajlirani_programi/KERNEL/linux-3.10-rc1/include -Iinclude -I/home/sdcafe/Kompajlirani_programi/KERNEL/linux-3.10-rc1/arch/x86/include/uapi -Iarch/x86/include/generated/uapi -I/home/sdcafe/Kompajlirani_programi/KERNEL/linux-3.10-rc1/include/uapi -Iinclude/generated/uapi -include /home/sdcafe/Kompajlirani_programi/KERNEL/linux-3.10-rc1/include/linux/kconfig.h -I/var/lib/dkms/nvidia/319.17/build -D__KERNEL__ -Wall -Wundef -Wstrict-prototypes -Wno-trigraphs -fno-strict-aliasing -fno-common -Werror-implicit-function-declaration -Wno-format-security -fno-delete-null-pointer-checks -Os -Wno-maybe-uninitialized -m64 -mno-sse -mpreferred-stack-boundary=3 -march=core2 -mno-red-zone -mcmodel=kernel -funit-at-a-time -maccumulate-outgoing-args -fstack-protector -DCONFIG_AS_CFI=1 -DCONFIG_AS_CFI_SIGNAL_FRAME=1 -DCONFIG_AS_CFI_SECTIONS=1 -DCONFIG_AS_FXSAVEQ=1 -DCONFIG_AS_AVX=1 -DCONFIG_AS_AVX2=1 -pipe -Wno-sign-compare -fno-asynchronous-unwind-tables -mno-sse -mno-mmx -mno-sse2 -mno-3dnow -mno-avx -Wframe-larger-than=1024 -Wno-unused-but-set-variable -fno-omit-frame-pointer -fno-optimize-sibling-calls -Wdeclaration-after-statement -Wno-pointer-sign -fno-strict-overflow -fconserve-stack -DCC_HAVE_ASM_GOTO -I/var/lib/dkms/nvidia/319.17/build -Wall -MD -Wsign-compare -Wno-cast-qual -Wno-error -D__KERNEL__ -DMODULE -DNVRM -DNV_VERSION_STRING=\"319.17\" -Wno-unused-function -Wuninitialized -mno-red-zone -mcmodel=kernel -UDEBUG -U_DEBUG -DNDEBUG -D__linux__ -DMODULE -D"KBUILD_STR(s)=#s" -D"KBUILD_BASENAME=KBUILD_STR(nv_drm)" -D"KBUILD_MODNAME=KBUILD_STR(nvidia)" -c -o /var/lib/dkms/nvidia/319.17/build/.tmp_nv-drm.o /var/lib/dkms/nvidia/319.17/build/nv-drm.c
  145. In file included from /home/sdcafe/Kompajlirani_programi/KERNEL/linux-3.10-rc1/include/linux/kernel.h:10:0,
  146. from /home/sdcafe/Kompajlirani_programi/KERNEL/linux-3.10-rc1/include/linux/sched.h:15,
  147. from /home/sdcafe/Kompajlirani_programi/KERNEL/linux-3.10-rc1/include/linux/utsname.h:5,
  148. from /var/lib/dkms/nvidia/319.17/build/nv-linux.h:44,
  149. from /var/lib/dkms/nvidia/319.17/build/nv-drm.c:15:
  150. /home/sdcafe/Kompajlirani_programi/KERNEL/linux-3.10-rc1/include/linux/bitops.h: In function ‘hweight_long’:
  151. /home/sdcafe/Kompajlirani_programi/KERNEL/linux-3.10-rc1/include/linux/bitops.h:66:41: warning: signed and unsigned type in conditional expression [-Wsign-compare]
  152. In file included from /home/sdcafe/Kompajlirani_programi/KERNEL/linux-3.10-rc1/arch/x86/include/asm/cpumask.h:4:0,
  153. from /home/sdcafe/Kompajlirani_programi/KERNEL/linux-3.10-rc1/arch/x86/include/asm/msr.h:10,
  154. from /home/sdcafe/Kompajlirani_programi/KERNEL/linux-3.10-rc1/arch/x86/include/asm/processor.h:20,
  155. from /home/sdcafe/Kompajlirani_programi/KERNEL/linux-3.10-rc1/arch/x86/include/asm/thread_info.h:22,
  156. from /home/sdcafe/Kompajlirani_programi/KERNEL/linux-3.10-rc1/include/linux/thread_info.h:54,
  157. from /home/sdcafe/Kompajlirani_programi/KERNEL/linux-3.10-rc1/include/linux/preempt.h:9,
  158. from /home/sdcafe/Kompajlirani_programi/KERNEL/linux-3.10-rc1/include/linux/spinlock.h:50,
  159. from /home/sdcafe/Kompajlirani_programi/KERNEL/linux-3.10-rc1/include/linux/seqlock.h:29,
  160. from /home/sdcafe/Kompajlirani_programi/KERNEL/linux-3.10-rc1/include/linux/time.h:5,
  161. from /home/sdcafe/Kompajlirani_programi/KERNEL/linux-3.10-rc1/include/uapi/linux/timex.h:56,
  162. from /home/sdcafe/Kompajlirani_programi/KERNEL/linux-3.10-rc1/include/linux/timex.h:56,
  163. from /home/sdcafe/Kompajlirani_programi/KERNEL/linux-3.10-rc1/include/linux/sched.h:17,
  164. from /home/sdcafe/Kompajlirani_programi/KERNEL/linux-3.10-rc1/include/linux/utsname.h:5,
  165. from /var/lib/dkms/nvidia/319.17/build/nv-linux.h:44,
  166. from /var/lib/dkms/nvidia/319.17/build/nv-drm.c:15:
  167. /home/sdcafe/Kompajlirani_programi/KERNEL/linux-3.10-rc1/include/linux/cpumask.h: In function ‘cpumask_parse’:
  168. /home/sdcafe/Kompajlirani_programi/KERNEL/linux-3.10-rc1/include/linux/cpumask.h:603:26: warning: signed and unsigned type in conditional expression [-Wsign-compare]
  169. In file included from /home/sdcafe/Kompajlirani_programi/KERNEL/linux-3.10-rc1/arch/x86/include/asm/uaccess.h:539:0,
  170. from /home/sdcafe/Kompajlirani_programi/KERNEL/linux-3.10-rc1/include/linux/poll.h:11,
  171. from /var/lib/dkms/nvidia/319.17/build/nv-linux.h:115,
  172. from /var/lib/dkms/nvidia/319.17/build/nv-drm.c:15:
  173. /home/sdcafe/Kompajlirani_programi/KERNEL/linux-3.10-rc1/arch/x86/include/asm/uaccess_64.h: In function ‘copy_from_user’:
  174. /home/sdcafe/Kompajlirani_programi/KERNEL/linux-3.10-rc1/arch/x86/include/asm/uaccess_64.h:62:6: warning: comparison between signed and unsigned integer expressions [-Wsign-compare]
  175. In file included from /home/sdcafe/Kompajlirani_programi/KERNEL/linux-3.10-rc1/include/drm/drm_crtc.h:32:0,
  176. from /home/sdcafe/Kompajlirani_programi/KERNEL/linux-3.10-rc1/include/drm/drmP.h:690,
  177. from /var/lib/dkms/nvidia/319.17/build/nv-drm.c:19:
  178. /home/sdcafe/Kompajlirani_programi/KERNEL/linux-3.10-rc1/include/linux/fb.h: In function ‘__fb_pad_aligned_buffer’:
  179. /home/sdcafe/Kompajlirani_programi/KERNEL/linux-3.10-rc1/include/linux/fb.h:650:17: warning: comparison between signed and unsigned integer expressions [-Wsign-compare]
  180. cc -Wp,-MD,/var/lib/dkms/nvidia/319.17/build/.nv-gvi.o.d -nostdinc -isystem /usr/lib/gcc/x86_64-linux-gnu/4.7/include -I/home/sdcafe/Kompajlirani_programi/KERNEL/linux-3.10-rc1/arch/x86/include -Iarch/x86/include/generated -I/home/sdcafe/Kompajlirani_programi/KERNEL/linux-3.10-rc1/include -Iinclude -I/home/sdcafe/Kompajlirani_programi/KERNEL/linux-3.10-rc1/arch/x86/include/uapi -Iarch/x86/include/generated/uapi -I/home/sdcafe/Kompajlirani_programi/KERNEL/linux-3.10-rc1/include/uapi -Iinclude/generated/uapi -include /home/sdcafe/Kompajlirani_programi/KERNEL/linux-3.10-rc1/include/linux/kconfig.h -I/var/lib/dkms/nvidia/319.17/build -D__KERNEL__ -Wall -Wundef -Wstrict-prototypes -Wno-trigraphs -fno-strict-aliasing -fno-common -Werror-implicit-function-declaration -Wno-format-security -fno-delete-null-pointer-checks -Os -Wno-maybe-uninitialized -m64 -mno-sse -mpreferred-stack-boundary=3 -march=core2 -mno-red-zone -mcmodel=kernel -funit-at-a-time -maccumulate-outgoing-args -fstack-protector -DCONFIG_AS_CFI=1 -DCONFIG_AS_CFI_SIGNAL_FRAME=1 -DCONFIG_AS_CFI_SECTIONS=1 -DCONFIG_AS_FXSAVEQ=1 -DCONFIG_AS_AVX=1 -DCONFIG_AS_AVX2=1 -pipe -Wno-sign-compare -fno-asynchronous-unwind-tables -mno-sse -mno-mmx -mno-sse2 -mno-3dnow -mno-avx -Wframe-larger-than=1024 -Wno-unused-but-set-variable -fno-omit-frame-pointer -fno-optimize-sibling-calls -Wdeclaration-after-statement -Wno-pointer-sign -fno-strict-overflow -fconserve-stack -DCC_HAVE_ASM_GOTO -I/var/lib/dkms/nvidia/319.17/build -Wall -MD -Wsign-compare -Wno-cast-qual -Wno-error -D__KERNEL__ -DMODULE -DNVRM -DNV_VERSION_STRING=\"319.17\" -Wno-unused-function -Wuninitialized -mno-red-zone -mcmodel=kernel -UDEBUG -U_DEBUG -DNDEBUG -D__linux__ -DMODULE -D"KBUILD_STR(s)=#s" -D"KBUILD_BASENAME=KBUILD_STR(nv_gvi)" -D"KBUILD_MODNAME=KBUILD_STR(nvidia)" -c -o /var/lib/dkms/nvidia/319.17/build/.tmp_nv-gvi.o /var/lib/dkms/nvidia/319.17/build/nv-gvi.c
  181. In file included from /home/sdcafe/Kompajlirani_programi/KERNEL/linux-3.10-rc1/include/linux/kernel.h:10:0,
  182. from /home/sdcafe/Kompajlirani_programi/KERNEL/linux-3.10-rc1/include/linux/sched.h:15,
  183. from /home/sdcafe/Kompajlirani_programi/KERNEL/linux-3.10-rc1/include/linux/utsname.h:5,
  184. from /var/lib/dkms/nvidia/319.17/build/nv-linux.h:44,
  185. from /var/lib/dkms/nvidia/319.17/build/nv-gvi.c:15:
  186. /home/sdcafe/Kompajlirani_programi/KERNEL/linux-3.10-rc1/include/linux/bitops.h: In function ‘hweight_long’:
  187. /home/sdcafe/Kompajlirani_programi/KERNEL/linux-3.10-rc1/include/linux/bitops.h:66:41: warning: signed and unsigned type in conditional expression [-Wsign-compare]
  188. In file included from /home/sdcafe/Kompajlirani_programi/KERNEL/linux-3.10-rc1/arch/x86/include/asm/cpumask.h:4:0,
  189. from /home/sdcafe/Kompajlirani_programi/KERNEL/linux-3.10-rc1/arch/x86/include/asm/msr.h:10,
  190. from /home/sdcafe/Kompajlirani_programi/KERNEL/linux-3.10-rc1/arch/x86/include/asm/processor.h:20,
  191. from /home/sdcafe/Kompajlirani_programi/KERNEL/linux-3.10-rc1/arch/x86/include/asm/thread_info.h:22,
  192. from /home/sdcafe/Kompajlirani_programi/KERNEL/linux-3.10-rc1/include/linux/thread_info.h:54,
  193. from /home/sdcafe/Kompajlirani_programi/KERNEL/linux-3.10-rc1/include/linux/preempt.h:9,
  194. from /home/sdcafe/Kompajlirani_programi/KERNEL/linux-3.10-rc1/include/linux/spinlock.h:50,
  195. from /home/sdcafe/Kompajlirani_programi/KERNEL/linux-3.10-rc1/include/linux/seqlock.h:29,
  196. from /home/sdcafe/Kompajlirani_programi/KERNEL/linux-3.10-rc1/include/linux/time.h:5,
  197. from /home/sdcafe/Kompajlirani_programi/KERNEL/linux-3.10-rc1/include/uapi/linux/timex.h:56,
  198. from /home/sdcafe/Kompajlirani_programi/KERNEL/linux-3.10-rc1/include/linux/timex.h:56,
  199. from /home/sdcafe/Kompajlirani_programi/KERNEL/linux-3.10-rc1/include/linux/sched.h:17,
  200. from /home/sdcafe/Kompajlirani_programi/KERNEL/linux-3.10-rc1/include/linux/utsname.h:5,
  201. from /var/lib/dkms/nvidia/319.17/build/nv-linux.h:44,
  202. from /var/lib/dkms/nvidia/319.17/build/nv-gvi.c:15:
  203. /home/sdcafe/Kompajlirani_programi/KERNEL/linux-3.10-rc1/include/linux/cpumask.h: In function ‘cpumask_parse’:
  204. /home/sdcafe/Kompajlirani_programi/KERNEL/linux-3.10-rc1/include/linux/cpumask.h:603:26: warning: signed and unsigned type in conditional expression [-Wsign-compare]
  205. In file included from /home/sdcafe/Kompajlirani_programi/KERNEL/linux-3.10-rc1/arch/x86/include/asm/uaccess.h:539:0,
  206. from /home/sdcafe/Kompajlirani_programi/KERNEL/linux-3.10-rc1/include/linux/poll.h:11,
  207. from /var/lib/dkms/nvidia/319.17/build/nv-linux.h:115,
  208. from /var/lib/dkms/nvidia/319.17/build/nv-gvi.c:15:
  209. /home/sdcafe/Kompajlirani_programi/KERNEL/linux-3.10-rc1/arch/x86/include/asm/uaccess_64.h: In function ‘copy_from_user’:
  210. /home/sdcafe/Kompajlirani_programi/KERNEL/linux-3.10-rc1/arch/x86/include/asm/uaccess_64.h:62:6: warning: comparison between signed and unsigned integer expressions [-Wsign-compare]
  211. cc -Wp,-MD,/var/lib/dkms/nvidia/319.17/build/.nv-i2c.o.d -nostdinc -isystem /usr/lib/gcc/x86_64-linux-gnu/4.7/include -I/home/sdcafe/Kompajlirani_programi/KERNEL/linux-3.10-rc1/arch/x86/include -Iarch/x86/include/generated -I/home/sdcafe/Kompajlirani_programi/KERNEL/linux-3.10-rc1/include -Iinclude -I/home/sdcafe/Kompajlirani_programi/KERNEL/linux-3.10-rc1/arch/x86/include/uapi -Iarch/x86/include/generated/uapi -I/home/sdcafe/Kompajlirani_programi/KERNEL/linux-3.10-rc1/include/uapi -Iinclude/generated/uapi -include /home/sdcafe/Kompajlirani_programi/KERNEL/linux-3.10-rc1/include/linux/kconfig.h -I/var/lib/dkms/nvidia/319.17/build -D__KERNEL__ -Wall -Wundef -Wstrict-prototypes -Wno-trigraphs -fno-strict-aliasing -fno-common -Werror-implicit-function-declaration -Wno-format-security -fno-delete-null-pointer-checks -Os -Wno-maybe-uninitialized -m64 -mno-sse -mpreferred-stack-boundary=3 -march=core2 -mno-red-zone -mcmodel=kernel -funit-at-a-time -maccumulate-outgoing-args -fstack-protector -DCONFIG_AS_CFI=1 -DCONFIG_AS_CFI_SIGNAL_FRAME=1 -DCONFIG_AS_CFI_SECTIONS=1 -DCONFIG_AS_FXSAVEQ=1 -DCONFIG_AS_AVX=1 -DCONFIG_AS_AVX2=1 -pipe -Wno-sign-compare -fno-asynchronous-unwind-tables -mno-sse -mno-mmx -mno-sse2 -mno-3dnow -mno-avx -Wframe-larger-than=1024 -Wno-unused-but-set-variable -fno-omit-frame-pointer -fno-optimize-sibling-calls -Wdeclaration-after-statement -Wno-pointer-sign -fno-strict-overflow -fconserve-stack -DCC_HAVE_ASM_GOTO -I/var/lib/dkms/nvidia/319.17/build -Wall -MD -Wsign-compare -Wno-cast-qual -Wno-error -D__KERNEL__ -DMODULE -DNVRM -DNV_VERSION_STRING=\"319.17\" -Wno-unused-function -Wuninitialized -mno-red-zone -mcmodel=kernel -UDEBUG -U_DEBUG -DNDEBUG -D__linux__ -DMODULE -D"KBUILD_STR(s)=#s" -D"KBUILD_BASENAME=KBUILD_STR(nv_i2c)" -D"KBUILD_MODNAME=KBUILD_STR(nvidia)" -c -o /var/lib/dkms/nvidia/319.17/build/.tmp_nv-i2c.o /var/lib/dkms/nvidia/319.17/build/nv-i2c.c
  212. In file included from /home/sdcafe/Kompajlirani_programi/KERNEL/linux-3.10-rc1/include/linux/kernel.h:10:0,
  213. from /home/sdcafe/Kompajlirani_programi/KERNEL/linux-3.10-rc1/include/linux/sched.h:15,
  214. from /home/sdcafe/Kompajlirani_programi/KERNEL/linux-3.10-rc1/include/linux/utsname.h:5,
  215. from /var/lib/dkms/nvidia/319.17/build/nv-linux.h:44,
  216. from /var/lib/dkms/nvidia/319.17/build/nv-i2c.c:15:
  217. /home/sdcafe/Kompajlirani_programi/KERNEL/linux-3.10-rc1/include/linux/bitops.h: In function ‘hweight_long’:
  218. /home/sdcafe/Kompajlirani_programi/KERNEL/linux-3.10-rc1/include/linux/bitops.h:66:41: warning: signed and unsigned type in conditional expression [-Wsign-compare]
  219. In file included from /home/sdcafe/Kompajlirani_programi/KERNEL/linux-3.10-rc1/arch/x86/include/asm/cpumask.h:4:0,
  220. from /home/sdcafe/Kompajlirani_programi/KERNEL/linux-3.10-rc1/arch/x86/include/asm/msr.h:10,
  221. from /home/sdcafe/Kompajlirani_programi/KERNEL/linux-3.10-rc1/arch/x86/include/asm/processor.h:20,
  222. from /home/sdcafe/Kompajlirani_programi/KERNEL/linux-3.10-rc1/arch/x86/include/asm/thread_info.h:22,
  223. from /home/sdcafe/Kompajlirani_programi/KERNEL/linux-3.10-rc1/include/linux/thread_info.h:54,
  224. from /home/sdcafe/Kompajlirani_programi/KERNEL/linux-3.10-rc1/include/linux/preempt.h:9,
  225. from /home/sdcafe/Kompajlirani_programi/KERNEL/linux-3.10-rc1/include/linux/spinlock.h:50,
  226. from /home/sdcafe/Kompajlirani_programi/KERNEL/linux-3.10-rc1/include/linux/seqlock.h:29,
  227. from /home/sdcafe/Kompajlirani_programi/KERNEL/linux-3.10-rc1/include/linux/time.h:5,
  228. from /home/sdcafe/Kompajlirani_programi/KERNEL/linux-3.10-rc1/include/uapi/linux/timex.h:56,
  229. from /home/sdcafe/Kompajlirani_programi/KERNEL/linux-3.10-rc1/include/linux/timex.h:56,
  230. from /home/sdcafe/Kompajlirani_programi/KERNEL/linux-3.10-rc1/include/linux/sched.h:17,
  231. from /home/sdcafe/Kompajlirani_programi/KERNEL/linux-3.10-rc1/include/linux/utsname.h:5,
  232. from /var/lib/dkms/nvidia/319.17/build/nv-linux.h:44,
  233. from /var/lib/dkms/nvidia/319.17/build/nv-i2c.c:15:
  234. /home/sdcafe/Kompajlirani_programi/KERNEL/linux-3.10-rc1/include/linux/cpumask.h: In function ‘cpumask_parse’:
  235. /home/sdcafe/Kompajlirani_programi/KERNEL/linux-3.10-rc1/include/linux/cpumask.h:603:26: warning: signed and unsigned type in conditional expression [-Wsign-compare]
  236. In file included from /home/sdcafe/Kompajlirani_programi/KERNEL/linux-3.10-rc1/arch/x86/include/asm/uaccess.h:539:0,
  237. from /home/sdcafe/Kompajlirani_programi/KERNEL/linux-3.10-rc1/include/linux/poll.h:11,
  238. from /var/lib/dkms/nvidia/319.17/build/nv-linux.h:115,
  239. from /var/lib/dkms/nvidia/319.17/build/nv-i2c.c:15:
  240. /home/sdcafe/Kompajlirani_programi/KERNEL/linux-3.10-rc1/arch/x86/include/asm/uaccess_64.h: In function ‘copy_from_user’:
  241. /home/sdcafe/Kompajlirani_programi/KERNEL/linux-3.10-rc1/arch/x86/include/asm/uaccess_64.h:62:6: warning: comparison between signed and unsigned integer expressions [-Wsign-compare]
  242. /var/lib/dkms/nvidia/319.17/build/nv-i2c.c: In function ‘nv_i2c_del_adapter’:
  243. /var/lib/dkms/nvidia/319.17/build/nv-i2c.c:327:14: error: void value not ignored as it ought to be
  244. make[4]: *** [/var/lib/dkms/nvidia/319.17/build/nv-i2c.o] Error 1
  245. make[3]: *** [_module_/var/lib/dkms/nvidia/319.17/build] Error 2
  246. make[2]: *** [sub-make] Error 2
  247. NVIDIA: left KBUILD.
  248. nvidia.ko failed to build!
  249. make[1]: *** [module] Error 1
  250. make: *** [module] Error 2
RAW Paste Data