Guest User

Untitled

a guest
Jan 12th, 2019
108
Never
Not a member of Pastebin yet? Sign Up, it unlocks many cool features!
  1. Creating .dep_dirs-build...
  2. Creating .dep_dirs-build...
  3. mkdir -p -- ../../class/lib/build-linux/
  4. CSC [build-linux] mscorlib.dll
  5.  
  6. Unhandled Exception:
  7. System.TypeInitializationException: TypeInitialization_Type ---> System.TypeInitializationException: TypeInitialization_Type ---> System.Exception: Magic number is wrong: 542
  8. at System.TermInfoReader.ReadHeader (System.Byte[] buffer, System.Int32& position) [0x00028] in <9c83ac7656b54f6caee1746dab90d91a>:0
  9. at System.TermInfoReader..ctor (System.String term, System.String filename) [0x0005f] in <9c83ac7656b54f6caee1746dab90d91a>:0
  10. at System.TermInfoDriver..ctor (System.String term) [0x00055] in <9c83ac7656b54f6caee1746dab90d91a>:0
  11. at System.ConsoleDriver.CreateTermInfoDriver (System.String term) [0x00000] in <9c83ac7656b54f6caee1746dab90d91a>:0
  12. at System.ConsoleDriver..cctor () [0x0004d] in <9c83ac7656b54f6caee1746dab90d91a>:0
  13. Exception_EndOfInnerExceptionStack
  14. at System.Console.SetupStreams (System.Text.Encoding inputEncoding, System.Text.Encoding outputEncoding) [0x00007] in <9c83ac7656b54f6caee1746dab90d91a>:0
  15. at System.Console..cctor () [0x0008e] in <9c83ac7656b54f6caee1746dab90d91a>:0
  16. Exception_EndOfInnerExceptionStack
  17. at Microsoft.CodeAnalysis.CommandLine.BuildClient.RunCompilation (System.Collections.Generic.IEnumerable`1[T] originalArguments, Microsoft.CodeAnalysis.BuildPaths buildPaths, System.IO.TextWriter textWriter) [0x00005] in <0d46d413edc9411fa4eb1c4cbce40409>:0
  18. at Microsoft.CodeAnalysis.CommandLine.DesktopBuildClient.Run (System.Collections.Generic.IEnumerable`1[T] arguments, Microsoft.CodeAnalysis.CommandLine.RequestLanguage language, Microsoft.CodeAnalysis.CommandLine.CompileFunc compileFunc, Microsoft.CodeAnalysis.IAnalyzerAssemblyLoader analyzerAssemblyLoader) [0x00037] in <0d46d413edc9411fa4eb1c4cbce40409>:0
  19. at Microsoft.CodeAnalysis.CSharp.CommandLine.Program.MainCore (System.String[] args) [0x00017] in <0d46d413edc9411fa4eb1c4cbce40409>:0
  20. at Microsoft.CodeAnalysis.CSharp.CommandLine.Program.Main (System.String[] args) [0x00000] in <0d46d413edc9411fa4eb1c4cbce40409>:0
  21. [ERROR] FATAL UNHANDLED EXCEPTION: System.TypeInitializationException: TypeInitialization_Type ---> System.TypeInitializationException: TypeInitialization_Type ---> System.Exception: Magic number is wrong: 542
  22. at System.TermInfoReader.ReadHeader (System.Byte[] buffer, System.Int32& position) [0x00028] in <9c83ac7656b54f6caee1746dab90d91a>:0
  23. at System.TermInfoReader..ctor (System.String term, System.String filename) [0x0005f] in <9c83ac7656b54f6caee1746dab90d91a>:0
  24. at System.TermInfoDriver..ctor (System.String term) [0x00055] in <9c83ac7656b54f6caee1746dab90d91a>:0
  25. at System.ConsoleDriver.CreateTermInfoDriver (System.String term) [0x00000] in <9c83ac7656b54f6caee1746dab90d91a>:0
  26. at System.ConsoleDriver..cctor () [0x0004d] in <9c83ac7656b54f6caee1746dab90d91a>:0
  27. Exception_EndOfInnerExceptionStack
  28. at System.Console.SetupStreams (System.Text.Encoding inputEncoding, System.Text.Encoding outputEncoding) [0x00007] in <9c83ac7656b54f6caee1746dab90d91a>:0
  29. at System.Console..cctor () [0x0008e] in <9c83ac7656b54f6caee1746dab90d91a>:0
  30. Exception_EndOfInnerExceptionStack
  31. at Microsoft.CodeAnalysis.CommandLine.BuildClient.RunCompilation (System.Collections.Generic.IEnumerable`1[T] originalArguments, Microsoft.CodeAnalysis.BuildPaths buildPaths, System.IO.TextWriter textWriter) [0x00005] in <0d46d413edc9411fa4eb1c4cbce40409>:0
  32. at Microsoft.CodeAnalysis.CommandLine.DesktopBuildClient.Run (System.Collections.Generic.IEnumerable`1[T] arguments, Microsoft.CodeAnalysis.CommandLine.RequestLanguage language, Microsoft.CodeAnalysis.CommandLine.CompileFunc compileFunc, Microsoft.CodeAnalysis.IAnalyzerAssemblyLoader analyzerAssemblyLoader) [0x00037] in <0d46d413edc9411fa4eb1c4cbce40409>:0
  33. at Microsoft.CodeAnalysis.CSharp.CommandLine.Program.MainCore (System.String[] args) [0x00017] in <0d46d413edc9411fa4eb1c4cbce40409>:0
  34. at Microsoft.CodeAnalysis.CSharp.CommandLine.Program.Main (System.String[] args) [0x00000] in <0d46d413edc9411fa4eb1c4cbce40409>:0
  35. make[8]: *** [../../build/library.make:328: ../../class/lib/build-linux/mscorlib.dll] Error 1
  36. make[7]: *** [../../build/rules.make:203: do-all] Error 2
  37. make[6]: *** [../build/rules.make:224: all-recursive] Error 1
  38. make[5]: *** [build/rules.make:224: all-recursive] Error 1
  39. make[4]: *** [Makefile:53: profile-do--build--all] Error 2
  40. make[3]: *** [Makefile:49: profiles-do--all] Error 2
  41. make[2]: *** [Makefile:636: all-local] Error 2
  42. make[2]: Leaving directory '/home/josh/.cache/yay/mono-alpha/src/mono-5.8.0.103/runtime'
  43. make[1]: *** [Makefile:549: all-recursive] Error 1
  44. make[1]: Leaving directory '/home/josh/.cache/yay/mono-alpha/src/mono-5.8.0.103'
  45. make: *** [Makefile:479: all] Error 2
  46. ==> ERROR: A failure occurred in build().
  47. Aborting...
  48. Error making: mono-alpha
RAW Paste Data