SHARE
TWEET

Untitled

a guest Mar 7th, 2019 95 Never
Not a member of Pastebin yet? Sign Up, it unlocks many cool features!
  1. [1] mrturcot@GL552VW
  2. [~/mitch/builds] >$ git clone https://aur.archlinux.org/dolphin-emu-git.git                                                                                                                                                                    
  3. Cloning into 'dolphin-emu-git'...
  4. remote: Enumerating objects: 100, done.
  5. remote: Counting objects: 100% (100/100), done.
  6. remote: Compressing objects: 100% (79/79), done.
  7. remote: Total 100 (delta 21), reused 98 (delta 21)
  8. Receiving objects: 100% (100/100), 27.19 KiB | 9.06 MiB/s, done.
  9. Resolving deltas: 100% (21/21), done.
  10. [1] mrturcot@GL552VW
  11. [~/mitch/builds] >$ cd dolphin-emu-git/                                                                                                                                                                                                        
  12. [1] mrturcot@GL552VW
  13. [~/mitch/builds/dolphin-emu-git] >$ makepkg -si                                                                                                                                                                                                
  14. ==> Making package: dolphin-emu-git 5.0.r8775.cd29cdb584-1 (Thu 07 Mar 2019 06:13:03 PM PST)
  15. ==> Checking runtime dependencies...
  16. ==> Checking buildtime dependencies...
  17. ==> Retrieving sources...
  18.   -> Cloning dolphin-emu git repo...
  19. Cloning into bare repository '/home/mrturcot/mitch/builds/dolphin-emu-git/dolphin-emu'...
  20. remote: Enumerating objects: 3804, done.
  21. remote: Counting objects: 100% (3804/3804), done.
  22. remote: Compressing objects: 100% (1327/1327), done.
  23. remote: Total 467202 (delta 3209), reused 2521 (delta 2470), pack-reused 463398
  24. Receiving objects: 100% (467202/467202), 417.70 MiB | 15.19 MiB/s, done.
  25. Resolving deltas: 100% (373763/373763), done.
  26. ==> Validating source files with sha256sums...
  27.     dolphin-emu ... Skipped
  28. ==> Extracting sources...
  29.   -> Creating working copy of dolphin-emu git repo...
  30. Cloning into 'dolphin-emu'...
  31. done.
  32. ==> Starting prepare()...
  33. ==> Starting pkgver()...
  34. ==> Updated version: dolphin-emu-git 5.0.r9717.db2542886a-1
  35. ==> Starting build()...
  36. -- The C compiler identification is GNU 8.2.1
  37. -- The CXX compiler identification is GNU 8.2.1
  38. -- Check for working C compiler: /usr/lib/ccache/bin/cc
  39. -- Check for working C compiler: /usr/lib/ccache/bin/cc -- works
  40. -- Detecting C compiler ABI info
  41. -- Detecting C compiler ABI info - done
  42. -- Detecting C compile features
  43. -- Detecting C compile features - done
  44. -- Check for working CXX compiler: /usr/lib/ccache/bin/c++
  45. -- Check for working CXX compiler: /usr/lib/ccache/bin/c++ -- works
  46. -- Detecting CXX compiler ABI info
  47. -- Detecting CXX compiler ABI info - done
  48. -- Detecting CXX compile features
  49. -- Detecting CXX compile features - done
  50. -- Found Git: /usr/bin/git (found version "2.20.1")
  51. -- Detected architecture: x86_64
  52. -- Performing Test FLAG_C_HAVE_SSE2
  53. -- Performing Test FLAG_C_HAVE_SSE2 - Success
  54. -- Performing Test FLAG_CXX_HAVE_SSE2
  55. -- Performing Test FLAG_CXX_HAVE_SSE2 - Success
  56. -- Performing Test FLAG_C_HAVE_WALL
  57. -- Performing Test FLAG_C_HAVE_WALL - Success
  58. -- Performing Test FLAG_CXX_HAVE_WALL
  59. -- Performing Test FLAG_CXX_HAVE_WALL - Success
  60. -- Performing Test FLAG_C_TYPE_LIMITS
  61. -- Performing Test FLAG_C_TYPE_LIMITS - Success
  62. -- Performing Test FLAG_CXX_TYPE_LIMITS
  63. -- Performing Test FLAG_CXX_TYPE_LIMITS - Success
  64. -- Performing Test FLAG_C_SIGN_COMPARE
  65. -- Performing Test FLAG_C_SIGN_COMPARE - Success
  66. -- Performing Test FLAG_CXX_SIGN_COMPARE
  67. -- Performing Test FLAG_CXX_SIGN_COMPARE - Success
  68. -- Performing Test FLAG_C_IGNORED_QUALIFIERS
  69. -- Performing Test FLAG_C_IGNORED_QUALIFIERS - Success
  70. -- Performing Test FLAG_CXX_IGNORED_QUALIFIERS
  71. -- Performing Test FLAG_CXX_IGNORED_QUALIFIERS - Success
  72. -- Performing Test FLAG_C_UNINITIALIZED
  73. -- Performing Test FLAG_C_UNINITIALIZED - Success
  74. -- Performing Test FLAG_CXX_UNINITIALIZED
  75. -- Performing Test FLAG_CXX_UNINITIALIZED - Success
  76. -- Performing Test FLAG_C_LOGICAL_OP
  77. -- Performing Test FLAG_C_LOGICAL_OP - Success
  78. -- Performing Test FLAG_CXX_LOGICAL_OP
  79. -- Performing Test FLAG_CXX_LOGICAL_OP - Success
  80. -- Performing Test FLAG_C_SHADOW
  81. -- Performing Test FLAG_C_SHADOW - Success
  82. -- Performing Test FLAG_CXX_SHADOW
  83. -- Performing Test FLAG_CXX_SHADOW - Success
  84. -- Performing Test FLAG_C_INIT_SELF
  85. -- Performing Test FLAG_C_INIT_SELF - Success
  86. -- Performing Test FLAG_CXX_INIT_SELF
  87. -- Performing Test FLAG_CXX_INIT_SELF - Success
  88. -- Performing Test FLAG_C_MISSING_DECLARATIONS
  89. -- Performing Test FLAG_C_MISSING_DECLARATIONS - Success
  90. -- Performing Test FLAG_CXX_MISSING_DECLARATIONS
  91. -- Performing Test FLAG_CXX_MISSING_DECLARATIONS - Success
  92. -- Performing Test FLAG_C_MISSING_VARIABLE_DECLARATIONS
  93. -- Performing Test FLAG_C_MISSING_VARIABLE_DECLARATIONS - Failed
  94. -- Performing Test FLAG_CXX_MISSING_VARIABLE_DECLARATIONS
  95. -- Performing Test FLAG_CXX_MISSING_VARIABLE_DECLARATIONS - Failed
  96. -- Performing Test FLAG_C_NO_STRICT_ALIASING
  97. -- Performing Test FLAG_C_NO_STRICT_ALIASING - Success
  98. -- Performing Test FLAG_CXX_NO_STRICT_ALIASING
  99. -- Performing Test FLAG_CXX_NO_STRICT_ALIASING - Success
  100. -- Performing Test FLAG_C_NO_EXCEPTIONS
  101. -- Performing Test FLAG_C_NO_EXCEPTIONS - Success
  102. -- Performing Test FLAG_CXX_NO_EXCEPTIONS
  103. -- Performing Test FLAG_CXX_NO_EXCEPTIONS - Success
  104. -- Performing Test FLAG_C_VISIBILITY_INLINES_HIDDEN
  105. -- Performing Test FLAG_C_VISIBILITY_INLINES_HIDDEN - Failed
  106. -- Performing Test FLAG_CXX_VISIBILITY_INLINES_HIDDEN
  107. -- Performing Test FLAG_CXX_VISIBILITY_INLINES_HIDDEN - Success
  108. -- Performing Test FLAG_C_VISIBILITY_HIDDEN
  109. -- Performing Test FLAG_C_VISIBILITY_HIDDEN - Success
  110. -- Performing Test FLAG_CXX_VISIBILITY_HIDDEN
  111. -- Performing Test FLAG_CXX_VISIBILITY_HIDDEN - Success
  112. -- Performing Test FLAG_C_FOMIT_FRAME_POINTER
  113. -- Performing Test FLAG_C_FOMIT_FRAME_POINTER - Success
  114. -- Performing Test FLAG_CXX_FOMIT_FRAME_POINTER
  115. -- Performing Test FLAG_CXX_FOMIT_FRAME_POINTER - Success
  116. -- Performing Test FLAG_C_GGDB
  117. -- Performing Test FLAG_C_GGDB - Success
  118. -- Performing Test FLAG_CXX_GGDB
  119. -- Performing Test FLAG_CXX_GGDB - Success
  120. -- Looking for pthread.h
  121. -- Looking for pthread.h - found
  122. -- Looking for pthread_create
  123. -- Looking for pthread_create - not found
  124. -- Looking for pthread_create in pthreads
  125. -- Looking for pthread_create in pthreads - not found
  126. -- Looking for pthread_create in pthread
  127. -- Looking for pthread_create in pthread - found
  128. -- Found Threads: TRUE  
  129. -- Found PkgConfig: /usr/bin/pkg-config (found version "1.6.0")
  130. -- Found OpenGL: /usr/lib/libOpenGL.so  
  131. -- Looking for XOpenDisplay in /usr/lib/libX11.so;/usr/lib/libXext.so
  132. -- Looking for XOpenDisplay in /usr/lib/libX11.so;/usr/lib/libXext.so - found
  133. -- Looking for gethostbyname
  134. -- Looking for gethostbyname - found
  135. -- Looking for connect
  136. -- Looking for connect - found
  137. -- Looking for remove
  138. -- Looking for remove - found
  139. -- Looking for shmat
  140. -- Looking for shmat - found
  141. -- Looking for IceConnectionNumber in ICE
  142. -- Looking for IceConnectionNumber in ICE - found
  143. -- Found X11: /usr/lib/libX11.so
  144. -- Xrandr found
  145. -- Checking for module 'xi>=1.5.0'
  146. --   Found xi, version 1.7.9
  147. -- X11 support enabled
  148. -- Checking for module 'egl'
  149. --   Found egl, version 18.3.3
  150. -- Found EGL: /usr/include  
  151. -- EGL OpenGL interface enabled
  152. --  Found avcodec: /usr/include /usr/lib/libavcodec.so
  153. --  Found avdevice: /usr/include /usr/lib/libavdevice.so
  154. --  Found avfilter: /usr/include /usr/lib/libavfilter.so
  155. --  Found avformat: /usr/include /usr/lib/libavformat.so
  156. --  Found avutil: /usr/include /usr/lib/libavutil.so
  157. --  Found swresample: /usr/include /usr/lib/libswresample.so
  158. --  Found swscale: /usr/include /usr/lib/libswscale.so
  159. -- Found FFmpeg: /usr/include  found components:  avcodec avformat avutil swscale
  160. -- libav/ffmpeg found, enabling AVI frame dumps
  161. -- Found LIBUDEV: /usr/lib/libudev.so  
  162. -- Found libevdev: /usr/lib/libevdev.so  
  163. -- libevdev/libudev found, enabling evdev controller backend
  164. -- Using named pipes as controller inputs
  165. -- Watching game memory for changes
  166. -- Enabling analytics collection (subject to end-user opt-in)
  167. -- Performing Test FLAG_C_CXX11
  168. -- Performing Test FLAG_C_CXX11 - Failed
  169. -- Performing Test FLAG_CXX_CXX11
  170. -- Performing Test FLAG_CXX_CXX11 - Success
  171. -- Found pugixml: /usr/lib/libpugixml.so  
  172. -- Looking for enet_socket_get_address
  173. -- Looking for enet_socket_get_address - found
  174. -- Using shared enet
  175. -- Found ZLIB: /usr/lib/libz.so (found version "1.2.11")
  176. -- Using shared zlib
  177. -- Using shared lzo
  178. -- Using shared libpng
  179. -- Using static FreeSurround from Externals
  180. -- Could NOT find CUBEB (missing: CUBEB_INCLUDE_DIR CUBEB_LIBRARY)
  181. -- Using static cubeb from Externals
  182. -- Performing Test COMPILER_HAS_HIDDEN_VISIBILITY
  183. -- Performing Test COMPILER_HAS_HIDDEN_VISIBILITY - Success
  184. -- Performing Test COMPILER_HAS_HIDDEN_INLINE_VISIBILITY
  185. -- Performing Test COMPILER_HAS_HIDDEN_INLINE_VISIBILITY - Success
  186. -- Performing Test COMPILER_HAS_DEPRECATED_ATTR
  187. -- Performing Test COMPILER_HAS_DEPRECATED_ATTR - Success
  188. -- Looking for include file AudioUnit/AudioUnit.h
  189. -- Looking for include file AudioUnit/AudioUnit.h - not found
  190. -- Looking for include file pulse/pulseaudio.h
  191. -- Looking for include file pulse/pulseaudio.h - found
  192. -- Looking for include file alsa/asoundlib.h
  193. -- Looking for include file alsa/asoundlib.h - found
  194. -- Looking for include file jack/jack.h
  195. -- Looking for include file jack/jack.h - found
  196. -- Looking for include file audioclient.h
  197. -- Looking for include file audioclient.h - not found
  198. -- Looking for include files windows.h, mmsystem.h
  199. -- Looking for include files windows.h, mmsystem.h - not found
  200. -- Looking for include file SLES/OpenSLES.h
  201. -- Looking for include file SLES/OpenSLES.h - not found
  202. -- Looking for include file android/log.h
  203. -- Looking for include file android/log.h - not found
  204. -- Looking for include file sndio.h
  205. -- Looking for include file sndio.h - not found
  206. -- Looking for include file kai.h
  207. -- Looking for include file kai.h - not found
  208. -- Checking for module 'libusb-1.0'
  209. --   Found libusb-1.0, version 1.0.22
  210. -- Found libusb-1.0: /usr/include/libusb-1.0, /usr/lib/libusb-1.0.so
  211. -- Using shared LibUSB
  212. -- Found SFML 2.5 in /usr/include
  213. -- Using shared SFML
  214. -- Found MINIUPNPC: /usr/include/miniupnpc  
  215. -- Using shared miniupnpc
  216. -- Performing Test MBEDTLS_VERSION_OK
  217. -- Performing Test MBEDTLS_VERSION_OK - Success
  218. -- Found MBEDTLS: /usr/include  
  219. -- Using shared mbed TLS
  220. -- Found CURL: /usr/lib/libcurl.so (found version "7.64.0")
  221. -- Using shared libcurl
  222. -- Found HIDAPI: /usr/lib/libhidapi-hidraw.so  
  223. -- Using static DiscordRPC from Externals
  224. -- Found SYSTEMD: /usr/lib/libsystemd.so  
  225. -- libsystemd found, enabling traversal server watchdog support
  226. -- Using static gtest from Externals
  227. -- Found PythonInterp: /usr/bin/python (found version "3.7.2")
  228. -- Check if compiler accepts -pthread
  229. -- Check if compiler accepts -pthread - yes
  230. -- Performing Test FLAG_C_CXX17
  231. -- Performing Test FLAG_C_CXX17 - Failed
  232. -- Performing Test FLAG_CXX_CXX17
  233. -- Performing Test FLAG_CXX_CXX17 - Success
  234. -- Could NOT find OpenSLES (missing: OPENSLES_LIBRARY OPENSLES_INCLUDE_DIR)
  235. -- Found ALSA: /usr/lib/libasound.so (found version "1.1.8")
  236. -- ALSA found, enabling ALSA sound backend
  237. -- PulseAudio found, enabling PulseAudio sound backend
  238. -- Found BlueZ: /usr/lib/libbluetooth.so  
  239. -- BlueZ found, enabling bluetooth support
  240. -- LLVM found, enabling LLVM support in disassembler
  241. -- Found Qt version 5.12.1
  242. -- Found Gettext: /usr/bin/msgmerge (found version "0.19.8.1")
  243. -- Configuring done
  244. -- Generating done
  245. -- Build files have been written to: /home/mrturcot/mitch/builds/dolphin-emu-git/src/build
  246. Scanning dependencies of target bdisasm
  247. Scanning dependencies of target imgui
  248. Scanning dependencies of target cpp-optparse
  249. Scanning dependencies of target minizip
  250. Scanning dependencies of target FreeSurround
  251. Scanning dependencies of target SoundTouch
  252. Scanning dependencies of target glslang
  253. Scanning dependencies of target discord-rpc
  254. [  0%] Building CXX object Externals/cpp-optparse/CMakeFiles/cpp-optparse.dir/OptionParser.cpp.o
  255. [  0%] Building C object Externals/minizip/CMakeFiles/minizip.dir/ioapi.c.o
  256. [  0%] Building CXX object Externals/FreeSurround/CMakeFiles/FreeSurround.dir/source/ChannelMaps.cpp.o
  257. [  0%] Building CXX object Externals/Bochs_disasm/CMakeFiles/bdisasm.dir/dis_decode.cc.o
  258. [  0%] Building CXX object Externals/soundtouch/CMakeFiles/SoundTouch.dir/AAFilter.cpp.o
  259. [  0%] Building CXX object Externals/imgui/CMakeFiles/imgui.dir/imgui.cpp.o
  260. [  0%] Building CXX object Externals/discord-rpc/src/CMakeFiles/discord-rpc.dir/discord_rpc.cpp.o
  261. [  0%] Building CXX object Externals/glslang/CMakeFiles/glslang.dir/glslang/GenericCodeGen/CodeGen.cpp.o
  262. In function ‘file_build_ioposix’,
  263.     inlined from ‘fopen_file_func.constprop’ at /home/mrturcot/mitch/builds/dolphin-emu-git/src/dolphin-emu/Externals/minizip/ioapi.c:124:16,
  264.     inlined from ‘fopendisk_file_func’ at /home/mrturcot/mitch/builds/dolphin-emu-git/src/dolphin-emu/Externals/minizip/ioapi.c:193:15:
  265. /home/mrturcot/mitch/builds/dolphin-emu-git/src/dolphin-emu/Externals/minizip/ioapi.c:106:5: warning: ‘strncpy’ specified bound depends on the length of the source argument [-Wstringop-overflow=]
  266.      strncpy((char*)ioposix->filename, filename, ioposix->filenameLength);
  267.      ^~~~~~~~~~~~~~~~~~~~~~~~~~~~~~~~~~~~~~~~~~~~~~~~~~~~~~~~~~~~~~~~~~~~
  268. /home/mrturcot/mitch/builds/dolphin-emu-git/src/dolphin-emu/Externals/minizip/ioapi.c: In function ‘fopendisk_file_func’:
  269. /home/mrturcot/mitch/builds/dolphin-emu-git/src/dolphin-emu/Externals/minizip/ioapi.c:104:36: note: length computed here
  270.      ioposix->filenameLength = (int)strlen(filename) + 1;
  271.                                     ^~~~~~~~~~~~~~~~
  272. In function ‘file_build_ioposix’,
  273.     inlined from ‘fopen64_file_func’ at /home/mrturcot/mitch/builds/dolphin-emu-git/src/dolphin-emu/Externals/minizip/ioapi.c:143:16:
  274. /home/mrturcot/mitch/builds/dolphin-emu-git/src/dolphin-emu/Externals/minizip/ioapi.c:106:5: warning: ‘strncpy’ specified bound depends on the length of the source argument [-Wstringop-overflow=]
  275.      strncpy((char*)ioposix->filename, filename, ioposix->filenameLength);
  276.      ^~~~~~~~~~~~~~~~~~~~~~~~~~~~~~~~~~~~~~~~~~~~~~~~~~~~~~~~~~~~~~~~~~~~
  277. /home/mrturcot/mitch/builds/dolphin-emu-git/src/dolphin-emu/Externals/minizip/ioapi.c: In function ‘fopen64_file_func’:
  278. /home/mrturcot/mitch/builds/dolphin-emu-git/src/dolphin-emu/Externals/minizip/ioapi.c:104:36: note: length computed here
  279.      ioposix->filenameLength = (int)strlen(filename) + 1;
  280.                                     ^~~~~~~~~~~~~~~~
  281. In function ‘file_build_ioposix’,
  282.     inlined from ‘fopen_file_func’ at /home/mrturcot/mitch/builds/dolphin-emu-git/src/dolphin-emu/Externals/minizip/ioapi.c:124:16:
  283. /home/mrturcot/mitch/builds/dolphin-emu-git/src/dolphin-emu/Externals/minizip/ioapi.c:106:5: warning: ‘strncpy’ specified bound depends on the length of the source argument [-Wstringop-overflow=]
  284.      strncpy((char*)ioposix->filename, filename, ioposix->filenameLength);
  285.      ^~~~~~~~~~~~~~~~~~~~~~~~~~~~~~~~~~~~~~~~~~~~~~~~~~~~~~~~~~~~~~~~~~~~
  286. /home/mrturcot/mitch/builds/dolphin-emu-git/src/dolphin-emu/Externals/minizip/ioapi.c: In function ‘fopen_file_func’:
  287. /home/mrturcot/mitch/builds/dolphin-emu-git/src/dolphin-emu/Externals/minizip/ioapi.c:104:36: note: length computed here
  288.      ioposix->filenameLength = (int)strlen(filename) + 1;
  289.                                     ^~~~~~~~~~~~~~~~
  290. In function ‘file_build_ioposix’,
  291.     inlined from ‘fopen64_file_func.constprop’ at /home/mrturcot/mitch/builds/dolphin-emu-git/src/dolphin-emu/Externals/minizip/ioapi.c:143:16,
  292.     inlined from ‘fopendisk64_file_func’ at /home/mrturcot/mitch/builds/dolphin-emu-git/src/dolphin-emu/Externals/minizip/ioapi.c:168:15:
  293. /home/mrturcot/mitch/builds/dolphin-emu-git/src/dolphin-emu/Externals/minizip/ioapi.c:106:5: warning: ‘strncpy’ specified bound depends on the length of the source argument [-Wstringop-overflow=]
  294.      strncpy((char*)ioposix->filename, filename, ioposix->filenameLength);
  295.      ^~~~~~~~~~~~~~~~~~~~~~~~~~~~~~~~~~~~~~~~~~~~~~~~~~~~~~~~~~~~~~~~~~~~
  296. /home/mrturcot/mitch/builds/dolphin-emu-git/src/dolphin-emu/Externals/minizip/ioapi.c: In function ‘fopendisk64_file_func’:
  297. /home/mrturcot/mitch/builds/dolphin-emu-git/src/dolphin-emu/Externals/minizip/ioapi.c:104:36: note: length computed here
  298.      ioposix->filenameLength = (int)strlen(filename) + 1;
  299.                                     ^~~~~~~~~~~~~~~~
  300. [  0%] Building C object Externals/minizip/CMakeFiles/minizip.dir/unzip.c.o
  301. [  0%] Building CXX object Externals/soundtouch/CMakeFiles/SoundTouch.dir/BPMDetect.cpp.o
  302. [  0%] Building CXX object Externals/Bochs_disasm/CMakeFiles/bdisasm.dir/dis_groups.cc.o
  303. [  0%] Building CXX object Externals/soundtouch/CMakeFiles/SoundTouch.dir/cpu_detect_x86.cpp.o
  304. [  0%] Building CXX object Externals/soundtouch/CMakeFiles/SoundTouch.dir/FIFOSampleBuffer.cpp.o
  305. [  1%] Building CXX object Externals/soundtouch/CMakeFiles/SoundTouch.dir/FIRFilter.cpp.o
  306. [  1%] Linking C static library libminizip.a
  307. [  1%] Built target minizip
  308. [  1%] Building CXX object Externals/glslang/CMakeFiles/glslang.dir/glslang/GenericCodeGen/Link.cpp.o
  309. [  1%] Building CXX object Externals/discord-rpc/src/CMakeFiles/discord-rpc.dir/rpc_connection.cpp.o
  310. [  1%] Building CXX object Externals/soundtouch/CMakeFiles/SoundTouch.dir/InterpolateCubic.cpp.o
  311. [  1%] Building CXX object Externals/Bochs_disasm/CMakeFiles/bdisasm.dir/resolve.cc.o
  312. [  1%] Building CXX object Externals/soundtouch/CMakeFiles/SoundTouch.dir/InterpolateLinear.cpp.o
  313. [  1%] Building CXX object Externals/Bochs_disasm/CMakeFiles/bdisasm.dir/syntax.cc.o
  314. [  1%] Building CXX object Externals/soundtouch/CMakeFiles/SoundTouch.dir/InterpolateShannon.cpp.o
  315. [  1%] Linking CXX static library libbdisasm.a
  316. [  1%] Built target bdisasm
  317. Scanning dependencies of target speex
  318. [  1%] Building C object Externals/cubeb/CMakeFiles/speex.dir/src/speex/resample.c.o
  319. [  1%] Building CXX object Externals/soundtouch/CMakeFiles/SoundTouch.dir/mmx_optimized.cpp.o
  320. [  1%] Building CXX object Externals/soundtouch/CMakeFiles/SoundTouch.dir/PeakFinder.cpp.o
  321. [  1%] Building CXX object Externals/glslang/CMakeFiles/glslang.dir/glslang/MachineIndependent/attribute.cpp.o
  322. [  1%] Building CXX object Externals/soundtouch/CMakeFiles/SoundTouch.dir/RateTransposer.cpp.o
  323. /home/mrturcot/mitch/builds/dolphin-emu-git/src/dolphin-emu/Externals/cubeb/src/speex/resample.c: In function ‘update_filter’:
  324. /home/mrturcot/mitch/builds/dolphin-emu-git/src/dolphin-emu/Externals/cubeb/src/speex/resample.c:674:20: warning: comparison of integer expressions of different signedness: ‘int’ and ‘unsigned int’ [-Wsign-compare]
  325.           for (j=0;j<st->filt_len;j++)
  326.                     ^
  327. /home/mrturcot/mitch/builds/dolphin-emu-git/src/dolphin-emu/Externals/cubeb/src/speex/resample.c: In function ‘speex_resampler_process_float’:
  328. /home/mrturcot/mitch/builds/dolphin-emu-git/src/dolphin-emu/Externals/cubeb/src/speex/resample.c:946:21: warning: comparison of integer expressions of different signedness: ‘int’ and ‘unsigned int’ [-Wsign-compare]
  329.             for(j=0;j<ichunk;++j)
  330.                      ^
  331. /home/mrturcot/mitch/builds/dolphin-emu-git/src/dolphin-emu/Externals/cubeb/src/speex/resample.c:949:20: warning: comparison of integer expressions of different signedness: ‘int’ and ‘unsigned int’ [-Wsign-compare]
  332.            for(j=0;j<ichunk;++j)
  333.                     ^
  334. /home/mrturcot/mitch/builds/dolphin-emu-git/src/dolphin-emu/Externals/cubeb/src/speex/resample.c: In function ‘speex_resampler_process_int’:
  335. /home/mrturcot/mitch/builds/dolphin-emu-git/src/dolphin-emu/Externals/cubeb/src/speex/resample.c:1002:19: warning: comparison of integer expressions of different signedness: ‘int’ and ‘unsigned int’ [-Wsign-compare]
  336.           for(j=0;j<ichunk;++j)
  337.                    ^
  338. /home/mrturcot/mitch/builds/dolphin-emu-git/src/dolphin-emu/Externals/cubeb/src/speex/resample.c:1009:19: warning: comparison of integer expressions of different signedness: ‘int’ and ‘unsigned int’ [-Wsign-compare]
  339.           for(j=0;j<ichunk;++j)
  340.                    ^
  341. /home/mrturcot/mitch/builds/dolphin-emu-git/src/dolphin-emu/Externals/cubeb/src/speex/resample.c:1019:16: warning: comparison of integer expressions of different signedness: ‘int’ and ‘unsigned int’ [-Wsign-compare]
  342.       for (j=0;j<ochunk+omagic;++j)
  343.                 ^
  344. [  1%] Built target speex
  345. Scanning dependencies of target common
  346. [  1%] Building CXX object Externals/soundtouch/CMakeFiles/SoundTouch.dir/SoundTouch.cpp.o
  347. [  2%] Building CXX object Source/Core/Common/CMakeFiles/common.dir/Analytics.cpp.o
  348. [  2%] Building CXX object Source/Core/Common/CMakeFiles/common.dir/CDUtils.cpp.o
  349. In file included from /home/mrturcot/mitch/builds/dolphin-emu-git/src/dolphin-emu/Externals/discord-rpc/src/serialization.h:15,
  350.                  from /home/mrturcot/mitch/builds/dolphin-emu-git/src/dolphin-emu/Externals/discord-rpc/src/rpc_connection.h:4,
  351.                  from /home/mrturcot/mitch/builds/dolphin-emu-git/src/dolphin-emu/Externals/discord-rpc/src/rpc_connection.cpp:1:
  352. /home/mrturcot/mitch/builds/dolphin-emu-git/src/dolphin-emu/Externals/discord-rpc/thirdparty/include/rapidjson/document.h: In instantiation of ‘void rapidjson::GenericValue<Encoding, Allocator>::SetObjectRaw(rapidjson::GenericValue<Encoding, Allocator>::Member*, rapidjson::SizeType, Allocator&) [with Encoding = rapidjson::UTF8<>; Allocator = rapidjson::MemoryPoolAllocator<>; rapidjson::GenericValue<Encoding, Allocator>::Member = rapidjson::GenericMember<rapidjson::UTF8<>, rapidjson::MemoryPoolAllocator<> >; rapidjson::SizeType = unsigned int]’:
  353. /home/mrturcot/mitch/builds/dolphin-emu-git/src/dolphin-emu/Externals/discord-rpc/thirdparty/include/rapidjson/document.h:2363:9:   required from ‘bool rapidjson::GenericDocument<Encoding, Allocator, StackAllocator>::EndObject(rapidjson::SizeType) [with Encoding = rapidjson::UTF8<>; Allocator = rapidjson::MemoryPoolAllocator<>; StackAllocator = FixedLinearAllocator<2048>; rapidjson::SizeType = unsigned int]’
  354. /home/mrturcot/mitch/builds/dolphin-emu-git/src/dolphin-emu/Externals/discord-rpc/thirdparty/include/rapidjson/reader.h:1736:18:   required from ‘rapidjson::GenericReader<SourceEncoding, TargetEncoding, StackAllocator>::IterativeParsingState rapidjson::GenericReader<SourceEncoding, TargetEncoding, StackAllocator>::Transit(rapidjson::GenericReader<SourceEncoding, TargetEncoding, StackAllocator>::IterativeParsingState, rapidjson::GenericReader<SourceEncoding, TargetEncoding, StackAllocator>::Token, rapidjson::GenericReader<SourceEncoding, TargetEncoding, StackAllocator>::IterativeParsingState, InputStream&, Handler&) [with unsigned int parseFlags = 1; InputStream = rapidjson::GenericInsituStringStream<rapidjson::UTF8<> >; Handler = rapidjson::GenericDocument<rapidjson::UTF8<>, rapidjson::MemoryPoolAllocator<>, FixedLinearAllocator<2048> >; SourceEncoding = rapidjson::UTF8<>; TargetEncoding = rapidjson::UTF8<>; StackAllocator = FixedLinearAllocator<2048>]’
  355. /home/mrturcot/mitch/builds/dolphin-emu-git/src/dolphin-emu/Externals/discord-rpc/thirdparty/include/rapidjson/reader.h:1832:58:   required from ‘rapidjson::ParseResult rapidjson::GenericReader<SourceEncoding, TargetEncoding, StackAllocator>::IterativeParse(InputStream&, Handler&) [with unsigned int parseFlags = 1; InputStream = rapidjson::GenericInsituStringStream<rapidjson::UTF8<> >; Handler = rapidjson::GenericDocument<rapidjson::UTF8<>, rapidjson::MemoryPoolAllocator<>, FixedLinearAllocator<2048> >; SourceEncoding = rapidjson::UTF8<>; TargetEncoding = rapidjson::UTF8<>; StackAllocator = FixedLinearAllocator<2048>]’
  356. /home/mrturcot/mitch/builds/dolphin-emu-git/src/dolphin-emu/Externals/discord-rpc/thirdparty/include/rapidjson/reader.h:487:46:   required from ‘rapidjson::ParseResult rapidjson::GenericReader<SourceEncoding, TargetEncoding, StackAllocator>::Parse(InputStream&, Handler&) [with unsigned int parseFlags = 1; InputStream = rapidjson::GenericInsituStringStream<rapidjson::UTF8<> >; Handler = rapidjson::GenericDocument<rapidjson::UTF8<>, rapidjson::MemoryPoolAllocator<>, FixedLinearAllocator<2048> >; SourceEncoding = rapidjson::UTF8<>; TargetEncoding = rapidjson::UTF8<>; StackAllocator = FixedLinearAllocator<2048>]’
  357. /home/mrturcot/mitch/builds/dolphin-emu-git/src/dolphin-emu/Externals/discord-rpc/thirdparty/include/rapidjson/document.h:2159:22:   required from ‘rapidjson::GenericDocument<Encoding, Allocator, StackAllocator>& rapidjson::GenericDocument<Encoding, Allocator, StackAllocator>::ParseStream(InputStream&) [with unsigned int parseFlags = 1; SourceEncoding = rapidjson::UTF8<>; InputStream = rapidjson::GenericInsituStringStream<rapidjson::UTF8<> >; Encoding = rapidjson::UTF8<>; Allocator = rapidjson::MemoryPoolAllocator<>; StackAllocator = FixedLinearAllocator<2048>]’
  358. /home/mrturcot/mitch/builds/dolphin-emu-git/src/dolphin-emu/Externals/discord-rpc/thirdparty/include/rapidjson/document.h:2175:62:   required from ‘rapidjson::GenericDocument<Encoding, Allocator, StackAllocator>& rapidjson::GenericDocument<Encoding, Allocator, StackAllocator>::ParseStream(InputStream&) [with unsigned int parseFlags = 1; InputStream = rapidjson::GenericInsituStringStream<rapidjson::UTF8<> >; Encoding = rapidjson::UTF8<>; Allocator = rapidjson::MemoryPoolAllocator<>; StackAllocator = FixedLinearAllocator<2048>]’
  359. /home/mrturcot/mitch/builds/dolphin-emu-git/src/dolphin-emu/Externals/discord-rpc/thirdparty/include/rapidjson/document.h:2200:58:   required from ‘rapidjson::GenericDocument<Encoding, Allocator, StackAllocator>& rapidjson::GenericDocument<Encoding, Allocator, StackAllocator>::ParseInsitu(rapidjson::GenericDocument<Encoding, Allocator, StackAllocator>::Ch*) [with unsigned int parseFlags = 0; Encoding = rapidjson::UTF8<>; Allocator = rapidjson::MemoryPoolAllocator<>; StackAllocator = FixedLinearAllocator<2048>; rapidjson::GenericDocument<Encoding, Allocator, StackAllocator>::Ch = char]’
  360. /home/mrturcot/mitch/builds/dolphin-emu-git/src/dolphin-emu/Externals/discord-rpc/thirdparty/include/rapidjson/document.h:2208:47:   required from ‘rapidjson::GenericDocument<Encoding, Allocator, StackAllocator>& rapidjson::GenericDocument<Encoding, Allocator, StackAllocator>::ParseInsitu(rapidjson::GenericDocument<Encoding, Allocator, StackAllocator>::Ch*) [with Encoding = rapidjson::UTF8<>; Allocator = rapidjson::MemoryPoolAllocator<>; StackAllocator = FixedLinearAllocator<2048>; rapidjson::GenericDocument<Encoding, Allocator, StackAllocator>::Ch = char]’
  361. /home/mrturcot/mitch/builds/dolphin-emu-git/src/dolphin-emu/Externals/discord-rpc/src/rpc_connection.cpp:115:50:   required from here
  362. /home/mrturcot/mitch/builds/dolphin-emu-git/src/dolphin-emu/Externals/discord-rpc/thirdparty/include/rapidjson/document.h:1952:24: warning: ‘void* memcpy(void*, const void*, size_t)’ writing to an object of type ‘rapidjson::GenericValue<rapidjson::UTF8<> >::Member’ {aka ‘struct rapidjson::GenericMember<rapidjson::UTF8<>, rapidjson::MemoryPoolAllocator<> >’} with no trivial copy-assignment; use copy-assignment instead [-Wclass-memaccess]
  363.              std::memcpy(m, members, count * sizeof(Member));
  364.              ~~~~~~~~~~~^~~~~~~~~~~~~~~~~~~~~~~~~~~~~~~~~~~~
  365. In file included from /home/mrturcot/mitch/builds/dolphin-emu-git/src/dolphin-emu/Externals/discord-rpc/src/serialization.h:15,
  366.                  from /home/mrturcot/mitch/builds/dolphin-emu-git/src/dolphin-emu/Externals/discord-rpc/src/rpc_connection.h:4,
  367.                  from /home/mrturcot/mitch/builds/dolphin-emu-git/src/dolphin-emu/Externals/discord-rpc/src/rpc_connection.cpp:1:
  368. /home/mrturcot/mitch/builds/dolphin-emu-git/src/dolphin-emu/Externals/discord-rpc/thirdparty/include/rapidjson/document.h:71:8: note: ‘rapidjson::GenericValue<rapidjson::UTF8<> >::Member’ {aka ‘struct rapidjson::GenericMember<rapidjson::UTF8<>, rapidjson::MemoryPoolAllocator<> >’} declared here
  369.  struct GenericMember {
  370.         ^~~~~~~~~~~~~
  371. In file included from /home/mrturcot/mitch/builds/dolphin-emu-git/src/dolphin-emu/Externals/discord-rpc/src/serialization.h:15,
  372.                  from /home/mrturcot/mitch/builds/dolphin-emu-git/src/dolphin-emu/Externals/discord-rpc/src/rpc_connection.h:4,
  373.                  from /home/mrturcot/mitch/builds/dolphin-emu-git/src/dolphin-emu/Externals/discord-rpc/src/rpc_connection.cpp:1:
  374. /home/mrturcot/mitch/builds/dolphin-emu-git/src/dolphin-emu/Externals/discord-rpc/thirdparty/include/rapidjson/document.h: In instantiation of ‘void rapidjson::GenericValue<Encoding, Allocator>::SetArrayRaw(rapidjson::GenericValue<Encoding, Allocator>*, rapidjson::SizeType, Allocator&) [with Encoding = rapidjson::UTF8<>; Allocator = rapidjson::MemoryPoolAllocator<>; rapidjson::SizeType = unsigned int]’:
  375. /home/mrturcot/mitch/builds/dolphin-emu-git/src/dolphin-emu/Externals/discord-rpc/thirdparty/include/rapidjson/document.h:2371:9:   required from ‘bool rapidjson::GenericDocument<Encoding, Allocator, StackAllocator>::EndArray(rapidjson::SizeType) [with Encoding = rapidjson::UTF8<>; Allocator = rapidjson::MemoryPoolAllocator<>; StackAllocator = FixedLinearAllocator<2048>; rapidjson::SizeType = unsigned int]’
  376. /home/mrturcot/mitch/builds/dolphin-emu-git/src/dolphin-emu/Externals/discord-rpc/thirdparty/include/rapidjson/reader.h:1766:18:   required from ‘rapidjson::GenericReader<SourceEncoding, TargetEncoding, StackAllocator>::IterativeParsingState rapidjson::GenericReader<SourceEncoding, TargetEncoding, StackAllocator>::Transit(rapidjson::GenericReader<SourceEncoding, TargetEncoding, StackAllocator>::IterativeParsingState, rapidjson::GenericReader<SourceEncoding, TargetEncoding, StackAllocator>::Token, rapidjson::GenericReader<SourceEncoding, TargetEncoding, StackAllocator>::IterativeParsingState, InputStream&, Handler&) [with unsigned int parseFlags = 1; InputStream = rapidjson::GenericInsituStringStream<rapidjson::UTF8<> >; Handler = rapidjson::GenericDocument<rapidjson::UTF8<>, rapidjson::MemoryPoolAllocator<>, FixedLinearAllocator<2048> >; SourceEncoding = rapidjson::UTF8<>; TargetEncoding = rapidjson::UTF8<>; StackAllocator = FixedLinearAllocator<2048>]’
  377. /home/mrturcot/mitch/builds/dolphin-emu-git/src/dolphin-emu/Externals/discord-rpc/thirdparty/include/rapidjson/reader.h:1832:58:   required from ‘rapidjson::ParseResult rapidjson::GenericReader<SourceEncoding, TargetEncoding, StackAllocator>::IterativeParse(InputStream&, Handler&) [with unsigned int parseFlags = 1; InputStream = rapidjson::GenericInsituStringStream<rapidjson::UTF8<> >; Handler = rapidjson::GenericDocument<rapidjson::UTF8<>, rapidjson::MemoryPoolAllocator<>, FixedLinearAllocator<2048> >; SourceEncoding = rapidjson::UTF8<>; TargetEncoding = rapidjson::UTF8<>; StackAllocator = FixedLinearAllocator<2048>]’
  378. /home/mrturcot/mitch/builds/dolphin-emu-git/src/dolphin-emu/Externals/discord-rpc/thirdparty/include/rapidjson/reader.h:487:46:   required from ‘rapidjson::ParseResult rapidjson::GenericReader<SourceEncoding, TargetEncoding, StackAllocator>::Parse(InputStream&, Handler&) [with unsigned int parseFlags = 1; InputStream = rapidjson::GenericInsituStringStream<rapidjson::UTF8<> >; Handler = rapidjson::GenericDocument<rapidjson::UTF8<>, rapidjson::MemoryPoolAllocator<>, FixedLinearAllocator<2048> >; SourceEncoding = rapidjson::UTF8<>; TargetEncoding = rapidjson::UTF8<>; StackAllocator = FixedLinearAllocator<2048>]’
  379. /home/mrturcot/mitch/builds/dolphin-emu-git/src/dolphin-emu/Externals/discord-rpc/thirdparty/include/rapidjson/document.h:2159:22:   required from ‘rapidjson::GenericDocument<Encoding, Allocator, StackAllocator>& rapidjson::GenericDocument<Encoding, Allocator, StackAllocator>::ParseStream(InputStream&) [with unsigned int parseFlags = 1; SourceEncoding = rapidjson::UTF8<>; InputStream = rapidjson::GenericInsituStringStream<rapidjson::UTF8<> >; Encoding = rapidjson::UTF8<>; Allocator = rapidjson::MemoryPoolAllocator<>; StackAllocator = FixedLinearAllocator<2048>]’
  380. /home/mrturcot/mitch/builds/dolphin-emu-git/src/dolphin-emu/Externals/discord-rpc/thirdparty/include/rapidjson/document.h:2175:62:   required from ‘rapidjson::GenericDocument<Encoding, Allocator, StackAllocator>& rapidjson::GenericDocument<Encoding, Allocator, StackAllocator>::ParseStream(InputStream&) [with unsigned int parseFlags = 1; InputStream = rapidjson::GenericInsituStringStream<rapidjson::UTF8<> >; Encoding = rapidjson::UTF8<>; Allocator = rapidjson::MemoryPoolAllocator<>; StackAllocator = FixedLinearAllocator<2048>]’
  381. /home/mrturcot/mitch/builds/dolphin-emu-git/src/dolphin-emu/Externals/discord-rpc/thirdparty/include/rapidjson/document.h:2200:58:   required from ‘rapidjson::GenericDocument<Encoding, Allocator, StackAllocator>& rapidjson::GenericDocument<Encoding, Allocator, StackAllocator>::ParseInsitu(rapidjson::GenericDocument<Encoding, Allocator, StackAllocator>::Ch*) [with unsigned int parseFlags = 0; Encoding = rapidjson::UTF8<>; Allocator = rapidjson::MemoryPoolAllocator<>; StackAllocator = FixedLinearAllocator<2048>; rapidjson::GenericDocument<Encoding, Allocator, StackAllocator>::Ch = char]’
  382. /home/mrturcot/mitch/builds/dolphin-emu-git/src/dolphin-emu/Externals/discord-rpc/thirdparty/include/rapidjson/document.h:2208:47:   required from ‘rapidjson::GenericDocument<Encoding, Allocator, StackAllocator>& rapidjson::GenericDocument<Encoding, Allocator, StackAllocator>::ParseInsitu(rapidjson::GenericDocument<Encoding, Allocator, StackAllocator>::Ch*) [with Encoding = rapidjson::UTF8<>; Allocator = rapidjson::MemoryPoolAllocator<>; StackAllocator = FixedLinearAllocator<2048>; rapidjson::GenericDocument<Encoding, Allocator, StackAllocator>::Ch = char]’
  383. /home/mrturcot/mitch/builds/dolphin-emu-git/src/dolphin-emu/Externals/discord-rpc/src/rpc_connection.cpp:115:50:   required from here
  384. /home/mrturcot/mitch/builds/dolphin-emu-git/src/dolphin-emu/Externals/discord-rpc/thirdparty/include/rapidjson/document.h:1939:24: warning: ‘void* memcpy(void*, const void*, size_t)’ writing to an object of type ‘class rapidjson::GenericValue<rapidjson::UTF8<> >’ with no trivial copy-assignment; use copy-assignment or copy-initialization instead [-Wclass-memaccess]
  385.              std::memcpy(e, values, count * sizeof(GenericValue));
  386.              ~~~~~~~~~~~^~~~~~~~~~~~~~~~~~~~~~~~~~~~~~~~~~~~~~~~~
  387. /home/mrturcot/mitch/builds/dolphin-emu-git/src/dolphin-emu/Externals/discord-rpc/thirdparty/include/rapidjson/document.h:540:7: note: ‘class rapidjson::GenericValue<rapidjson::UTF8<> >’ declared here
  388.  class GenericValue {
  389.        ^~~~~~~~~~~~
  390. cc1plus: warning: unrecognized command line option ‘-Wno-global-constructors’
  391. cc1plus: warning: unrecognized command line option ‘-Wno-exit-time-destructors’
  392. cc1plus: warning: unrecognized command line option ‘-Wno-covered-switch-default’
  393. cc1plus: warning: unrecognized command line option ‘-Wno-c++98-compat-pedantic’
  394. cc1plus: warning: unrecognized command line option ‘-Wno-c++98-compat’
  395. [  2%] Building CXX object Externals/discord-rpc/src/CMakeFiles/discord-rpc.dir/serialization.cpp.o
  396. [  3%] Building CXX object Externals/soundtouch/CMakeFiles/SoundTouch.dir/sse_optimized.cpp.o
  397. [  3%] Building CXX object Externals/soundtouch/CMakeFiles/SoundTouch.dir/TDStretch.cpp.o
  398. [  3%] Linking CXX static library libcpp-optparse.a
  399. [  3%] Linking CXX static library libSoundTouch.a
  400. [  3%] Building CXX object Source/Core/Common/CMakeFiles/common.dir/ColorUtil.cpp.o
  401. [  3%] Built target cpp-optparse
  402. Scanning dependencies of target discio
  403. [  3%] Built target SoundTouch
  404. [  4%] Building CXX object Externals/discord-rpc/src/CMakeFiles/discord-rpc.dir/connection_unix.cpp.o
  405. [  5%] Building CXX object Source/Core/DiscIO/CMakeFiles/discio.dir/Blob.cpp.o
  406. [  5%] Building CXX object Source/Core/Common/CMakeFiles/common.dir/Config/Config.cpp.o
  407. [  5%] Building CXX object Externals/FreeSurround/CMakeFiles/FreeSurround.dir/source/KissFFT.cpp.o
  408. [  5%] Building CXX object Source/Core/Common/CMakeFiles/common.dir/CommonFuncs.cpp.o
  409. [  5%] Building CXX object Externals/glslang/CMakeFiles/glslang.dir/glslang/MachineIndependent/Constant.cpp.o
  410. [  5%] Building CXX object Externals/FreeSurround/CMakeFiles/FreeSurround.dir/source/KissFFTR.cpp.o
  411. [  5%] Building CXX object Externals/FreeSurround/CMakeFiles/FreeSurround.dir/source/FreeSurroundDecoder.cpp.o
  412. [  5%] Building CXX object Source/Core/Common/CMakeFiles/common.dir/Config/ConfigInfo.cpp.o
  413. [  5%] Building CXX object Source/Core/Common/CMakeFiles/common.dir/Config/Layer.cpp.o
  414. [  5%] Building CXX object Source/Core/Common/CMakeFiles/common.dir/Crypto/AES.cpp.o
  415. [  5%] Building CXX object Source/Core/DiscIO/CMakeFiles/discio.dir/CISOBlob.cpp.o
  416. [  5%] Building CXX object Source/Core/DiscIO/CMakeFiles/discio.dir/WbfsBlob.cpp.o
  417. [  6%] Building CXX object Source/Core/Common/CMakeFiles/common.dir/Crypto/bn.cpp.o
  418. [  6%] Building CXX object Externals/discord-rpc/src/CMakeFiles/discord-rpc.dir/discord_register_linux.cpp.o
  419. [  6%] Building CXX object Source/Core/DiscIO/CMakeFiles/discio.dir/CompressedBlob.cpp.o
  420. In function ‘void ImStrncpy(char*, const char*, size_t)’,
  421.     inlined from ‘void ImStrncpy(char*, const char*, size_t)’ at /home/mrturcot/mitch/builds/dolphin-emu-git/src/dolphin-emu/Externals/imgui/imgui.cpp:1208:6,
  422.     inlined from ‘ImGuiTextFilter::ImGuiTextFilter(const char*)’ at /home/mrturcot/mitch/builds/dolphin-emu-git/src/dolphin-emu/Externals/imgui/imgui.cpp:1874:18,
  423.     inlined from ‘ImGuiTextFilter::ImGuiTextFilter(const char*)’ at /home/mrturcot/mitch/builds/dolphin-emu-git/src/dolphin-emu/Externals/imgui/imgui.cpp:1870:1:
  424. /home/mrturcot/mitch/builds/dolphin-emu-git/src/dolphin-emu/Externals/imgui/imgui.cpp:1211:12: warning: ‘char* strncpy(char*, const char*, size_t)’ specified bound 256 equals destination size [-Wstringop-truncation]
  425.      strncpy(dst, src, count);
  426.      ~~~~~~~^~~~~~~~~~~~~~~~~
  427. In function ‘void ImStrncpy(char*, const char*, size_t)’,
  428.     inlined from ‘bool ImGui::SetDragDropPayload(const char*, const void*, size_t, ImGuiCond)’ at /home/mrturcot/mitch/builds/dolphin-emu-git/src/dolphin-emu/Externals/imgui/imgui.cpp:1208:6:
  429. /home/mrturcot/mitch/builds/dolphin-emu-git/src/dolphin-emu/Externals/imgui/imgui.cpp:1211:12: warning: ‘char* strncpy(char*, const char*, size_t)’ specified bound 33 equals destination size [-Wstringop-truncation]
  430.      strncpy(dst, src, count);
  431.      ~~~~~~~^~~~~~~~~~~~~~~~~
  432. [  6%] Building CXX object Externals/imgui/CMakeFiles/imgui.dir/imgui_draw.cpp.o
  433. [  6%] Linking CXX static library libdiscord-rpc.a
  434. [  6%] Building CXX object Source/Core/DiscIO/CMakeFiles/discio.dir/DirectoryBlob.cpp.o
  435. [  6%] Built target discord-rpc
  436. [  6%] Linking CXX static library libFreeSurround.a
  437. Scanning dependencies of target unittests_stubhost
  438. [  6%] Building CXX object Source/UnitTests/CMakeFiles/unittests_stubhost.dir/StubHost.cpp.o
  439. [  6%] Building CXX object Source/Core/Common/CMakeFiles/common.dir/Crypto/ec.cpp.o
  440. [  6%] Built target FreeSurround
  441. [  6%] Building CXX object Source/Core/DiscIO/CMakeFiles/discio.dir/DiscExtractor.cpp.o
  442. [  6%] Building CXX object Source/Core/DiscIO/CMakeFiles/discio.dir/DiscScrubber.cpp.o
  443. [  6%] Built target unittests_stubhost
  444. Scanning dependencies of target cubeb
  445. [  6%] Building C object Externals/cubeb/CMakeFiles/cubeb.dir/src/cubeb.c.o
  446. [  6%] Building CXX object Externals/cubeb/CMakeFiles/cubeb.dir/src/cubeb_mixer.cpp.o
  447. [  6%] Building CXX object Source/Core/DiscIO/CMakeFiles/discio.dir/DriveBlob.cpp.o
  448. [  7%] Building CXX object Externals/cubeb/CMakeFiles/cubeb.dir/src/cubeb_resampler.cpp.o
  449. [  7%] Building CXX object Externals/glslang/CMakeFiles/glslang.dir/glslang/MachineIndependent/glslang_tab.cpp.o
  450. [  7%] Building CXX object Externals/glslang/CMakeFiles/glslang.dir/glslang/MachineIndependent/InfoSink.cpp.o
  451. In file included from /home/mrturcot/mitch/builds/dolphin-emu-git/src/dolphin-emu/Source/Core/DiscIO/Filesystem.h:14,
  452.                  from /home/mrturcot/mitch/builds/dolphin-emu-git/src/dolphin-emu/Source/Core/DiscIO/DiscExtractor.cpp:17:
  453. /home/mrturcot/mitch/builds/dolphin-emu-git/src/dolphin-emu/Source/Core/DiscIO/Volume.h: In function ‘bool DiscIO::ExportTMD(const DiscIO::Volume&, const DiscIO::Partition&, const string&)’:
  454. /home/mrturcot/mitch/builds/dolphin-emu-git/src/dolphin-emu/Source/Core/DiscIO/Volume.h:52:15: warning: ‘<anonymous>’ may be used uninitialized in this function [-Wmaybe-uninitialized]
  455.        return {};
  456.                ^
  457. /home/mrturcot/mitch/builds/dolphin-emu-git/src/dolphin-emu/Source/Core/DiscIO/Volume.h: In function ‘bool DiscIO::ExportCertificateChain(const DiscIO::Volume&, const DiscIO::Partition&, const string&)’:
  458. /home/mrturcot/mitch/builds/dolphin-emu-git/src/dolphin-emu/Source/Core/DiscIO/Volume.h:52:15: warning: ‘<anonymous>’ may be used uninitialized in this function [-Wmaybe-uninitialized]
  459.        return {};
  460.                ^
  461. /home/mrturcot/mitch/builds/dolphin-emu-git/src/dolphin-emu/Source/Core/DiscIO/Volume.h: In function ‘std::optional<unsigned int> DiscIO::GetBootDOLSize(const DiscIO::Volume&, const DiscIO::Partition&, u64)’:
  462. /home/mrturcot/mitch/builds/dolphin-emu-git/src/dolphin-emu/Source/Core/DiscIO/Volume.h:52:15: warning: ‘<anonymous>’ may be used uninitialized in this function [-Wmaybe-uninitialized]
  463.        return {};
  464.                ^
  465. /home/mrturcot/mitch/builds/dolphin-emu-git/src/dolphin-emu/Source/Core/DiscIO/DiscExtractor.cpp:288:15: warning: ‘<anonymous>’ may be used uninitialized in this function [-Wmaybe-uninitialized]
  466.        return {};
  467.                ^
  468. /home/mrturcot/mitch/builds/dolphin-emu-git/src/dolphin-emu/Source/Core/DiscIO/DiscExtractor.cpp:298:15: warning: ‘<anonymous>’ may be used uninitialized in this function [-Wmaybe-uninitialized]
  469.        return {};
  470.                ^
  471. /home/mrturcot/mitch/builds/dolphin-emu-git/src/dolphin-emu/Source/Core/DiscIO/DiscExtractor.cpp: In function ‘bool DiscIO::ExportFST(const DiscIO::Volume&, const DiscIO::Partition&, const string&)’:
  472. /home/mrturcot/mitch/builds/dolphin-emu-git/src/dolphin-emu/Source/Core/DiscIO/DiscExtractor.cpp:324:13: warning: ‘<anonymous>’ may be used uninitialized in this function [-Wmaybe-uninitialized]
  473.      return {};
  474.              ^
  475. [  7%] Building CXX object Externals/glslang/CMakeFiles/glslang.dir/glslang/MachineIndependent/Initialize.cpp.o
  476. [  7%] Building CXX object Source/Core/DiscIO/CMakeFiles/discio.dir/Enums.cpp.o
  477. [  8%] Building CXX object Source/Core/DiscIO/CMakeFiles/discio.dir/FileBlob.cpp.o
  478. In file included from /home/mrturcot/mitch/builds/dolphin-emu-git/src/dolphin-emu/Externals/cubeb/src/cubeb_resampler.cpp:19:
  479. /home/mrturcot/mitch/builds/dolphin-emu-git/src/dolphin-emu/Externals/cubeb/src/cubeb_resampler_internal.h: In constructor ‘processor::processor(uint32_t)’:
  480. /home/mrturcot/mitch/builds/dolphin-emu-git/src/dolphin-emu/Externals/cubeb/src/cubeb_resampler_internal.h:62:5: warning: declaration of ‘channels’ shadows a member of ‘processor’ [-Wshadow]
  481.      : channels(channels)
  482.      ^
  483. /home/mrturcot/mitch/builds/dolphin-emu-git/src/dolphin-emu/Externals/cubeb/src/cubeb_resampler_internal.h:75:18: note: shadowed declaration is here
  484.    const uint32_t channels;
  485.                   ^~~~~~~~
  486. In file included from /home/mrturcot/mitch/builds/dolphin-emu-git/src/dolphin-emu/Externals/cubeb/src/cubeb_resampler.cpp:19:
  487. /home/mrturcot/mitch/builds/dolphin-emu-git/src/dolphin-emu/Externals/cubeb/src/cubeb_resampler_internal.h: In constructor ‘cubeb_resampler_speex_one_way<T>::cubeb_resampler_speex_one_way(uint32_t, uint32_t, uint32_t, int)’:
  488. /home/mrturcot/mitch/builds/dolphin-emu-git/src/dolphin-emu/Externals/cubeb/src/cubeb_resampler_internal.h:183:3: warning: declaration of ‘source_rate’ shadows a member of ‘cubeb_resampler_speex_one_way<T>’ [-Wshadow]
  489.    : processor(channels)
  490.    ^
  491. /home/mrturcot/mitch/builds/dolphin-emu-git/src/dolphin-emu/Externals/cubeb/src/cubeb_resampler_internal.h:364:18: note: shadowed declaration is here
  492.    const uint32_t source_rate;
  493.                   ^~~~~~~~~~~
  494. /home/mrturcot/mitch/builds/dolphin-emu-git/src/dolphin-emu/Externals/cubeb/src/cubeb_resampler_internal.h:183:3: warning: declaration of ‘channels’ shadows a member of ‘cubeb_resampler_speex_one_way<T>’ [-Wshadow]
  495.    : processor(channels)
  496.    ^
  497. In file included from /home/mrturcot/mitch/builds/dolphin-emu-git/src/dolphin-emu/Externals/cubeb/src/cubeb_resampler.cpp:19:
  498. /home/mrturcot/mitch/builds/dolphin-emu-git/src/dolphin-emu/Externals/cubeb/src/cubeb_resampler_internal.h:75:18: note: shadowed declaration is here
  499.    const uint32_t channels;
  500.                   ^~~~~~~~
  501. In file included from /home/mrturcot/mitch/builds/dolphin-emu-git/src/dolphin-emu/Externals/cubeb/src/cubeb_resampler.cpp:19:
  502. /home/mrturcot/mitch/builds/dolphin-emu-git/src/dolphin-emu/Externals/cubeb/src/cubeb_resampler_internal.h: In constructor ‘delay_line<T>::delay_line(uint32_t, uint32_t, uint32_t)’:
  503. /home/mrturcot/mitch/builds/dolphin-emu-git/src/dolphin-emu/Externals/cubeb/src/cubeb_resampler_internal.h:386:5: warning: declaration of ‘sample_rate’ shadows a member of ‘delay_line<T>’ [-Wshadow]
  504.      : processor(channels)
  505.      ^
  506. /home/mrturcot/mitch/builds/dolphin-emu-git/src/dolphin-emu/Externals/cubeb/src/cubeb_resampler_internal.h:499:12: note: shadowed declaration is here
  507.    uint32_t sample_rate;
  508.             ^~~~~~~~~~~
  509. /home/mrturcot/mitch/builds/dolphin-emu-git/src/dolphin-emu/Externals/cubeb/src/cubeb_resampler_internal.h:386:5: warning: declaration of ‘channels’ shadows a member of ‘delay_line<T>’ [-Wshadow]
  510.      : processor(channels)
  511.      ^
  512. In file included from /home/mrturcot/mitch/builds/dolphin-emu-git/src/dolphin-emu/Externals/cubeb/src/cubeb_resampler.cpp:19:
  513. /home/mrturcot/mitch/builds/dolphin-emu-git/src/dolphin-emu/Externals/cubeb/src/cubeb_resampler_internal.h:75:18: note: shadowed declaration is here
  514.    const uint32_t channels;
  515.                   ^~~~~~~~
  516. /home/mrturcot/mitch/builds/dolphin-emu-git/src/dolphin-emu/Externals/cubeb/src/cubeb_resampler.cpp: In constructor ‘passthrough_resampler<T>::passthrough_resampler(cubeb_stream*, cubeb_data_callback, void*, uint32_t, uint32_t)’:
  517. /home/mrturcot/mitch/builds/dolphin-emu-git/src/dolphin-emu/Externals/cubeb/src/cubeb_resampler.cpp:48:69: warning: declaration of ‘sample_rate’ shadows a member of ‘passthrough_resampler<T>’ [-Wshadow]
  518.                                                  uint32_t sample_rate)
  519.                                                                      ^
  520. In file included from /home/mrturcot/mitch/builds/dolphin-emu-git/src/dolphin-emu/Externals/cubeb/src/cubeb_resampler.cpp:19:
  521. /home/mrturcot/mitch/builds/dolphin-emu-git/src/dolphin-emu/Externals/cubeb/src/cubeb_resampler_internal.h:112:12: note: shadowed declaration is here
  522.    uint32_t sample_rate;
  523.             ^~~~~~~~~~~
  524. /home/mrturcot/mitch/builds/dolphin-emu-git/src/dolphin-emu/Externals/cubeb/src/cubeb_resampler.cpp: In constructor ‘cubeb_resampler_speex<T, InputProcessing, OutputProcessing>::cubeb_resampler_speex(InputProcessor*, OutputProcessor*, cubeb_stream*, cubeb_data_callback, void*)’:
  525. /home/mrturcot/mitch/builds/dolphin-emu-git/src/dolphin-emu/Externals/cubeb/src/cubeb_resampler.cpp:95:37: warning: declaration of ‘output_processor’ shadows a member of ‘cubeb_resampler_speex<T, InputProcessing, OutputProcessing>’ [-Wshadow]
  526.                            void * ptr)
  527.                                      ^
  528. In file included from /home/mrturcot/mitch/builds/dolphin-emu-git/src/dolphin-emu/Externals/cubeb/src/cubeb_resampler.cpp:19:
  529. /home/mrturcot/mitch/builds/dolphin-emu-git/src/dolphin-emu/Externals/cubeb/src/cubeb_resampler_internal.h:155:37: note: shadowed declaration is here
  530.    std::unique_ptr<OutputProcessing> output_processor;
  531.                                      ^~~~~~~~~~~~~~~~
  532. /home/mrturcot/mitch/builds/dolphin-emu-git/src/dolphin-emu/Externals/cubeb/src/cubeb_resampler.cpp:95:37: warning: declaration of ‘input_processor’ shadows a member of ‘cubeb_resampler_speex<T, InputProcessing, OutputProcessing>’ [-Wshadow]
  533.                            void * ptr)
  534.                                      ^
  535. In file included from /home/mrturcot/mitch/builds/dolphin-emu-git/src/dolphin-emu/Externals/cubeb/src/cubeb_resampler.cpp:19:
  536. /home/mrturcot/mitch/builds/dolphin-emu-git/src/dolphin-emu/Externals/cubeb/src/cubeb_resampler_internal.h:154:36: note: shadowed declaration is here
  537.    std::unique_ptr<InputProcessing> input_processor;
  538.                                     ^~~~~~~~~~~~~~~
  539. /home/mrturcot/mitch/builds/dolphin-emu-git/src/dolphin-emu/Externals/cubeb/src/cubeb_resampler.cpp: In instantiation of ‘passthrough_resampler<T>::passthrough_resampler(cubeb_stream*, cubeb_data_callback, void*, uint32_t, uint32_t) [with T = short int; cubeb_stream = cubeb_stream; cubeb_data_callback = long int (*)(cubeb_stream*, void*, const void*, void*, long int); uint32_t = unsigned int]’:
  540. /home/mrturcot/mitch/builds/dolphin-emu-git/src/dolphin-emu/Externals/cubeb/src/cubeb_resampler_internal.h:528:12:   required from ‘cubeb_resampler* cubeb_resampler_create_internal(cubeb_stream*, cubeb_stream_params*, cubeb_stream_params*, unsigned int, cubeb_data_callback, void*, cubeb_resampler_quality) [with T = short int; cubeb_resampler = cubeb_resampler; cubeb_stream = cubeb_stream; cubeb_data_callback = long int (*)(cubeb_stream*, void*, const void*, void*, long int)]’
  541. /home/mrturcot/mitch/builds/dolphin-emu-git/src/dolphin-emu/Externals/cubeb/src/cubeb_resampler.cpp:293:60:   required from here
  542. /home/mrturcot/mitch/builds/dolphin-emu-git/src/dolphin-emu/Externals/cubeb/src/cubeb_resampler.cpp:44:1: warning: declaration of ‘sample_rate’ shadows a member of ‘passthrough_resampler<short int>’ [-Wshadow]
  543.  passthrough_resampler<T>::passthrough_resampler(cubeb_stream * s,
  544.  ^~~~~~~~~~~~~~~~~~~~~~~~
  545. In file included from /home/mrturcot/mitch/builds/dolphin-emu-git/src/dolphin-emu/Externals/cubeb/src/cubeb_resampler.cpp:19:
  546. /home/mrturcot/mitch/builds/dolphin-emu-git/src/dolphin-emu/Externals/cubeb/src/cubeb_resampler_internal.h:112:12: note: shadowed declaration is here
  547.    uint32_t sample_rate;
  548.             ^~~~~~~~~~~
  549. In file included from /home/mrturcot/mitch/builds/dolphin-emu-git/src/dolphin-emu/Externals/cubeb/src/cubeb_resampler.cpp:19:
  550. /home/mrturcot/mitch/builds/dolphin-emu-git/src/dolphin-emu/Externals/cubeb/src/cubeb_resampler_internal.h: In instantiation of ‘cubeb_resampler_speex_one_way<T>::cubeb_resampler_speex_one_way(uint32_t, uint32_t, uint32_t, int) [with T = short int; uint32_t = unsigned int]’:
  551. /home/mrturcot/mitch/builds/dolphin-emu-git/src/dolphin-emu/Externals/cubeb/src/cubeb_resampler_internal.h:538:9:   required from ‘cubeb_resampler* cubeb_resampler_create_internal(cubeb_stream*, cubeb_stream_params*, cubeb_stream_params*, unsigned int, cubeb_data_callback, void*, cubeb_resampler_quality) [with T = short int; cubeb_resampler = cubeb_resampler; cubeb_stream = cubeb_stream; cubeb_data_callback = long int (*)(cubeb_stream*, void*, const void*, void*, long int)]’
  552. /home/mrturcot/mitch/builds/dolphin-emu-git/src/dolphin-emu/Externals/cubeb/src/cubeb_resampler.cpp:293:60:   required from here
  553. /home/mrturcot/mitch/builds/dolphin-emu-git/src/dolphin-emu/Externals/cubeb/src/cubeb_resampler_internal.h:179:3: warning: declaration of ‘source_rate’ shadows a member of ‘cubeb_resampler_speex_one_way<short int>’ [-Wshadow]
  554.    cubeb_resampler_speex_one_way(uint32_t channels,
  555.    ^~~~~~~~~~~~~~~~~~~~~~~~~~~~~
  556. /home/mrturcot/mitch/builds/dolphin-emu-git/src/dolphin-emu/Externals/cubeb/src/cubeb_resampler_internal.h:364:18: note: shadowed declaration is here
  557.    const uint32_t source_rate;
  558.                   ^~~~~~~~~~~
  559. /home/mrturcot/mitch/builds/dolphin-emu-git/src/dolphin-emu/Externals/cubeb/src/cubeb_resampler_internal.h:179:3: warning: declaration of ‘channels’ shadows a member of ‘cubeb_resampler_speex_one_way<short int>’ [-Wshadow]
  560.    cubeb_resampler_speex_one_way(uint32_t channels,
  561.    ^~~~~~~~~~~~~~~~~~~~~~~~~~~~~
  562. In file included from /home/mrturcot/mitch/builds/dolphin-emu-git/src/dolphin-emu/Externals/cubeb/src/cubeb_resampler.cpp:19:
  563. /home/mrturcot/mitch/builds/dolphin-emu-git/src/dolphin-emu/Externals/cubeb/src/cubeb_resampler_internal.h:75:18: note: shadowed declaration is here
  564.    const uint32_t channels;
  565.                   ^~~~~~~~
  566. In file included from /home/mrturcot/mitch/builds/dolphin-emu-git/src/dolphin-emu/Externals/cubeb/src/cubeb_resampler.cpp:19:
  567. /home/mrturcot/mitch/builds/dolphin-emu-git/src/dolphin-emu/Externals/cubeb/src/cubeb_resampler_internal.h: In instantiation of ‘delay_line<T>::delay_line(uint32_t, uint32_t, uint32_t) [with T = short int; uint32_t = unsigned int]’:
  568. /home/mrturcot/mitch/builds/dolphin-emu-git/src/dolphin-emu/Externals/cubeb/src/cubeb_resampler_internal.h:562:24:   required from ‘cubeb_resampler* cubeb_resampler_create_internal(cubeb_stream*, cubeb_stream_params*, cubeb_stream_params*, unsigned int, cubeb_data_callback, void*, cubeb_resampler_quality) [with T = short int; cubeb_resampler = cubeb_resampler; cubeb_stream = cubeb_stream; cubeb_data_callback = long int (*)(cubeb_stream*, void*, const void*, void*, long int)]’
  569. /home/mrturcot/mitch/builds/dolphin-emu-git/src/dolphin-emu/Externals/cubeb/src/cubeb_resampler.cpp:293:60:   required from here
  570. /home/mrturcot/mitch/builds/dolphin-emu-git/src/dolphin-emu/Externals/cubeb/src/cubeb_resampler_internal.h:385:3: warning: declaration of ‘sample_rate’ shadows a member of ‘delay_line<short int>’ [-Wshadow]
  571.    delay_line(uint32_t frames, uint32_t channels, uint32_t sample_rate)
  572.    ^~~~~~~~~~
  573. /home/mrturcot/mitch/builds/dolphin-emu-git/src/dolphin-emu/Externals/cubeb/src/cubeb_resampler_internal.h:499:12: note: shadowed declaration is here
  574.    uint32_t sample_rate;
  575.             ^~~~~~~~~~~
  576. /home/mrturcot/mitch/builds/dolphin-emu-git/src/dolphin-emu/Externals/cubeb/src/cubeb_resampler_internal.h:385:3: warning: declaration of ‘channels’ shadows a member of ‘delay_line<short int>’ [-Wshadow]
  577.    delay_line(uint32_t frames, uint32_t channels, uint32_t sample_rate)
  578.    ^~~~~~~~~~
  579. In file included from /home/mrturcot/mitch/builds/dolphin-emu-git/src/dolphin-emu/Externals/cubeb/src/cubeb_resampler.cpp:19:
  580. /home/mrturcot/mitch/builds/dolphin-emu-git/src/dolphin-emu/Externals/cubeb/src/cubeb_resampler_internal.h:75:18: note: shadowed declaration is here
  581.    const uint32_t channels;
  582.                   ^~~~~~~~
  583. /home/mrturcot/mitch/builds/dolphin-emu-git/src/dolphin-emu/Externals/cubeb/src/cubeb_resampler.cpp: In instantiation of ‘cubeb_resampler_speex<T, InputProcessing, OutputProcessing>::cubeb_resampler_speex(InputProcessor*, OutputProcessor*, cubeb_stream*, cubeb_data_callback, void*) [with T = short int; InputProcessing = cubeb_resampler_speex_one_way<short int>; OutputProcessing = cubeb_resampler_speex_one_way<short int>; cubeb_stream = cubeb_stream; cubeb_data_callback = long int (*)(cubeb_stream*, void*, const void*, void*, long int)]’:
  584. /home/mrturcot/mitch/builds/dolphin-emu-git/src/dolphin-emu/Externals/cubeb/src/cubeb_resampler_internal.h:578:12:   required from ‘cubeb_resampler* cubeb_resampler_create_internal(cubeb_stream*, cubeb_stream_params*, cubeb_stream_params*, unsigned int, cubeb_data_callback, void*, cubeb_resampler_quality) [with T = short int; cubeb_resampler = cubeb_resampler; cubeb_stream = cubeb_stream; cubeb_data_callback = long int (*)(cubeb_stream*, void*, const void*, void*, long int)]’
  585. /home/mrturcot/mitch/builds/dolphin-emu-git/src/dolphin-emu/Externals/cubeb/src/cubeb_resampler.cpp:293:60:   required from here
  586. /home/mrturcot/mitch/builds/dolphin-emu-git/src/dolphin-emu/Externals/cubeb/src/cubeb_resampler.cpp:90:1: warning: declaration of ‘output_processor’ shadows a member of ‘cubeb_resampler_speex<short int, cubeb_resampler_speex_one_way<short int>, cubeb_resampler_speex_one_way<short int> >’ [-Wshadow]
  587.  cubeb_resampler_speex<T, InputProcessor, OutputProcessor>
  588.  ^~~~~~~~~~~~~~~~~~~~~~~~~~~~~~~~~~~~~~~~~~~~~~~~~~~~~~~~~
  589. In file included from /home/mrturcot/mitch/builds/dolphin-emu-git/src/dolphin-emu/Externals/cubeb/src/cubeb_resampler.cpp:19:
  590. /home/mrturcot/mitch/builds/dolphin-emu-git/src/dolphin-emu/Externals/cubeb/src/cubeb_resampler_internal.h:155:37: note: shadowed declaration is here
  591.    std::unique_ptr<OutputProcessing> output_processor;
  592.                                      ^~~~~~~~~~~~~~~~
  593. /home/mrturcot/mitch/builds/dolphin-emu-git/src/dolphin-emu/Externals/cubeb/src/cubeb_resampler.cpp:90:1: warning: declaration of ‘input_processor’ shadows a member of ‘cubeb_resampler_speex<short int, cubeb_resampler_speex_one_way<short int>, cubeb_resampler_speex_one_way<short int> >’ [-Wshadow]
  594.  cubeb_resampler_speex<T, InputProcessor, OutputProcessor>
  595.  ^~~~~~~~~~~~~~~~~~~~~~~~~~~~~~~~~~~~~~~~~~~~~~~~~~~~~~~~~
  596. In file included from /home/mrturcot/mitch/builds/dolphin-emu-git/src/dolphin-emu/Externals/cubeb/src/cubeb_resampler.cpp:19:
  597. /home/mrturcot/mitch/builds/dolphin-emu-git/src/dolphin-emu/Externals/cubeb/src/cubeb_resampler_internal.h:154:36: note: shadowed declaration is here
  598.    std::unique_ptr<InputProcessing> input_processor;
  599.                                     ^~~~~~~~~~~~~~~
  600. /home/mrturcot/mitch/builds/dolphin-emu-git/src/dolphin-emu/Externals/cubeb/src/cubeb_resampler.cpp: In instantiation of ‘cubeb_resampler_speex<T, InputProcessing, OutputProcessing>::cubeb_resampler_speex(InputProcessor*, OutputProcessor*, cubeb_stream*, cubeb_data_callback, void*) [with T = short int; InputProcessing = cubeb_resampler_speex_one_way<short int>; OutputProcessing = delay_line<short int>; cubeb_stream = cubeb_stream; cubeb_data_callback = long int (*)(cubeb_stream*, void*, const void*, void*, long int)]’:
  601. /home/mrturcot/mitch/builds/dolphin-emu-git/src/dolphin-emu/Externals/cubeb/src/cubeb_resampler_internal.h:585:12:   required from ‘cubeb_resampler* cubeb_resampler_create_internal(cubeb_stream*, cubeb_stream_params*, cubeb_stream_params*, unsigned int, cubeb_data_callback, void*, cubeb_resampler_quality) [with T = short int; cubeb_resampler = cubeb_resampler; cubeb_stream = cubeb_stream; cubeb_data_callback = long int (*)(cubeb_stream*, void*, const void*, void*, long int)]’
  602. /home/mrturcot/mitch/builds/dolphin-emu-git/src/dolphin-emu/Externals/cubeb/src/cubeb_resampler.cpp:293:60:   required from here
  603. /home/mrturcot/mitch/builds/dolphin-emu-git/src/dolphin-emu/Externals/cubeb/src/cubeb_resampler.cpp:90:1: warning: declaration of ‘output_processor’ shadows a member of ‘cubeb_resampler_speex<short int, cubeb_resampler_speex_one_way<short int>, delay_line<short int> >’ [-Wshadow]
  604.  cubeb_resampler_speex<T, InputProcessor, OutputProcessor>
  605.  ^~~~~~~~~~~~~~~~~~~~~~~~~~~~~~~~~~~~~~~~~~~~~~~~~~~~~~~~~
  606. In file included from /home/mrturcot/mitch/builds/dolphin-emu-git/src/dolphin-emu/Externals/cubeb/src/cubeb_resampler.cpp:19:
  607. /home/mrturcot/mitch/builds/dolphin-emu-git/src/dolphin-emu/Externals/cubeb/src/cubeb_resampler_internal.h:155:37: note: shadowed declaration is here
  608.    std::unique_ptr<OutputProcessing> output_processor;
  609.                                      ^~~~~~~~~~~~~~~~
  610. /home/mrturcot/mitch/builds/dolphin-emu-git/src/dolphin-emu/Externals/cubeb/src/cubeb_resampler.cpp:90:1: warning: declaration of ‘input_processor’ shadows a member of ‘cubeb_resampler_speex<short int, cubeb_resampler_speex_one_way<short int>, delay_line<short int> >’ [-Wshadow]
  611.  cubeb_resampler_speex<T, InputProcessor, OutputProcessor>
  612.  ^~~~~~~~~~~~~~~~~~~~~~~~~~~~~~~~~~~~~~~~~~~~~~~~~~~~~~~~~
  613. In file included from /home/mrturcot/mitch/builds/dolphin-emu-git/src/dolphin-emu/Externals/cubeb/src/cubeb_resampler.cpp:19:
  614. /home/mrturcot/mitch/builds/dolphin-emu-git/src/dolphin-emu/Externals/cubeb/src/cubeb_resampler_internal.h:154:36: note: shadowed declaration is here
  615.    std::unique_ptr<InputProcessing> input_processor;
  616.                                     ^~~~~~~~~~~~~~~
  617. /home/mrturcot/mitch/builds/dolphin-emu-git/src/dolphin-emu/Externals/cubeb/src/cubeb_resampler.cpp: In instantiation of ‘cubeb_resampler_speex<T, InputProcessing, OutputProcessing>::cubeb_resampler_speex(InputProcessor*, OutputProcessor*, cubeb_stream*, cubeb_data_callback, void*) [with T = short int; InputProcessing = delay_line<short int>; OutputProcessing = cubeb_resampler_speex_one_way<short int>; cubeb_stream = cubeb_stream; cubeb_data_callback = long int (*)(cubeb_stream*, void*, const void*, void*, long int)]’:
  618. /home/mrturcot/mitch/builds/dolphin-emu-git/src/dolphin-emu/Externals/cubeb/src/cubeb_resampler_internal.h:592:12:   required from ‘cubeb_resampler* cubeb_resampler_create_internal(cubeb_stream*, cubeb_stream_params*, cubeb_stream_params*, unsigned int, cubeb_data_callback, void*, cubeb_resampler_quality) [with T = short int; cubeb_resampler = cubeb_resampler; cubeb_stream = cubeb_stream; cubeb_data_callback = long int (*)(cubeb_stream*, void*, const void*, void*, long int)]’
  619. /home/mrturcot/mitch/builds/dolphin-emu-git/src/dolphin-emu/Externals/cubeb/src/cubeb_resampler.cpp:293:60:   required from here
  620. /home/mrturcot/mitch/builds/dolphin-emu-git/src/dolphin-emu/Externals/cubeb/src/cubeb_resampler.cpp:90:1: warning: declaration of ‘output_processor’ shadows a member of ‘cubeb_resampler_speex<short int, delay_line<short int>, cubeb_resampler_speex_one_way<short int> >’ [-Wshadow]
  621.  cubeb_resampler_speex<T, InputProcessor, OutputProcessor>
  622.  ^~~~~~~~~~~~~~~~~~~~~~~~~~~~~~~~~~~~~~~~~~~~~~~~~~~~~~~~~
  623. In file included from /home/mrturcot/mitch/builds/dolphin-emu-git/src/dolphin-emu/Externals/cubeb/src/cubeb_resampler.cpp:19:
  624. /home/mrturcot/mitch/builds/dolphin-emu-git/src/dolphin-emu/Externals/cubeb/src/cubeb_resampler_internal.h:155:37: note: shadowed declaration is here
  625.    std::unique_ptr<OutputProcessing> output_processor;
  626.                                      ^~~~~~~~~~~~~~~~
  627. /home/mrturcot/mitch/builds/dolphin-emu-git/src/dolphin-emu/Externals/cubeb/src/cubeb_resampler.cpp:90:1: warning: declaration of ‘input_processor’ shadows a member of ‘cubeb_resampler_speex<short int, delay_line<short int>, cubeb_resampler_speex_one_way<short int> >’ [-Wshadow]
  628.  cubeb_resampler_speex<T, InputProcessor, OutputProcessor>
  629.  ^~~~~~~~~~~~~~~~~~~~~~~~~~~~~~~~~~~~~~~~~~~~~~~~~~~~~~~~~
  630. In file included from /home/mrturcot/mitch/builds/dolphin-emu-git/src/dolphin-emu/Externals/cubeb/src/cubeb_resampler.cpp:19:
  631. /home/mrturcot/mitch/builds/dolphin-emu-git/src/dolphin-emu/Externals/cubeb/src/cubeb_resampler_internal.h:154:36: note: shadowed declaration is here
  632.    std::unique_ptr<InputProcessing> input_processor;
  633.                                     ^~~~~~~~~~~~~~~
  634. /home/mrturcot/mitch/builds/dolphin-emu-git/src/dolphin-emu/Externals/cubeb/src/cubeb_resampler.cpp: In instantiation of ‘passthrough_resampler<T>::passthrough_resampler(cubeb_stream*, cubeb_data_callback, void*, uint32_t, uint32_t) [with T = float; cubeb_stream = cubeb_stream; cubeb_data_callback = long int (*)(cubeb_stream*, void*, const void*, void*, long int); uint32_t = unsigned int]’:
  635. /home/mrturcot/mitch/builds/dolphin-emu-git/src/dolphin-emu/Externals/cubeb/src/cubeb_resampler_internal.h:528:12:   required from ‘cubeb_resampler* cubeb_resampler_create_internal(cubeb_stream*, cubeb_stream_params*, cubeb_stream_params*, unsigned int, cubeb_data_callback, void*, cubeb_resampler_quality) [with T = float; cubeb_resampler = cubeb_resampler; cubeb_stream = cubeb_stream; cubeb_data_callback = long int (*)(cubeb_stream*, void*, const void*, void*, long int)]’
  636. /home/mrturcot/mitch/builds/dolphin-emu-git/src/dolphin-emu/Externals/cubeb/src/cubeb_resampler.cpp:301:60:   required from here
  637. /home/mrturcot/mitch/builds/dolphin-emu-git/src/dolphin-emu/Externals/cubeb/src/cubeb_resampler.cpp:44:1: warning: declaration of ‘sample_rate’ shadows a member of ‘passthrough_resampler<float>’ [-Wshadow]
  638.  passthrough_resampler<T>::passthrough_resampler(cubeb_stream * s,
  639.  ^~~~~~~~~~~~~~~~~~~~~~~~
  640. In file included from /home/mrturcot/mitch/builds/dolphin-emu-git/src/dolphin-emu/Externals/cubeb/src/cubeb_resampler.cpp:19:
  641. /home/mrturcot/mitch/builds/dolphin-emu-git/src/dolphin-emu/Externals/cubeb/src/cubeb_resampler_internal.h:112:12: note: shadowed declaration is here
  642.    uint32_t sample_rate;
  643.             ^~~~~~~~~~~
  644. In file included from /home/mrturcot/mitch/builds/dolphin-emu-git/src/dolphin-emu/Externals/cubeb/src/cubeb_resampler.cpp:19:
  645. /home/mrturcot/mitch/builds/dolphin-emu-git/src/dolphin-emu/Externals/cubeb/src/cubeb_resampler_internal.h: In instantiation of ‘cubeb_resampler_speex_one_way<T>::cubeb_resampler_speex_one_way(uint32_t, uint32_t, uint32_t, int) [with T = float; uint32_t = unsigned int]’:
  646. /home/mrturcot/mitch/builds/dolphin-emu-git/src/dolphin-emu/Externals/cubeb/src/cubeb_resampler_internal.h:538:9:   required from ‘cubeb_resampler* cubeb_resampler_create_internal(cubeb_stream*, cubeb_stream_params*, cubeb_stream_params*, unsigned int, cubeb_data_callback, void*, cubeb_resampler_quality) [with T = float; cubeb_resampler = cubeb_resampler; cubeb_stream = cubeb_stream; cubeb_data_callback = long int (*)(cubeb_stream*, void*, const void*, void*, long int)]’
  647. /home/mrturcot/mitch/builds/dolphin-emu-git/src/dolphin-emu/Externals/cubeb/src/cubeb_resampler.cpp:301:60:   required from here
  648. /home/mrturcot/mitch/builds/dolphin-emu-git/src/dolphin-emu/Externals/cubeb/src/cubeb_resampler_internal.h:179:3: warning: declaration of ‘source_rate’ shadows a member of ‘cubeb_resampler_speex_one_way<float>’ [-Wshadow]
  649.    cubeb_resampler_speex_one_way(uint32_t channels,
  650.    ^~~~~~~~~~~~~~~~~~~~~~~~~~~~~
  651. /home/mrturcot/mitch/builds/dolphin-emu-git/src/dolphin-emu/Externals/cubeb/src/cubeb_resampler_internal.h:364:18: note: shadowed declaration is here
  652.    const uint32_t source_rate;
  653.                   ^~~~~~~~~~~
  654. /home/mrturcot/mitch/builds/dolphin-emu-git/src/dolphin-emu/Externals/cubeb/src/cubeb_resampler_internal.h:179:3: warning: declaration of ‘channels’ shadows a member of ‘cubeb_resampler_speex_one_way<float>’ [-Wshadow]
  655.    cubeb_resampler_speex_one_way(uint32_t channels,
  656.    ^~~~~~~~~~~~~~~~~~~~~~~~~~~~~
  657. In file included from /home/mrturcot/mitch/builds/dolphin-emu-git/src/dolphin-emu/Externals/cubeb/src/cubeb_resampler.cpp:19:
  658. /home/mrturcot/mitch/builds/dolphin-emu-git/src/dolphin-emu/Externals/cubeb/src/cubeb_resampler_internal.h:75:18: note: shadowed declaration is here
  659.    const uint32_t channels;
  660.                   ^~~~~~~~
  661. In file included from /home/mrturcot/mitch/builds/dolphin-emu-git/src/dolphin-emu/Externals/cubeb/src/cubeb_resampler.cpp:19:
  662. /home/mrturcot/mitch/builds/dolphin-emu-git/src/dolphin-emu/Externals/cubeb/src/cubeb_resampler_internal.h: In instantiation of ‘delay_line<T>::delay_line(uint32_t, uint32_t, uint32_t) [with T = float; uint32_t = unsigned int]’:
  663. /home/mrturcot/mitch/builds/dolphin-emu-git/src/dolphin-emu/Externals/cubeb/src/cubeb_resampler_internal.h:562:24:   required from ‘cubeb_resampler* cubeb_resampler_create_internal(cubeb_stream*, cubeb_stream_params*, cubeb_stream_params*, unsigned int, cubeb_data_callback, void*, cubeb_resampler_quality) [with T = float; cubeb_resampler = cubeb_resampler; cubeb_stream = cubeb_stream; cubeb_data_callback = long int (*)(cubeb_stream*, void*, const void*, void*, long int)]’
  664. /home/mrturcot/mitch/builds/dolphin-emu-git/src/dolphin-emu/Externals/cubeb/src/cubeb_resampler.cpp:301:60:   required from here
  665. /home/mrturcot/mitch/builds/dolphin-emu-git/src/dolphin-emu/Externals/cubeb/src/cubeb_resampler_internal.h:385:3: warning: declaration of ‘sample_rate’ shadows a member of ‘delay_line<float>’ [-Wshadow]
  666.    delay_line(uint32_t frames, uint32_t channels, uint32_t sample_rate)
  667.    ^~~~~~~~~~
  668. /home/mrturcot/mitch/builds/dolphin-emu-git/src/dolphin-emu/Externals/cubeb/src/cubeb_resampler_internal.h:499:12: note: shadowed declaration is here
  669.    uint32_t sample_rate;
  670.             ^~~~~~~~~~~
  671. /home/mrturcot/mitch/builds/dolphin-emu-git/src/dolphin-emu/Externals/cubeb/src/cubeb_resampler_internal.h:385:3: warning: declaration of ‘channels’ shadows a member of ‘delay_line<float>’ [-Wshadow]
  672.    delay_line(uint32_t frames, uint32_t channels, uint32_t sample_rate)
  673.    ^~~~~~~~~~
  674. In file included from /home/mrturcot/mitch/builds/dolphin-emu-git/src/dolphin-emu/Externals/cubeb/src/cubeb_resampler.cpp:19:
  675. /home/mrturcot/mitch/builds/dolphin-emu-git/src/dolphin-emu/Externals/cubeb/src/cubeb_resampler_internal.h:75:18: note: shadowed declaration is here
  676.    const uint32_t channels;
  677.                   ^~~~~~~~
  678. /home/mrturcot/mitch/builds/dolphin-emu-git/src/dolphin-emu/Externals/cubeb/src/cubeb_resampler.cpp: In instantiation of ‘cubeb_resampler_speex<T, InputProcessing, OutputProcessing>::cubeb_resampler_speex(InputProcessor*, OutputProcessor*, cubeb_stream*, cubeb_data_callback, void*) [with T = float; InputProcessing = cubeb_resampler_speex_one_way<float>; OutputProcessing = cubeb_resampler_speex_one_way<float>; cubeb_stream = cubeb_stream; cubeb_data_callback = long int (*)(cubeb_stream*, void*, const void*, void*, long int)]’:
  679. /home/mrturcot/mitch/builds/dolphin-emu-git/src/dolphin-emu/Externals/cubeb/src/cubeb_resampler_internal.h:578:12:   required from ‘cubeb_resampler* cubeb_resampler_create_internal(cubeb_stream*, cubeb_stream_params*, cubeb_stream_params*, unsigned int, cubeb_data_callback, void*, cubeb_resampler_quality) [with T = float; cubeb_resampler = cubeb_resampler; cubeb_stream = cubeb_stream; cubeb_data_callback = long int (*)(cubeb_stream*, void*, const void*, void*, long int)]’
  680. /home/mrturcot/mitch/builds/dolphin-emu-git/src/dolphin-emu/Externals/cubeb/src/cubeb_resampler.cpp:301:60:   required from here
  681. /home/mrturcot/mitch/builds/dolphin-emu-git/src/dolphin-emu/Externals/cubeb/src/cubeb_resampler.cpp:90:1: warning: declaration of ‘output_processor’ shadows a member of ‘cubeb_resampler_speex<float, cubeb_resampler_speex_one_way<float>, cubeb_resampler_speex_one_way<float> >’ [-Wshadow]
  682.  cubeb_resampler_speex<T, InputProcessor, OutputProcessor>
  683.  ^~~~~~~~~~~~~~~~~~~~~~~~~~~~~~~~~~~~~~~~~~~~~~~~~~~~~~~~~
  684. In file included from /home/mrturcot/mitch/builds/dolphin-emu-git/src/dolphin-emu/Externals/cubeb/src/cubeb_resampler.cpp:19:
  685. /home/mrturcot/mitch/builds/dolphin-emu-git/src/dolphin-emu/Externals/cubeb/src/cubeb_resampler_internal.h:155:37: note: shadowed declaration is here
  686.    std::unique_ptr<OutputProcessing> output_processor;
  687.                                      ^~~~~~~~~~~~~~~~
  688. /home/mrturcot/mitch/builds/dolphin-emu-git/src/dolphin-emu/Externals/cubeb/src/cubeb_resampler.cpp:90:1: warning: declaration of ‘input_processor’ shadows a member of ‘cubeb_resampler_speex<float, cubeb_resampler_speex_one_way<float>, cubeb_resampler_speex_one_way<float> >’ [-Wshadow]
  689.  cubeb_resampler_speex<T, InputProcessor, OutputProcessor>
  690.  ^~~~~~~~~~~~~~~~~~~~~~~~~~~~~~~~~~~~~~~~~~~~~~~~~~~~~~~~~
  691. In file included from /home/mrturcot/mitch/builds/dolphin-emu-git/src/dolphin-emu/Externals/cubeb/src/cubeb_resampler.cpp:19:
  692. /home/mrturcot/mitch/builds/dolphin-emu-git/src/dolphin-emu/Externals/cubeb/src/cubeb_resampler_internal.h:154:36: note: shadowed declaration is here
  693.    std::unique_ptr<InputProcessing> input_processor;
  694.                                     ^~~~~~~~~~~~~~~
  695. /home/mrturcot/mitch/builds/dolphin-emu-git/src/dolphin-emu/Externals/cubeb/src/cubeb_resampler.cpp: In instantiation of ‘cubeb_resampler_speex<T, InputProcessing, OutputProcessing>::cubeb_resampler_speex(InputProcessor*, OutputProcessor*, cubeb_stream*, cubeb_data_callback, void*) [with T = float; InputProcessing = cubeb_resampler_speex_one_way<float>; OutputProcessing = delay_line<float>; cubeb_stream = cubeb_stream; cubeb_data_callback = long int (*)(cubeb_stream*, void*, const void*, void*, long int)]’:
  696. /home/mrturcot/mitch/builds/dolphin-emu-git/src/dolphin-emu/Externals/cubeb/src/cubeb_resampler_internal.h:585:12:   required from ‘cubeb_resampler* cubeb_resampler_create_internal(cubeb_stream*, cubeb_stream_params*, cubeb_stream_params*, unsigned int, cubeb_data_callback, void*, cubeb_resampler_quality) [with T = float; cubeb_resampler = cubeb_resampler; cubeb_stream = cubeb_stream; cubeb_data_callback = long int (*)(cubeb_stream*, void*, const void*, void*, long int)]’
  697. /home/mrturcot/mitch/builds/dolphin-emu-git/src/dolphin-emu/Externals/cubeb/src/cubeb_resampler.cpp:301:60:   required from here
  698. /home/mrturcot/mitch/builds/dolphin-emu-git/src/dolphin-emu/Externals/cubeb/src/cubeb_resampler.cpp:90:1: warning: declaration of ‘output_processor’ shadows a member of ‘cubeb_resampler_speex<float, cubeb_resampler_speex_one_way<float>, delay_line<float> >’ [-Wshadow]
  699.  cubeb_resampler_speex<T, InputProcessor, OutputProcessor>
  700.  ^~~~~~~~~~~~~~~~~~~~~~~~~~~~~~~~~~~~~~~~~~~~~~~~~~~~~~~~~
  701. In file included from /home/mrturcot/mitch/builds/dolphin-emu-git/src/dolphin-emu/Externals/cubeb/src/cubeb_resampler.cpp:19:
  702. /home/mrturcot/mitch/builds/dolphin-emu-git/src/dolphin-emu/Externals/cubeb/src/cubeb_resampler_internal.h:155:37: note: shadowed declaration is here
  703.    std::unique_ptr<OutputProcessing> output_processor;
  704.                                      ^~~~~~~~~~~~~~~~
  705. /home/mrturcot/mitch/builds/dolphin-emu-git/src/dolphin-emu/Externals/cubeb/src/cubeb_resampler.cpp:90:1: warning: declaration of ‘input_processor’ shadows a member of ‘cubeb_resampler_speex<float, cubeb_resampler_speex_one_way<float>, delay_line<float> >’ [-Wshadow]
  706.  cubeb_resampler_speex<T, InputProcessor, OutputProcessor>
  707.  ^~~~~~~~~~~~~~~~~~~~~~~~~~~~~~~~~~~~~~~~~~~~~~~~~~~~~~~~~
  708. In file included from /home/mrturcot/mitch/builds/dolphin-emu-git/src/dolphin-emu/Externals/cubeb/src/cubeb_resampler.cpp:19:
  709. /home/mrturcot/mitch/builds/dolphin-emu-git/src/dolphin-emu/Externals/cubeb/src/cubeb_resampler_internal.h:154:36: note: shadowed declaration is here
  710.    std::unique_ptr<InputProcessing> input_processor;
  711.                                     ^~~~~~~~~~~~~~~
  712. /home/mrturcot/mitch/builds/dolphin-emu-git/src/dolphin-emu/Externals/cubeb/src/cubeb_resampler.cpp: In instantiation of ‘cubeb_resampler_speex<T, InputProcessing, OutputProcessing>::cubeb_resampler_speex(InputProcessor*, OutputProcessor*, cubeb_stream*, cubeb_data_callback, void*) [with T = float; InputProcessing = delay_line<float>; OutputProcessing = cubeb_resampler_speex_one_way<float>; cubeb_stream = cubeb_stream; cubeb_data_callback = long int (*)(cubeb_stream*, void*, const void*, void*, long int)]’:
  713. /home/mrturcot/mitch/builds/dolphin-emu-git/src/dolphin-emu/Externals/cubeb/src/cubeb_resampler_internal.h:592:12:   required from ‘cubeb_resampler* cubeb_resampler_create_internal(cubeb_stream*, cubeb_stream_params*, cubeb_stream_params*, unsigned int, cubeb_data_callback, void*, cubeb_resampler_quality) [with T = float; cubeb_resampler = cubeb_resampler; cubeb_stream = cubeb_stream; cubeb_data_callback = long int (*)(cubeb_stream*, void*, const void*, void*, long int)]’
  714. /home/mrturcot/mitch/builds/dolphin-emu-git/src/dolphin-emu/Externals/cubeb/src/cubeb_resampler.cpp:301:60:   required from here
  715. /home/mrturcot/mitch/builds/dolphin-emu-git/src/dolphin-emu/Externals/cubeb/src/cubeb_resampler.cpp:90:1: warning: declaration of ‘output_processor’ shadows a member of ‘cubeb_resampler_speex<float, delay_line<float>, cubeb_resampler_speex_one_way<float> >’ [-Wshadow]
  716.  cubeb_resampler_speex<T, InputProcessor, OutputProcessor>
  717.  ^~~~~~~~~~~~~~~~~~~~~~~~~~~~~~~~~~~~~~~~~~~~~~~~~~~~~~~~~
  718. In file included from /home/mrturcot/mitch/builds/dolphin-emu-git/src/dolphin-emu/Externals/cubeb/src/cubeb_resampler.cpp:19:
  719. /home/mrturcot/mitch/builds/dolphin-emu-git/src/dolphin-emu/Externals/cubeb/src/cubeb_resampler_internal.h:155:37: note: shadowed declaration is here
  720.    std::unique_ptr<OutputProcessing> output_processor;
  721.                                      ^~~~~~~~~~~~~~~~
  722. /home/mrturcot/mitch/builds/dolphin-emu-git/src/dolphin-emu/Externals/cubeb/src/cubeb_resampler.cpp:90:1: warning: declaration of ‘input_processor’ shadows a member of ‘cubeb_resampler_speex<float, delay_line<float>, cubeb_resampler_speex_one_way<float> >’ [-Wshadow]
  723.  cubeb_resampler_speex<T, InputProcessor, OutputProcessor>
  724.  ^~~~~~~~~~~~~~~~~~~~~~~~~~~~~~~~~~~~~~~~~~~~~~~~~~~~~~~~~
  725. In file included from /home/mrturcot/mitch/builds/dolphin-emu-git/src/dolphin-emu/Externals/cubeb/src/cubeb_resampler.cpp:19:
  726. /home/mrturcot/mitch/builds/dolphin-emu-git/src/dolphin-emu/Externals/cubeb/src/cubeb_resampler_internal.h:154:36: note: shadowed declaration is here
  727.    std::unique_ptr<InputProcessing> input_processor;
  728.                                     ^~~~~~~~~~~~~~~
  729. [  8%] Building CXX object Externals/cubeb/CMakeFiles/cubeb.dir/src/cubeb_panner.cpp.o
  730. [  8%] Building CXX object Externals/cubeb/CMakeFiles/cubeb.dir/src/cubeb_log.cpp.o
  731. [  8%] Building C object Externals/cubeb/CMakeFiles/cubeb.dir/src/cubeb_strings.c.o
  732. [  8%] Building CXX object Source/Core/Common/CMakeFiles/common.dir/Debug/Watches.cpp.o
  733. [  8%] Building CXX object Source/Core/Common/CMakeFiles/common.dir/Debug/MemoryPatches.cpp.o
  734. [  8%] Building CXX object Source/Core/DiscIO/CMakeFiles/discio.dir/FileSystemGCWii.cpp.o
  735. [  8%] Building CXX object Externals/imgui/CMakeFiles/imgui.dir/imgui_widgets.cpp.o
  736. In file included from /home/mrturcot/mitch/builds/dolphin-emu-git/src/dolphin-emu/Externals/cubeb/src/cubeb_log.cpp:10:
  737. /home/mrturcot/mitch/builds/dolphin-emu-git/src/dolphin-emu/Externals/cubeb/src/cubeb_ringbuffer.h: In constructor ‘audio_ring_buffer_base<T>::audio_ring_buffer_base(int, int)’:
  738. /home/mrturcot/mitch/builds/dolphin-emu-git/src/dolphin-emu/Externals/cubeb/src/cubeb_ringbuffer.h:368:5: warning: declaration of ‘channel_count’ shadows a member of ‘audio_ring_buffer_base<T>’ [-Wshadow]
  739.      : channel_count(channel_count)
  740.      ^
  741. /home/mrturcot/mitch/builds/dolphin-emu-git/src/dolphin-emu/Externals/cubeb/src/cubeb_ringbuffer.h:475:7: note: shadowed declaration is here
  742.    int channel_count;
  743.        ^~~~~~~~~~~~~
  744. [  8%] Building C object Externals/cubeb/CMakeFiles/cubeb.dir/src/cubeb_pulse.c.o
  745. [  8%] Building CXX object Source/Core/Common/CMakeFiles/common.dir/ENetUtil.cpp.o
  746. /home/mrturcot/mitch/builds/dolphin-emu-git/src/dolphin-emu/Source/Core/DiscIO/DirectoryBlob.cpp: In member function ‘void DiscIO::DirectoryBlobReader::SetWiiRegionData(const string&)’:
  747. /home/mrturcot/mitch/builds/dolphin-emu-git/src/dolphin-emu/Source/Core/DiscIO/DirectoryBlob.cpp:454:17: warning: unused variable ‘WII_REGION_DATA_SIZE’ [-Wunused-variable]
  748.    constexpr u64 WII_REGION_DATA_SIZE = 0x20;
  749.                  ^~~~~~~~~~~~~~~~~~~~
  750. [  8%] Building CXX object Source/Core/DiscIO/CMakeFiles/discio.dir/Filesystem.cpp.o
  751. [  8%] Building CXX object Source/Core/Common/CMakeFiles/common.dir/File.cpp.o
  752. [  8%] Building CXX object Source/Core/Common/CMakeFiles/common.dir/FileSearch.cpp.o
  753. /home/mrturcot/mitch/builds/dolphin-emu-git/src/dolphin-emu/Externals/cubeb/src/cubeb_pulse.c:599:1: warning: no previous declaration for ‘pulse_init’ [-Wmissing-declarations]
  754.  pulse_init(cubeb ** context, char const * context_name)
  755.  ^~~~~~~~~~
  756. [  8%] Building C object Externals/cubeb/CMakeFiles/cubeb.dir/src/cubeb_alsa.c.o
  757. [  9%] Building CXX object Externals/glslang/CMakeFiles/glslang.dir/glslang/MachineIndependent/Intermediate.cpp.o
  758. [  9%] Building CXX object Externals/glslang/CMakeFiles/glslang.dir/glslang/MachineIndependent/intermOut.cpp.o
  759. /home/mrturcot/mitch/builds/dolphin-emu-git/src/dolphin-emu/Externals/cubeb/src/cubeb_alsa.c:8: warning: "_DEFAULT_SOURCE" redefined
  760.  #define _DEFAULT_SOURCE
  761.  
  762. <command-line>: note: this is the location of the previous definition
  763. /home/mrturcot/mitch/builds/dolphin-emu-git/src/dolphin-emu/Externals/cubeb/src/cubeb_alsa.c:748:1: warning: no previous declaration for ‘alsa_init’ [-Wmissing-declarations]
  764.  alsa_init(cubeb ** context, char const * context_name)
  765.  ^~~~~~~~~
  766. /home/mrturcot/mitch/builds/dolphin-emu-git/src/dolphin-emu/Externals/cubeb/src/cubeb_alsa.c: In function ‘alsa_stream_stop’:
  767. /home/mrturcot/mitch/builds/dolphin-emu-git/src/dolphin-emu/Externals/cubeb/src/cubeb_alsa.c:1211:9: warning: declaration of ‘r’ shadows a previous local [-Wshadow]
  768.      int r = alsa_stream_stop(stm->other_stream);
  769.          ^
  770. /home/mrturcot/mitch/builds/dolphin-emu-git/src/dolphin-emu/Externals/cubeb/src/cubeb_alsa.c:1205:7: note: shadowed declaration is here
  771.    int r;
  772.        ^
  773. [  9%] Building CXX object Externals/cubeb/CMakeFiles/cubeb.dir/src/cubeb_jack.cpp.o
  774. [  9%] Building CXX object Source/Core/DiscIO/CMakeFiles/discio.dir/NANDImporter.cpp.o
  775. [  9%] Building CXX object Source/Core/DiscIO/CMakeFiles/discio.dir/TGCBlob.cpp.o
  776. [  9%] Building CXX object Source/Core/Common/CMakeFiles/common.dir/FileUtil.cpp.o
  777. /home/mrturcot/mitch/builds/dolphin-emu-git/src/dolphin-emu/Externals/cubeb/src/cubeb_jack.cpp:9: warning: "_DEFAULT_SOURCE" redefined
  778.  #define _DEFAULT_SOURCE
  779.  
  780. <command-line>: note: this is the location of the previous definition
  781. /home/mrturcot/mitch/builds/dolphin-emu-git/src/dolphin-emu/Externals/cubeb/src/cubeb_jack.cpp: In function ‘int cbjack_enumerate_devices(cubeb*, cubeb_device_type, cubeb_device_collection*)’:
  782. /home/mrturcot/mitch/builds/dolphin-emu-git/src/dolphin-emu/Externals/cubeb/src/cubeb_jack.cpp:1034:23: warning: ‘rate’ may be used uninitialized in this function [-Wmaybe-uninitialized]
  783.      cur->default_rate = rate;
  784.      ~~~~~~~~~~~~~~~~~~^~~~~~
  785. [  9%] Linking CXX static library libcubeb.a
  786. [  9%] Building CXX object Source/Core/DiscIO/CMakeFiles/discio.dir/Volume.cpp.o
  787. [  9%] Built target cubeb
  788. Scanning dependencies of target audiocommon
  789. [ 10%] Building CXX object Source/Core/AudioCommon/CMakeFiles/audiocommon.dir/AudioCommon.cpp.o
  790. [ 10%] Building CXX object Source/Core/DiscIO/CMakeFiles/discio.dir/VolumeFileBlobReader.cpp.o
  791. [ 10%] Building CXX object Source/Core/DiscIO/CMakeFiles/discio.dir/VolumeGC.cpp.o
  792. [ 10%] Building CXX object Externals/glslang/CMakeFiles/glslang.dir/glslang/MachineIndependent/IntermTraverse.cpp.o
  793. [ 10%] Building CXX object Source/Core/Common/CMakeFiles/common.dir/FloatUtils.cpp.o
  794. [ 11%] Building CXX object Source/Core/DiscIO/CMakeFiles/discio.dir/VolumeWad.cpp.o
  795. [ 11%] Building CXX object Source/Core/AudioCommon/CMakeFiles/audiocommon.dir/AudioStretcher.cpp.o
  796. [ 11%] Linking CXX static library libimgui.a
  797. [ 13%] Building CXX object Source/Core/Common/CMakeFiles/common.dir/GekkoDisassembler.cpp.o
  798. [ 13%] Built target imgui
  799. [ 13%] Building CXX object Source/Core/AudioCommon/CMakeFiles/audiocommon.dir/CubebStream.cpp.o
  800. [ 13%] Building CXX object Source/Core/Common/CMakeFiles/common.dir/Hash.cpp.o
  801. [ 13%] Building CXX object Externals/glslang/CMakeFiles/glslang.dir/glslang/MachineIndependent/iomapper.cpp.o
  802. In file included from /home/mrturcot/mitch/builds/dolphin-emu-git/src/dolphin-emu/Source/Core/DiscIO/VolumeWad.cpp:23:
  803. /home/mrturcot/mitch/builds/dolphin-emu-git/src/dolphin-emu/Source/Core/DiscIO/Volume.h: In member function ‘virtual std::optional<long unsigned int> DiscIO::VolumeWAD::GetTitleID(const DiscIO::Partition&) const’:
  804. /home/mrturcot/mitch/builds/dolphin-emu-git/src/dolphin-emu/Source/Core/DiscIO/Volume.h:52:15: warning: ‘<anonymous>’ may be used uninitialized in this function [-Wmaybe-uninitialized]
  805.        return {};
  806.                ^
  807. [ 13%] Building CXX object Source/Core/DiscIO/CMakeFiles/discio.dir/VolumeWii.cpp.o
  808. [ 13%] Building CXX object Source/Core/AudioCommon/CMakeFiles/audiocommon.dir/CubebUtils.cpp.o
  809. [ 13%] Building CXX object Externals/glslang/CMakeFiles/glslang.dir/glslang/MachineIndependent/limits.cpp.o
  810. [ 13%] Building CXX object Source/Core/DiscIO/CMakeFiles/discio.dir/WiiSaveBanner.cpp.o
  811. [ 13%] Building CXX object Source/Core/AudioCommon/CMakeFiles/audiocommon.dir/Mixer.cpp.o
  812. [ 13%] Building CXX object Source/Core/Common/CMakeFiles/common.dir/HttpRequest.cpp.o
  813. [ 13%] Building CXX object Source/Core/AudioCommon/CMakeFiles/audiocommon.dir/SurroundDecoder.cpp.o
  814. [ 13%] Building CXX object Source/Core/Common/CMakeFiles/common.dir/Image.cpp.o
  815. [ 13%] Building CXX object Source/Core/DiscIO/CMakeFiles/discio.dir/WiiWad.cpp.o
  816. [ 13%] Building CXX object Source/Core/Common/CMakeFiles/common.dir/IniFile.cpp.o
  817. [ 13%] Building CXX object Externals/glslang/CMakeFiles/glslang.dir/glslang/MachineIndependent/linkValidate.cpp.o
  818. [ 13%] Building CXX object Source/Core/AudioCommon/CMakeFiles/audiocommon.dir/NullSoundStream.cpp.o
  819. [ 13%] Building CXX object Source/Core/AudioCommon/CMakeFiles/audiocommon.dir/WaveFile.cpp.o
  820. [ 13%] Building CXX object Source/Core/Common/CMakeFiles/common.dir/JitRegister.cpp.o
  821. In file included from /home/mrturcot/mitch/builds/dolphin-emu-git/src/dolphin-emu/Source/Core/DiscIO/WiiWad.cpp:15:
  822. /home/mrturcot/mitch/builds/dolphin-emu-git/src/dolphin-emu/Source/Core/DiscIO/Blob.h: In member function ‘bool DiscIO::WiiWAD::ParseWAD()’:
  823. /home/mrturcot/mitch/builds/dolphin-emu-git/src/dolphin-emu/Source/Core/DiscIO/Blob.h:55:15: warning: ‘<anonymous>’ may be used uninitialized in this function [-Wmaybe-uninitialized]
  824.        return {};
  825.                ^
  826. /home/mrturcot/mitch/builds/dolphin-emu-git/src/dolphin-emu/Source/Core/DiscIO/Blob.h:55:15: warning: ‘<anonymous>’ may be used uninitialized in this function [-Wmaybe-uninitialized]
  827.        return {};
  828.                ^
  829. /home/mrturcot/mitch/builds/dolphin-emu-git/src/dolphin-emu/Source/Core/DiscIO/Blob.h:55:15: warning: ‘<anonymous>’ may be used uninitialized in this function [-Wmaybe-uninitialized]
  830.        return {};
  831.                ^
  832. /home/mrturcot/mitch/builds/dolphin-emu-git/src/dolphin-emu/Source/Core/DiscIO/Blob.h:55:15: warning: ‘<anonymous>’ may be used uninitialized in this function [-Wmaybe-uninitialized]
  833.        return {};
  834.                ^
  835. /home/mrturcot/mitch/builds/dolphin-emu-git/src/dolphin-emu/Source/Core/DiscIO/Blob.h:55:15: warning: ‘<anonymous>’ may be used uninitialized in this function [-Wmaybe-uninitialized]
  836.        return {};
  837.                ^
  838. [ 13%] Building CXX object Source/Core/Common/CMakeFiles/common.dir/Logging/LogManager.cpp.o
  839. [ 14%] Building CXX object Source/Core/AudioCommon/CMakeFiles/audiocommon.dir/AlsaSoundStream.cpp.o
  840. In file included from /home/mrturcot/mitch/builds/dolphin-emu-git/src/dolphin-emu/Source/Core/DiscIO/VolumeWii.cpp:26:
  841. /home/mrturcot/mitch/builds/dolphin-emu-git/src/dolphin-emu/Source/Core/DiscIO/Blob.h: In static member function ‘static _Res std::_Function_handler<_Res(_ArgTypes ...), _Functor>::_M_invoke(const std::_Any_data&, _ArgTypes&& ...) [with _Res = IOS::ES::TMDReader; _Functor = DiscIO::VolumeWii::VolumeWii(std::unique_ptr<DiscIO::BlobReader>)::<lambda()>; _ArgTypes = {}]’:
  842. /home/mrturcot/mitch/builds/dolphin-emu-git/src/dolphin-emu/Source/Core/DiscIO/Blob.h:55:15: warning: ‘<anonymous>’ may be used uninitialized in this function [-Wmaybe-uninitialized]
  843.        return {};
  844.                ^
  845. [ 14%] Linking CXX static library libdiscio.a
  846. [ 14%] Building CXX object Externals/glslang/CMakeFiles/glslang.dir/glslang/MachineIndependent/parseConst.cpp.o
  847. [ 14%] Built target discio
  848. [ 14%] Building CXX object Externals/glslang/CMakeFiles/glslang.dir/glslang/MachineIndependent/ParseContextBase.cpp.o
  849. [ 14%] Building CXX object Source/Core/AudioCommon/CMakeFiles/audiocommon.dir/PulseAudioStream.cpp.o
  850. In file included from /home/mrturcot/mitch/builds/dolphin-emu-git/src/dolphin-emu/Externals/glslang/glslang/MachineIndependent/LiveTraverser.h:39,
  851.                  from /home/mrturcot/mitch/builds/dolphin-emu-git/src/dolphin-emu/Externals/glslang/glslang/MachineIndependent/iomapper.cpp:39:
  852. /home/mrturcot/mitch/builds/dolphin-emu-git/src/dolphin-emu/Externals/glslang/glslang/MachineIndependent/reflection.h:62:5: warning: type qualifiers ignored on function return type [-Wignored-qualifiers]
  853.      const TType* const getType() const { return type; }
  854.      ^~~~~
  855. [ 14%] Building CXX object Source/Core/Common/CMakeFiles/common.dir/MathUtil.cpp.o
  856. [ 15%] Building CXX object Externals/glslang/CMakeFiles/glslang.dir/glslang/MachineIndependent/ParseHelper.cpp.o
  857. [ 16%] Building CXX object Source/Core/Common/CMakeFiles/common.dir/Matrix.cpp.o
  858. [ 16%] Building CXX object Source/Core/Common/CMakeFiles/common.dir/MD5.cpp.o
  859. [ 16%] Building CXX object Source/Core/Common/CMakeFiles/common.dir/MemArena.cpp.o
  860. [ 16%] Building CXX object Source/Core/Common/CMakeFiles/common.dir/MemoryUtil.cpp.o
  861. [ 16%] Linking CXX static library libaudiocommon.a
  862. [ 16%] Building CXX object Source/Core/Common/CMakeFiles/common.dir/MsgHandler.cpp.o
  863. [ 16%] Built target audiocommon
  864. [ 16%] Building CXX object Source/Core/Common/CMakeFiles/common.dir/NandPaths.cpp.o
  865. [ 16%] Building CXX object Externals/glslang/CMakeFiles/glslang.dir/glslang/MachineIndependent/PoolAlloc.cpp.o
  866. [ 16%] Building CXX object Source/Core/Common/CMakeFiles/common.dir/Network.cpp.o
  867. [ 16%] Building CXX object Externals/glslang/CMakeFiles/glslang.dir/glslang/MachineIndependent/preprocessor/Pp.cpp.o
  868. [ 16%] Building CXX object Source/Core/Common/CMakeFiles/common.dir/PcapFile.cpp.o
  869. [ 17%] Building CXX object Source/Core/Common/CMakeFiles/common.dir/PerformanceCounter.cpp.o
  870. [ 17%] Building CXX object Source/Core/Common/CMakeFiles/common.dir/Profiler.cpp.o
  871. [ 17%] Building CXX object Externals/glslang/CMakeFiles/glslang.dir/glslang/MachineIndependent/preprocessor/PpAtom.cpp.o
  872. [ 17%] Building CXX object Source/Core/Common/CMakeFiles/common.dir/QoSSession.cpp.o
  873. [ 17%] Building CXX object Source/Core/Common/CMakeFiles/common.dir/Random.cpp.o
  874. [ 17%] Building CXX object Source/Core/Common/CMakeFiles/common.dir/SDCardUtil.cpp.o
  875. [ 17%] Building CXX object Source/Core/Common/CMakeFiles/common.dir/SFMLHelper.cpp.o
  876. [ 17%] Building CXX object Externals/glslang/CMakeFiles/glslang.dir/glslang/MachineIndependent/preprocessor/PpContext.cpp.o
  877. [ 17%] Building CXX object Source/Core/Common/CMakeFiles/common.dir/SettingsHandler.cpp.o
  878. [ 17%] Building CXX object Source/Core/Common/CMakeFiles/common.dir/StringUtil.cpp.o
  879. [ 17%] Building CXX object Externals/glslang/CMakeFiles/glslang.dir/glslang/MachineIndependent/preprocessor/PpScanner.cpp.o
  880. [ 18%] Building CXX object Source/Core/Common/CMakeFiles/common.dir/SymbolDB.cpp.o
  881. [ 18%] Building CXX object Source/Core/Common/CMakeFiles/common.dir/Thread.cpp.o
  882. [ 18%] Building CXX object Externals/glslang/CMakeFiles/glslang.dir/glslang/MachineIndependent/preprocessor/PpTokens.cpp.o
  883. [ 18%] Building CXX object Source/Core/Common/CMakeFiles/common.dir/Timer.cpp.o
  884. [ 18%] Building CXX object Source/Core/Common/CMakeFiles/common.dir/TraversalClient.cpp.o
  885. [ 18%] Building CXX object Source/Core/Common/CMakeFiles/common.dir/UPnP.cpp.o
  886. [ 18%] Building CXX object Source/Core/Common/CMakeFiles/common.dir/Version.cpp.o
  887. [ 18%] Building CXX object Source/Core/Common/CMakeFiles/common.dir/Logging/ConsoleListenerNix.cpp.o
  888. [ 18%] Building CXX object Source/Core/Common/CMakeFiles/common.dir/x64ABI.cpp.o
  889. [ 18%] Building CXX object Externals/glslang/CMakeFiles/glslang.dir/glslang/MachineIndependent/propagateNoContraction.cpp.o
  890. [ 18%] Building CXX object Source/Core/Common/CMakeFiles/common.dir/x64Emitter.cpp.o
  891. [ 19%] Building CXX object Source/Core/Common/CMakeFiles/common.dir/x64FPURoundMode.cpp.o
  892. [ 19%] Building CXX object Source/Core/Common/CMakeFiles/common.dir/x64CPUDetect.cpp.o
  893. [ 19%] Building CXX object Externals/glslang/CMakeFiles/glslang.dir/glslang/MachineIndependent/reflection.cpp.o
  894. [ 19%] Building CXX object Source/Core/Common/CMakeFiles/common.dir/GL/GLUtil.cpp.o
  895. [ 20%] Building CXX object Externals/glslang/CMakeFiles/glslang.dir/glslang/MachineIndependent/RemoveTree.cpp.o
  896. [ 20%] Building CXX object Source/Core/Common/CMakeFiles/common.dir/GL/GLExtensions/GLExtensions.cpp.o
  897. [ 20%] Building CXX object Source/Core/Common/CMakeFiles/common.dir/GL/GLContext.cpp.o
  898. [ 20%] Building CXX object Source/Core/Common/CMakeFiles/common.dir/GL/GLInterface/EGL.cpp.o
  899. [ 20%] Building CXX object Externals/glslang/CMakeFiles/glslang.dir/glslang/MachineIndependent/Scan.cpp.o
  900. [ 20%] Building CXX object Source/Core/Common/CMakeFiles/common.dir/GL/GLInterface/EGLX11.cpp.o
  901. [ 20%] Building CXX object Externals/glslang/CMakeFiles/glslang.dir/glslang/MachineIndependent/ShaderLang.cpp.o
  902. [ 20%] Building CXX object Source/Core/Common/CMakeFiles/common.dir/GL/GLX11Window.cpp.o
  903. [ 21%] Building CXX object Source/Core/Common/CMakeFiles/common.dir/GL/GLInterface/GLX.cpp.o
  904. [ 21%] Building CXX object Externals/glslang/CMakeFiles/glslang.dir/glslang/MachineIndependent/SymbolTable.cpp.o
  905. [ 21%] Building CXX object Externals/glslang/CMakeFiles/glslang.dir/glslang/MachineIndependent/Versions.cpp.o
  906. [ 21%] Building CXX object Externals/glslang/CMakeFiles/glslang.dir/OGLCompilersDLL/InitializeDll.cpp.o
  907. [ 21%] Building CXX object Externals/glslang/CMakeFiles/glslang.dir/SPIRV/disassemble.cpp.o
  908. In file included from /home/mrturcot/mitch/builds/dolphin-emu-git/src/dolphin-emu/Externals/glslang/glslang/MachineIndependent/reflection.cpp:37:
  909. /home/mrturcot/mitch/builds/dolphin-emu-git/src/dolphin-emu/Externals/glslang/glslang/MachineIndependent/reflection.h:62:5: warning: type qualifiers ignored on function return type [-Wignored-qualifiers]
  910.      const TType* const getType() const { return type; }
  911.      ^~~~~
  912. [ 21%] Building CXX object Externals/glslang/CMakeFiles/glslang.dir/SPIRV/doc.cpp.o
  913. [ 22%] Building CXX object Externals/glslang/CMakeFiles/glslang.dir/SPIRV/GlslangToSpv.cpp.o
  914. [ 22%] Linking CXX static library libcommon.a
  915. [ 22%] Built target common
  916. Scanning dependencies of target traversal_server
  917. [ 22%] Building CXX object Source/Core/Common/CMakeFiles/traversal_server.dir/TraversalServer.cpp.o
  918. [ 22%] Building CXX object Externals/glslang/CMakeFiles/glslang.dir/SPIRV/InReadableOrder.cpp.o
  919. [ 22%] Building CXX object Externals/glslang/CMakeFiles/glslang.dir/SPIRV/Logger.cpp.o
  920. [ 22%] Building CXX object Externals/glslang/CMakeFiles/glslang.dir/SPIRV/SpvBuilder.cpp.o
  921. [ 23%] Linking CXX executable ../../../Binaries/traversal_server
  922. [ 23%] Built target traversal_server
  923. Scanning dependencies of target inputcommon
  924. [ 23%] Building CXX object Source/Core/InputCommon/CMakeFiles/inputcommon.dir/InputConfig.cpp.o
  925. [ 23%] Building CXX object Externals/glslang/CMakeFiles/glslang.dir/SPIRV/SPVRemapper.cpp.o
  926. [ 23%] Building CXX object Externals/glslang/CMakeFiles/glslang.dir/glslang/OSDependent/Unix/ossource.cpp.o
  927. [ 25%] Building CXX object Source/Core/InputCommon/CMakeFiles/inputcommon.dir/InputProfile.cpp.o
  928. [ 25%] Building CXX object Source/Core/InputCommon/CMakeFiles/inputcommon.dir/ControllerEmu/ControllerEmu.cpp.o
  929. [ 25%] Building CXX object Source/Core/InputCommon/CMakeFiles/inputcommon.dir/ControllerEmu/StickGate.cpp.o
  930. In file included from /home/mrturcot/mitch/builds/dolphin-emu-git/src/dolphin-emu/Externals/glslang/glslang/MachineIndependent/ShaderLang.cpp:66:
  931. /home/mrturcot/mitch/builds/dolphin-emu-git/src/dolphin-emu/Externals/glslang/glslang/MachineIndependent/reflection.h:62:5: warning: type qualifiers ignored on function return type [-Wignored-qualifiers]
  932.      const TType* const getType() const { return type; }
  933.      ^~~~~
  934. [ 25%] Building CXX object Source/Core/InputCommon/CMakeFiles/inputcommon.dir/ControllerEmu/Control/Control.cpp.o
  935. Scanning dependencies of target uicommon
  936. [ 25%] Building CXX object Source/Core/UICommon/CMakeFiles/uicommon.dir/AutoUpdate.cpp.o
  937. /home/mrturcot/mitch/builds/dolphin-emu-git/src/dolphin-emu/Source/Core/InputCommon/ControllerEmu/StickGate.cpp: In constructor ‘ControllerEmu::ReshapableInput::ReshapableInput(std::__cxx11::string, std::__cxx11::string, ControllerEmu::GroupType)’:
  938. /home/mrturcot/mitch/builds/dolphin-emu-git/src/dolphin-emu/Source/Core/InputCommon/ControllerEmu/StickGate.cpp:100:87: warning: declaration of ‘type’ shadows a member of ‘ControllerEmu::ReshapableInput’ [-Wshadow]
  939.  ReshapableInput::ReshapableInput(std::string name, std::string ui_name, GroupType type)
  940.                                                                                        ^
  941. In file included from /home/mrturcot/mitch/builds/dolphin-emu-git/src/dolphin-emu/Source/Core/InputCommon/ControllerEmu/StickGate.h:13,
  942.                  from /home/mrturcot/mitch/builds/dolphin-emu-git/src/dolphin-emu/Source/Core/InputCommon/ControllerEmu/StickGate.cpp:5:
  943. /home/mrturcot/mitch/builds/dolphin-emu-git/src/dolphin-emu/Source/Core/InputCommon/ControllerEmu/ControlGroup/ControlGroup.h:51:19: note: shadowed declaration is here
  944.    const GroupType type;
  945.                    ^~~~
  946. /home/mrturcot/mitch/builds/dolphin-emu-git/src/dolphin-emu/Source/Core/InputCommon/ControllerEmu/StickGate.cpp:100:87: warning: declaration of ‘ui_name’ shadows a member of ‘ControllerEmu::ReshapableInput’ [-Wshadow]
  947.  ReshapableInput::ReshapableInput(std::string name, std::string ui_name, GroupType type)
  948.                                                                                        ^
  949. In file included from /home/mrturcot/mitch/builds/dolphin-emu-git/src/dolphin-emu/Source/Core/InputCommon/ControllerEmu/StickGate.h:13,
  950.                  from /home/mrturcot/mitch/builds/dolphin-emu-git/src/dolphin-emu/Source/Core/InputCommon/ControllerEmu/StickGate.cpp:5:
  951. /home/mrturcot/mitch/builds/dolphin-emu-git/src/dolphin-emu/Source/Core/InputCommon/ControllerEmu/ControlGroup/ControlGroup.h:50:21: note: shadowed declaration is here
  952.    const std::string ui_name;
  953.                      ^~~~~~~
  954. /home/mrturcot/mitch/builds/dolphin-emu-git/src/dolphin-emu/Source/Core/InputCommon/ControllerEmu/StickGate.cpp:100:87: warning: declaration of ‘name’ shadows a member of ‘ControllerEmu::ReshapableInput’ [-Wshadow]
  955.  ReshapableInput::ReshapableInput(std::string name, std::string ui_name, GroupType type)
  956.                                                                                        ^
  957. In file included from /home/mrturcot/mitch/builds/dolphin-emu-git/src/dolphin-emu/Source/Core/InputCommon/ControllerEmu/StickGate.h:13,
  958.                  from /home/mrturcot/mitch/builds/dolphin-emu-git/src/dolphin-emu/Source/Core/InputCommon/ControllerEmu/StickGate.cpp:5:
  959. /home/mrturcot/mitch/builds/dolphin-emu-git/src/dolphin-emu/Source/Core/InputCommon/ControllerEmu/ControlGroup/ControlGroup.h:49:21: note: shadowed declaration is here
  960.    const std::string name;
  961.                      ^~~~
  962. [ 25%] Building CXX object Source/Core/UICommon/CMakeFiles/uicommon.dir/CommandLineParse.cpp.o
  963. [ 25%] Building CXX object Source/Core/InputCommon/CMakeFiles/inputcommon.dir/ControllerEmu/Control/Output.cpp.o
  964. [ 25%] Building CXX object Source/Core/InputCommon/CMakeFiles/inputcommon.dir/ControllerEmu/ControlGroup/AnalogStick.cpp.o
  965. [ 25%] Building CXX object Source/Core/UICommon/CMakeFiles/uicommon.dir/Disassembler.cpp.o
  966. [ 25%] Building CXX object Source/Core/InputCommon/CMakeFiles/inputcommon.dir/ControllerEmu/Control/Input.cpp.o
  967. In file included from /home/mrturcot/mitch/builds/dolphin-emu-git/src/dolphin-emu/Externals/glslang/SPIRV/hex_float.h:39,
  968.                  from /home/mrturcot/mitch/builds/dolphin-emu-git/src/dolphin-emu/Externals/glslang/SPIRV/SpvBuilder.cpp:49:
  969. /home/mrturcot/mitch/builds/dolphin-emu-git/src/dolphin-emu/Externals/glslang/SPIRV/bitutils.h: In instantiation of ‘Dest spvutils::BitwiseCast(Src) [with Dest = spvutils::Float16; Src = short unsigned int]’:
  970. /home/mrturcot/mitch/builds/dolphin-emu-git/src/dolphin-emu/Externals/glslang/SPIRV/hex_float.h:138:47:   required from ‘T spvutils::FloatProxy<T>::getAsFloat() const [with T = spvutils::Float16]’
  971. /home/mrturcot/mitch/builds/dolphin-emu-git/src/dolphin-emu/Externals/glslang/SPIRV/hex_float.h:821:52:   required from here
  972. /home/mrturcot/mitch/builds/dolphin-emu-git/src/dolphin-emu/Externals/glslang/SPIRV/bitutils.h:29:14: warning: ‘void* memcpy(void*, const void*, size_t)’ writing to an object of non-trivially copyable type ‘class spvutils::Float16’; use copy-assignment or copy-initialization instead [-Wclass-memaccess]
  973.    std::memcpy(&dest, &source, sizeof(dest));
  974.    ~~~~~~~~~~~^~~~~~~~~~~~~~~~~~~~~~~~~~~~~~
  975. In file included from /home/mrturcot/mitch/builds/dolphin-emu-git/src/dolphin-emu/Externals/glslang/SPIRV/SpvBuilder.cpp:49:
  976. /home/mrturcot/mitch/builds/dolphin-emu-git/src/dolphin-emu/Externals/glslang/SPIRV/hex_float.h:43:7: note: ‘class spvutils::Float16’ declared here
  977.  class Float16 {
  978.        ^~~~~~~
  979. In file included from /home/mrturcot/mitch/builds/dolphin-emu-git/src/dolphin-emu/Externals/glslang/SPIRV/hex_float.h:39,
  980.                  from /home/mrturcot/mitch/builds/dolphin-emu-git/src/dolphin-emu/Externals/glslang/SPIRV/SpvBuilder.cpp:49:
  981. /home/mrturcot/mitch/builds/dolphin-emu-git/src/dolphin-emu/Externals/glslang/SPIRV/bitutils.h: In instantiation of ‘Dest spvutils::BitwiseCast(Src) [with Dest = spvutils::FloatProxy<spvutils::Float16>; Src = short unsigned int]’:
  982. /home/mrturcot/mitch/builds/dolphin-emu-git/src/dolphin-emu/Externals/glslang/SPIRV/hex_float.h:431:28:   required from ‘void spvutils::HexFloat<T, Traits>::setFromSignUnbiasedExponentAndNormalizedSignificand(bool, spvutils::HexFloat<T, Traits>::int_type, spvutils::HexFloat<T, Traits>::uint_type, bool) [with T = spvutils::FloatProxy<spvutils::Float16>; Traits = spvutils::HexFloatTraits<spvutils::FloatProxy<spvutils::Float16> >; spvutils::HexFloat<T, Traits>::int_type = short int; spvutils::HexFloat<T, Traits>::uint_type = short unsigned int]’
  983. /home/mrturcot/mitch/builds/dolphin-emu-git/src/dolphin-emu/Externals/glslang/SPIRV/hex_float.h:633:5:   required from ‘void spvutils::HexFloat<T, Traits>::castTo(other_T&, spvutils::round_direction) [with other_T = spvutils::HexFloat<spvutils::FloatProxy<spvutils::Float16>, spvutils::HexFloatTraits<spvutils::FloatProxy<spvutils::Float16> > >; T = spvutils::FloatProxy<float>; Traits = spvutils::HexFloatTraits<spvutils::FloatProxy<float> >]’
  984. /home/mrturcot/mitch/builds/dolphin-emu-git/src/dolphin-emu/Externals/glslang/SPIRV/hex_float.h:817:39:   required from here
  985. /home/mrturcot/mitch/builds/dolphin-emu-git/src/dolphin-emu/Externals/glslang/SPIRV/bitutils.h:29:14: warning: ‘void* memcpy(void*, const void*, size_t)’ copying an object of non-trivial type ‘class spvutils::FloatProxy<spvutils::Float16>’ from an array of ‘short unsigned int’ [-Wclass-memaccess]
  986.    std::memcpy(&dest, &source, sizeof(dest));
  987.    ~~~~~~~~~~~^~~~~~~~~~~~~~~~~~~~~~~~~~~~~~
  988. In file included from /home/mrturcot/mitch/builds/dolphin-emu-git/src/dolphin-emu/Externals/glslang/SPIRV/SpvBuilder.cpp:49:
  989. /home/mrturcot/mitch/builds/dolphin-emu-git/src/dolphin-emu/Externals/glslang/SPIRV/hex_float.h:115:7: note: ‘class spvutils::FloatProxy<spvutils::Float16>’ declared here
  990.  class FloatProxy {
  991.        ^~~~~~~~~~
  992. [ 25%] Building CXX object Source/Core/InputCommon/CMakeFiles/inputcommon.dir/ControllerEmu/ControlGroup/Attachments.cpp.o
  993. [ 25%] Building CXX object Source/Core/UICommon/CMakeFiles/uicommon.dir/DiscordPresence.cpp.o
  994. [ 25%] Building CXX object Source/Core/InputCommon/CMakeFiles/inputcommon.dir/ControllerEmu/ControlGroup/Buttons.cpp.o
  995. [ 26%] Building CXX object Source/Core/InputCommon/CMakeFiles/inputcommon.dir/ControllerEmu/ControlGroup/ControlGroup.cpp.o
  996. [ 26%] Building CXX object Source/Core/InputCommon/CMakeFiles/inputcommon.dir/ControllerEmu/ControlGroup/Cursor.cpp.o
  997. /home/mrturcot/mitch/builds/dolphin-emu-git/src/dolphin-emu/Source/Core/InputCommon/ControllerEmu/ControlGroup/AnalogStick.cpp: In constructor ‘ControllerEmu::OctagonAnalogStick::OctagonAnalogStick(const char*, ControlState)’:
  998. /home/mrturcot/mitch/builds/dolphin-emu-git/src/dolphin-emu/Source/Core/InputCommon/ControllerEmu/ControlGroup/AnalogStick.cpp:59:82: warning: declaration of ‘name’ shadows a member of ‘ControllerEmu::OctagonAnalogStick’ [-Wshadow]
  999.  OctagonAnalogStick::OctagonAnalogStick(const char* name, ControlState gate_radius)
  1000.                                                                                   ^
  1001. In file included from /home/mrturcot/mitch/builds/dolphin-emu-git/src/dolphin-emu/Source/Core/InputCommon/ControllerEmu/ControlGroup/AnalogStick.h:7,
  1002.                  from /home/mrturcot/mitch/builds/dolphin-emu-git/src/dolphin-emu/Source/Core/InputCommon/ControllerEmu/ControlGroup/AnalogStick.cpp:5:
  1003. /home/mrturcot/mitch/builds/dolphin-emu-git/src/dolphin-emu/Source/Core/InputCommon/ControllerEmu/ControlGroup/ControlGroup.h:49:21: note: shadowed declaration is here
  1004.    const std::string name;
  1005.                      ^~~~
  1006. /home/mrturcot/mitch/builds/dolphin-emu-git/src/dolphin-emu/Source/Core/InputCommon/ControllerEmu/ControlGroup/AnalogStick.cpp: In constructor ‘ControllerEmu::OctagonAnalogStick::OctagonAnalogStick(const char*, const char*, ControlState)’:
  1007. /home/mrturcot/mitch/builds/dolphin-emu-git/src/dolphin-emu/Source/Core/InputCommon/ControllerEmu/ControlGroup/AnalogStick.cpp:65:64: warning: declaration of ‘ui_name’ shadows a member of ‘ControllerEmu::OctagonAnalogStick’ [-Wshadow]
  1008.                                         ControlState gate_radius)
  1009.                                                                 ^
  1010. In file included from /home/mrturcot/mitch/builds/dolphin-emu-git/src/dolphin-emu/Source/Core/InputCommon/ControllerEmu/ControlGroup/AnalogStick.h:7,
  1011.                  from /home/mrturcot/mitch/builds/dolphin-emu-git/src/dolphin-emu/Source/Core/InputCommon/ControllerEmu/ControlGroup/AnalogStick.cpp:5:
  1012. /home/mrturcot/mitch/builds/dolphin-emu-git/src/dolphin-emu/Source/Core/InputCommon/ControllerEmu/ControlGroup/ControlGroup.h:50:21: note: shadowed declaration is here
  1013.    const std::string ui_name;
  1014.                      ^~~~~~~
  1015. /home/mrturcot/mitch/builds/dolphin-emu-git/src/dolphin-emu/Source/Core/InputCommon/ControllerEmu/ControlGroup/AnalogStick.cpp:65:64: warning: declaration of ‘name’ shadows a member of ‘ControllerEmu::OctagonAnalogStick’ [-Wshadow]
  1016.                                         ControlState gate_radius)
  1017.                                                                 ^
  1018. In file included from /home/mrturcot/mitch/builds/dolphin-emu-git/src/dolphin-emu/Source/Core/InputCommon/ControllerEmu/ControlGroup/AnalogStick.h:7,
  1019.                  from /home/mrturcot/mitch/builds/dolphin-emu-git/src/dolphin-emu/Source/Core/InputCommon/ControllerEmu/ControlGroup/AnalogStick.cpp:5:
  1020. /home/mrturcot/mitch/builds/dolphin-emu-git/src/dolphin-emu/Source/Core/InputCommon/ControllerEmu/ControlGroup/ControlGroup.h:49:21: note: shadowed declaration is here
  1021.    const std::string name;
  1022.                      ^~~~
  1023. [ 26%] Building CXX object Source/Core/UICommon/CMakeFiles/uicommon.dir/GameFile.cpp.o
  1024. [ 26%] Building CXX object Source/Core/InputCommon/CMakeFiles/inputcommon.dir/ControllerEmu/ControlGroup/Force.cpp.o
  1025. [ 26%] Building CXX object Source/Core/UICommon/CMakeFiles/uicommon.dir/GameFileCache.cpp.o
  1026. [ 26%] Linking CXX static library libglslang.a
  1027. [ 26%] Building CXX object Source/Core/UICommon/CMakeFiles/uicommon.dir/ResourcePack/Manager.cpp.o
  1028. [ 26%] Built target glslang
  1029. [ 26%] Building CXX object Source/Core/UICommon/CMakeFiles/uicommon.dir/ResourcePack/Manifest.cpp.o
  1030. [ 27%] Building CXX object Source/Core/UICommon/CMakeFiles/uicommon.dir/ResourcePack/ResourcePack.cpp.o
  1031. [ 27%] Building CXX object Source/Core/InputCommon/CMakeFiles/inputcommon.dir/ControllerEmu/ControlGroup/MixedTriggers.cpp.o
  1032. [ 27%] Building CXX object Source/Core/InputCommon/CMakeFiles/inputcommon.dir/ControllerEmu/ControlGroup/ModifySettingsButton.cpp.o
  1033. [ 27%] Building CXX object Source/Core/InputCommon/CMakeFiles/inputcommon.dir/ControllerEmu/ControlGroup/Slider.cpp.o
  1034. [ 27%] Building CXX object Source/Core/InputCommon/CMakeFiles/inputcommon.dir/ControllerEmu/ControlGroup/Tilt.cpp.o
  1035. [ 27%] Building CXX object Source/Core/UICommon/CMakeFiles/uicommon.dir/UICommon.cpp.o
  1036. [ 27%] Building CXX object Source/Core/UICommon/CMakeFiles/uicommon.dir/USBUtils.cpp.o
  1037. /home/mrturcot/mitch/builds/dolphin-emu-git/src/dolphin-emu/Source/Core/UICommon/ResourcePack/Manager.cpp:23:9: warning: no previous declaration for ‘IniFile ResourcePack::GetPackConfig()’ [-Wmissing-declarations]
  1038.  IniFile GetPackConfig()
  1039.          ^~~~~~~~~~~~~
  1040. [ 27%] Building CXX object Source/Core/UICommon/CMakeFiles/uicommon.dir/VideoUtils.cpp.o
  1041. [ 27%] Building CXX object Source/Core/InputCommon/CMakeFiles/inputcommon.dir/ControllerEmu/ControlGroup/Triggers.cpp.o
  1042. [ 28%] Building CXX object Source/Core/InputCommon/CMakeFiles/inputcommon.dir/ControllerEmu/Setting/BooleanSetting.cpp.o
  1043. [ 28%] Building CXX object Source/Core/InputCommon/CMakeFiles/inputcommon.dir/ControllerEmu/Setting/NumericSetting.cpp.o
  1044. [ 28%] Building CXX object Source/Core/UICommon/CMakeFiles/uicommon.dir/X11Utils.cpp.o
  1045. [ 28%] Building CXX object Source/Core/InputCommon/CMakeFiles/inputcommon.dir/ControllerInterface/ControllerInterface.cpp.o
  1046. [ 28%] Building CXX object Source/Core/InputCommon/CMakeFiles/inputcommon.dir/ControllerInterface/Device.cpp.o
  1047. [ 28%] Building CXX object Source/Core/InputCommon/CMakeFiles/inputcommon.dir/ControlReference/ControlReference.cpp.o
  1048. [ 28%] Building CXX object Source/Core/InputCommon/CMakeFiles/inputcommon.dir/ControlReference/ExpressionParser.cpp.o
  1049. [ 28%] Building CXX object Source/Core/InputCommon/CMakeFiles/inputcommon.dir/ControllerInterface/Xlib/XInput2.cpp.o
  1050. [ 28%] Building CXX object Source/Core/InputCommon/CMakeFiles/inputcommon.dir/GCAdapter.cpp.o
  1051. [ 29%] Building CXX object Source/Core/InputCommon/CMakeFiles/inputcommon.dir/ControllerInterface/evdev/evdev.cpp.o
  1052. [ 29%] Building CXX object Source/Core/InputCommon/CMakeFiles/inputcommon.dir/ControllerInterface/Pipes/Pipes.cpp.o
  1053. [ 29%] Linking CXX static library libuicommon.a
  1054. [ 29%] Built target uicommon
  1055. [ 29%] Linking CXX static library libinputcommon.a
  1056. [ 29%] Built target inputcommon
  1057. Scanning dependencies of target videovulkan
  1058. [ 29%] Building CXX object Source/Core/VideoBackends/Vulkan/CMakeFiles/videovulkan.dir/ObjectCache.cpp.o
  1059. [ 29%] Building CXX object Source/Core/VideoBackends/Vulkan/CMakeFiles/videovulkan.dir/CommandBufferManager.cpp.o
  1060. [ 29%] Building CXX object Source/Core/VideoBackends/Vulkan/CMakeFiles/videovulkan.dir/BoundingBox.cpp.o
  1061. [ 29%] Building CXX object Source/Core/VideoBackends/Vulkan/CMakeFiles/videovulkan.dir/PerfQuery.cpp.o
  1062. [ 30%] Building CXX object Source/Core/VideoBackends/Vulkan/CMakeFiles/videovulkan.dir/Renderer.cpp.o
  1063. [ 30%] Building CXX object Source/Core/VideoBackends/Vulkan/CMakeFiles/videovulkan.dir/ShaderCompiler.cpp.o
  1064. [ 30%] Building CXX object Source/Core/VideoBackends/Vulkan/CMakeFiles/videovulkan.dir/StateTracker.cpp.o
  1065. [ 30%] Building CXX object Source/Core/VideoBackends/Vulkan/CMakeFiles/videovulkan.dir/StagingBuffer.cpp.o
  1066. [ 30%] Building CXX object Source/Core/VideoBackends/Vulkan/CMakeFiles/videovulkan.dir/StreamBuffer.cpp.o
  1067. [ 30%] Building CXX object Source/Core/VideoBackends/Vulkan/CMakeFiles/videovulkan.dir/SwapChain.cpp.o
  1068. [ 30%] Building CXX object Source/Core/VideoBackends/Vulkan/CMakeFiles/videovulkan.dir/VertexFormat.cpp.o
  1069. [ 30%] Building CXX object Source/Core/VideoBackends/Vulkan/CMakeFiles/videovulkan.dir/VertexManager.cpp.o
  1070. [ 31%] Building CXX object Source/Core/VideoBackends/Vulkan/CMakeFiles/videovulkan.dir/VKPipeline.cpp.o
  1071. [ 31%] Building CXX object Source/Core/VideoBackends/Vulkan/CMakeFiles/videovulkan.dir/VKShader.cpp.o
  1072. [ 31%] Building CXX object Source/Core/VideoBackends/Vulkan/CMakeFiles/videovulkan.dir/VKTexture.cpp.o
  1073. [ 31%] Building CXX object Source/Core/VideoBackends/Vulkan/CMakeFiles/videovulkan.dir/VulkanContext.cpp.o
  1074. [ 31%] Building CXX object Source/Core/VideoBackends/Vulkan/CMakeFiles/videovulkan.dir/VulkanLoader.cpp.o
  1075. [ 31%] Building CXX object Source/Core/VideoBackends/Vulkan/CMakeFiles/videovulkan.dir/main.cpp.o
  1076. [ 31%] Linking CXX static library libvideovulkan.a
  1077. [ 31%] Built target videovulkan
  1078. Scanning dependencies of target videosoftware
  1079. [ 32%] Building CXX object Source/Core/VideoBackends/Software/CMakeFiles/videosoftware.dir/DebugUtil.cpp.o
  1080. [ 32%] Building CXX object Source/Core/VideoBackends/Software/CMakeFiles/videosoftware.dir/EfbInterface.cpp.o
  1081. [ 32%] Building CXX object Source/Core/VideoBackends/Software/CMakeFiles/videosoftware.dir/Clipper.cpp.o
  1082. [ 32%] Building CXX object Source/Core/VideoBackends/Software/CMakeFiles/videosoftware.dir/EfbCopy.cpp.o
  1083. [ 32%] Building CXX object Source/Core/VideoBackends/Software/CMakeFiles/videosoftware.dir/Rasterizer.cpp.o
  1084. [ 32%] Building CXX object Source/Core/VideoBackends/Software/CMakeFiles/videosoftware.dir/SWOGLWindow.cpp.o
  1085. [ 32%] Building CXX object Source/Core/VideoBackends/Software/CMakeFiles/videosoftware.dir/SWRenderer.cpp.o
  1086. [ 32%] Building CXX object Source/Core/VideoBackends/Software/CMakeFiles/videosoftware.dir/SWTexture.cpp.o
  1087. [ 32%] Building CXX object Source/Core/VideoBackends/Software/CMakeFiles/videosoftware.dir/SWVertexLoader.cpp.o
  1088. [ 32%] Building CXX object Source/Core/VideoBackends/Software/CMakeFiles/videosoftware.dir/SWmain.cpp.o
  1089. [ 32%] Building CXX object Source/Core/VideoBackends/Software/CMakeFiles/videosoftware.dir/SetupUnit.cpp.o
  1090. [ 32%] Building CXX object Source/Core/VideoBackends/Software/CMakeFiles/videosoftware.dir/Tev.cpp.o
  1091. [ 33%] Building CXX object Source/Core/VideoBackends/Software/CMakeFiles/videosoftware.dir/TextureEncoder.cpp.o
  1092. [ 33%] Building CXX object Source/Core/VideoBackends/Software/CMakeFiles/videosoftware.dir/TextureSampler.cpp.o
  1093. [ 33%] Building CXX object Source/Core/VideoBackends/Software/CMakeFiles/videosoftware.dir/TransformUnit.cpp.o
  1094. /home/mrturcot/mitch/builds/dolphin-emu-git/src/dolphin-emu/Source/Core/VideoBackends/Software/SetupUnit.cpp: In member function ‘OutputVertexData* SetupUnit::GetVertex()’:
  1095. /home/mrturcot/mitch/builds/dolphin-emu-git/src/dolphin-emu/Source/Core/VideoBackends/Software/SetupUnit.cpp:28:60: warning: ‘void* memset(void*, int, size_t)’ clearing an object of non-trivial type ‘struct OutputVertexData’; use assignment or value-initialization instead [-Wclass-memaccess]
  1096.    memset(m_VertWritePointer, 0, sizeof(*m_VertWritePointer));
  1097.                                                             ^
  1098. In file included from /home/mrturcot/mitch/builds/dolphin-emu-git/src/dolphin-emu/Source/Core/VideoBackends/Software/SetupUnit.h:8,
  1099.                  from /home/mrturcot/mitch/builds/dolphin-emu-git/src/dolphin-emu/Source/Core/VideoBackends/Software/SetupUnit.cpp:7:
  1100. /home/mrturcot/mitch/builds/dolphin-emu-git/src/dolphin-emu/Source/Core/VideoBackends/Software/NativeVertexFormat.h:32:8: note: ‘struct OutputVertexData’ declared here
  1101.  struct OutputVertexData
  1102.         ^~~~~~~~~~~~~~~~
  1103. [ 33%] Linking CXX static library libvideosoftware.a
  1104. [ 33%] Built target videosoftware
  1105. Scanning dependencies of target videonull
  1106. [ 33%] Building CXX object Source/Core/VideoBackends/Null/CMakeFiles/videonull.dir/NullBackend.cpp.o
  1107. [ 33%] Building CXX object Source/Core/VideoBackends/Null/CMakeFiles/videonull.dir/VertexManager.cpp.o
  1108. [ 33%] Building CXX object Source/Core/VideoBackends/Null/CMakeFiles/videonull.dir/Render.cpp.o
  1109. [ 33%] Building CXX object Source/Core/VideoBackends/Null/CMakeFiles/videonull.dir/NullTexture.cpp.o
  1110. [ 33%] Linking CXX static library libvideonull.a
  1111. [ 33%] Built target videonull
  1112. Scanning dependencies of target videoogl
  1113. [ 34%] Building CXX object Source/Core/VideoBackends/OGL/CMakeFiles/videoogl.dir/BoundingBox.cpp.o
  1114. [ 34%] Building CXX object Source/Core/VideoBackends/OGL/CMakeFiles/videoogl.dir/OGLShader.cpp.o
  1115. [ 34%] Building CXX object Source/Core/VideoBackends/OGL/CMakeFiles/videoogl.dir/NativeVertexFormat.cpp.o
  1116. [ 34%] Building CXX object Source/Core/VideoBackends/OGL/CMakeFiles/videoogl.dir/OGLPipeline.cpp.o
  1117. [ 34%] Building CXX object Source/Core/VideoBackends/OGL/CMakeFiles/videoogl.dir/main.cpp.o
  1118. [ 34%] Building CXX object Source/Core/VideoBackends/OGL/CMakeFiles/videoogl.dir/OGLTexture.cpp.o
  1119. [ 34%] Building CXX object Source/Core/VideoBackends/OGL/CMakeFiles/videoogl.dir/PerfQuery.cpp.o
  1120. [ 34%] Building CXX object Source/Core/VideoBackends/OGL/CMakeFiles/videoogl.dir/ProgramShaderCache.cpp.o
  1121. [ 35%] Building CXX object Source/Core/VideoBackends/OGL/CMakeFiles/videoogl.dir/Render.cpp.o
  1122. [ 35%] Building CXX object Source/Core/VideoBackends/OGL/CMakeFiles/videoogl.dir/SamplerCache.cpp.o
  1123. [ 35%] Building CXX object Source/Core/VideoBackends/OGL/CMakeFiles/videoogl.dir/StreamBuffer.cpp.o
  1124. [ 35%] Building CXX object Source/Core/VideoBackends/OGL/CMakeFiles/videoogl.dir/VertexManager.cpp.o
  1125. [ 35%] Linking CXX static library libvideoogl.a
  1126. [ 35%] Built target videoogl
  1127. Scanning dependencies of target videocommon
  1128. [ 36%] Building CXX object Source/Core/VideoCommon/CMakeFiles/videocommon.dir/AbstractFramebuffer.cpp.o
  1129. [ 36%] Building CXX object Source/Core/VideoCommon/CMakeFiles/videocommon.dir/AbstractTexture.cpp.o
  1130. [ 36%] Building CXX object Source/Core/VideoCommon/CMakeFiles/videocommon.dir/AsyncShaderCompiler.cpp.o
  1131. [ 36%] Building CXX object Source/Core/VideoCommon/CMakeFiles/videocommon.dir/AbstractStagingTexture.cpp.o
  1132. [ 36%] Building CXX object Source/Core/VideoCommon/CMakeFiles/videocommon.dir/AsyncRequests.cpp.o
  1133. [ 36%] Building CXX object Source/Core/VideoCommon/CMakeFiles/videocommon.dir/BoundingBox.cpp.o
  1134. [ 36%] Building CXX object Source/Core/VideoCommon/CMakeFiles/videocommon.dir/BPFunctions.cpp.o
  1135. [ 36%] Building CXX object Source/Core/VideoCommon/CMakeFiles/videocommon.dir/BPMemory.cpp.o
  1136. [ 36%] Building CXX object Source/Core/VideoCommon/CMakeFiles/videocommon.dir/BPStructs.cpp.o
  1137. [ 38%] Building CXX object Source/Core/VideoCommon/CMakeFiles/videocommon.dir/CPMemory.cpp.o
  1138. [ 38%] Building CXX object Source/Core/VideoCommon/CMakeFiles/videocommon.dir/CommandProcessor.cpp.o
  1139. [ 38%] Building CXX object Source/Core/VideoCommon/CMakeFiles/videocommon.dir/DriverDetails.cpp.o
  1140. [ 38%] Building CXX object Source/Core/VideoCommon/CMakeFiles/videocommon.dir/Fifo.cpp.o
  1141. [ 38%] Building CXX object Source/Core/VideoCommon/CMakeFiles/videocommon.dir/FPSCounter.cpp.o
  1142. [ 38%] Building CXX object Source/Core/VideoCommon/CMakeFiles/videocommon.dir/FramebufferManager.cpp.o
  1143. [ 38%] Building CXX object Source/Core/VideoCommon/CMakeFiles/videocommon.dir/FramebufferShaderGen.cpp.o
  1144. [ 38%] Building CXX object Source/Core/VideoCommon/CMakeFiles/videocommon.dir/GeometryShaderGen.cpp.o
  1145. [ 39%] Building CXX object Source/Core/VideoCommon/CMakeFiles/videocommon.dir/GeometryShaderManager.cpp.o
  1146. [ 39%] Building CXX object Source/Core/VideoCommon/CMakeFiles/videocommon.dir/HiresTextures.cpp.o
  1147. [ 39%] Building CXX object Source/Core/VideoCommon/CMakeFiles/videocommon.dir/HiresTextures_DDSLoader.cpp.o
  1148. [ 39%] Building CXX object Source/Core/VideoCommon/CMakeFiles/videocommon.dir/ImageWrite.cpp.o
  1149. /home/mrturcot/mitch/builds/dolphin-emu-git/src/dolphin-emu/Source/Core/VideoCommon/BPStructs.cpp: In function ‘void BPInit()’:
  1150. /home/mrturcot/mitch/builds/dolphin-emu-git/src/dolphin-emu/Source/Core/VideoCommon/BPStructs.cpp:43:34: warning: ‘void* memset(void*, int, size_t)’ clearing an object of type ‘struct BPMemory’ with no trivial copy-assignment; use value-initialization instead [-Wclass-memaccess]
  1151.    memset(&bpmem, 0, sizeof(bpmem));
  1152.                                   ^
  1153. In file included from /home/mrturcot/mitch/builds/dolphin-emu-git/src/dolphin-emu/Source/Core/VideoCommon/BPStructs.cpp:22:
  1154. /home/mrturcot/mitch/builds/dolphin-emu-git/src/dolphin-emu/Source/Core/VideoCommon/BPMemory.h:1030:8: note: ‘struct BPMemory’ declared here
  1155.  struct BPMemory
  1156.         ^~~~~~~~
  1157. [ 39%] Building CXX object Source/Core/VideoCommon/CMakeFiles/videocommon.dir/IndexGenerator.cpp.o
  1158. [ 39%] Building CXX object Source/Core/VideoCommon/CMakeFiles/videocommon.dir/LightingShaderGen.cpp.o
  1159. [ 39%] Building CXX object Source/Core/VideoCommon/CMakeFiles/videocommon.dir/OnScreenDisplay.cpp.o
  1160. [ 39%] Building CXX object Source/Core/VideoCommon/CMakeFiles/videocommon.dir/OpcodeDecoding.cpp.o
  1161. [ 39%] Building CXX object Source/Core/VideoCommon/CMakeFiles/videocommon.dir/PerfQueryBase.cpp.o
  1162. [ 40%] Building CXX object Source/Core/VideoCommon/CMakeFiles/videocommon.dir/PixelEngine.cpp.o
  1163. [ 40%] Building CXX object Source/Core/VideoCommon/CMakeFiles/videocommon.dir/PixelShaderGen.cpp.o
  1164. [ 40%] Building CXX object Source/Core/VideoCommon/CMakeFiles/videocommon.dir/PixelShaderManager.cpp.o
  1165. [ 40%] Building CXX object Source/Core/VideoCommon/CMakeFiles/videocommon.dir/PostProcessing.cpp.o
  1166. [ 40%] Building CXX object Source/Core/VideoCommon/CMakeFiles/videocommon.dir/RenderBase.cpp.o
  1167. [ 40%] Building CXX object Source/Core/VideoCommon/CMakeFiles/videocommon.dir/RenderState.cpp.o
  1168. [ 40%] Building CXX object Source/Core/VideoCommon/CMakeFiles/videocommon.dir/ShaderCache.cpp.o
  1169. [ 40%] Building CXX object Source/Core/VideoCommon/CMakeFiles/videocommon.dir/ShaderGenCommon.cpp.o
  1170. [ 41%] Building CXX object Source/Core/VideoCommon/CMakeFiles/videocommon.dir/Statistics.cpp.o
  1171. [ 41%] Building CXX object Source/Core/VideoCommon/CMakeFiles/videocommon.dir/UberShaderCommon.cpp.o
  1172. [ 41%] Building CXX object Source/Core/VideoCommon/CMakeFiles/videocommon.dir/UberShaderPixel.cpp.o
  1173. [ 41%] Building CXX object Source/Core/VideoCommon/CMakeFiles/videocommon.dir/UberShaderVertex.cpp.o
  1174. [ 41%] Building CXX object Source/Core/VideoCommon/CMakeFiles/videocommon.dir/TextureCacheBase.cpp.o
  1175. [ 41%] Building CXX object Source/Core/VideoCommon/CMakeFiles/videocommon.dir/TextureConfig.cpp.o
  1176. [ 41%] Building CXX object Source/Core/VideoCommon/CMakeFiles/videocommon.dir/TextureConversionShader.cpp.o
  1177. [ 41%] Building CXX object Source/Core/VideoCommon/CMakeFiles/videocommon.dir/TextureConverterShaderGen.cpp.o
  1178. [ 42%] Building CXX object Source/Core/VideoCommon/CMakeFiles/videocommon.dir/TextureDecoder_Common.cpp.o
  1179. [ 42%] Building CXX object Source/Core/VideoCommon/CMakeFiles/videocommon.dir/VertexLoader.cpp.o
  1180. [ 42%] Building CXX object Source/Core/VideoCommon/CMakeFiles/videocommon.dir/VertexLoaderBase.cpp.o
  1181. [ 42%] Building CXX object Source/Core/VideoCommon/CMakeFiles/videocommon.dir/VertexLoaderManager.cpp.o
  1182. [ 42%] Building CXX object Source/Core/VideoCommon/CMakeFiles/videocommon.dir/VertexLoader_Color.cpp.o
  1183. [ 42%] Building CXX object Source/Core/VideoCommon/CMakeFiles/videocommon.dir/VertexLoader_Normal.cpp.o
  1184. [ 42%] Building CXX object Source/Core/VideoCommon/CMakeFiles/videocommon.dir/VertexLoader_Position.cpp.o
  1185. [ 42%] Building CXX object Source/Core/VideoCommon/CMakeFiles/videocommon.dir/VertexLoader_TextCoord.cpp.o
  1186. [ 43%] Building CXX object Source/Core/VideoCommon/CMakeFiles/videocommon.dir/VertexManagerBase.cpp.o
  1187. [ 43%] Building CXX object Source/Core/VideoCommon/CMakeFiles/videocommon.dir/VertexShaderGen.cpp.o
  1188. [ 43%] Building CXX object Source/Core/VideoCommon/CMakeFiles/videocommon.dir/VertexShaderManager.cpp.o
  1189. [ 43%] Building CXX object Source/Core/VideoCommon/CMakeFiles/videocommon.dir/VideoBackendBase.cpp.o
  1190. [ 43%] Building CXX object Source/Core/VideoCommon/CMakeFiles/videocommon.dir/VideoConfig.cpp.o
  1191. [ 43%] Building CXX object Source/Core/VideoCommon/CMakeFiles/videocommon.dir/VideoState.cpp.o
  1192. [ 43%] Building CXX object Source/Core/VideoCommon/CMakeFiles/videocommon.dir/XFMemory.cpp.o
  1193. [ 43%] Building CXX object Source/Core/VideoCommon/CMakeFiles/videocommon.dir/XFStructs.cpp.o
  1194. [ 43%] Building CXX object Source/Core/VideoCommon/CMakeFiles/videocommon.dir/TextureDecoder_x64.cpp.o
  1195. [ 44%] Building CXX object Source/Core/VideoCommon/CMakeFiles/videocommon.dir/VertexLoaderX64.cpp.o
  1196. [ 44%] Building CXX object Source/Core/VideoCommon/CMakeFiles/videocommon.dir/AVIDump.cpp.o
  1197. /home/mrturcot/mitch/builds/dolphin-emu-git/src/dolphin-emu/Source/Core/VideoCommon/VideoBackendBase.cpp: In member function ‘void VideoBackendBase::InitializeShared()’:
  1198. /home/mrturcot/mitch/builds/dolphin-emu-git/src/dolphin-emu/Source/Core/VideoCommon/VideoBackendBase.cpp:277:54: warning: ‘void* memset(void*, int, size_t)’ clearing an object of non-trivial type ‘struct CPState’; use assignment or value-initialization instead [-Wclass-memaccess]
  1199.    memset(&g_main_cp_state, 0, sizeof(g_main_cp_state));
  1200.                                                       ^
  1201. In file included from /home/mrturcot/mitch/builds/dolphin-emu-git/src/dolphin-emu/Source/Core/VideoCommon/VideoBackendBase.cpp:32:
  1202. /home/mrturcot/mitch/builds/dolphin-emu-git/src/dolphin-emu/Source/Core/VideoCommon/CPMemory.h:243:8: note: ‘struct CPState’ declared here
  1203.  struct CPState final
  1204.         ^~~~~~~
  1205. /home/mrturcot/mitch/builds/dolphin-emu-git/src/dolphin-emu/Source/Core/VideoCommon/VideoBackendBase.cpp:278:66: warning: ‘void* memset(void*, int, size_t)’ clearing an object of non-trivial type ‘struct CPState’; use assignment or value-initialization instead [-Wclass-memaccess]
  1206.    memset(&g_preprocess_cp_state, 0, sizeof(g_preprocess_cp_state));
  1207.                                                                   ^
  1208. In file included from /home/mrturcot/mitch/builds/dolphin-emu-git/src/dolphin-emu/Source/Core/VideoCommon/VideoBackendBase.cpp:32:
  1209. /home/mrturcot/mitch/builds/dolphin-emu-git/src/dolphin-emu/Source/Core/VideoCommon/CPMemory.h:243:8: note: ‘struct CPState’ declared here
  1210.  struct CPState final
  1211.         ^~~~~~~
  1212. [ 44%] Linking CXX static library libvideocommon.a
  1213. [ 44%] Built target videocommon
  1214. Scanning dependencies of target core
  1215. [ 44%] Building CXX object Source/Core/Core/CMakeFiles/core.dir/ActionReplay.cpp.o
  1216. [ 44%] Building CXX object Source/Core/Core/CMakeFiles/core.dir/Analytics.cpp.o
  1217. [ 44%] Building CXX object Source/Core/Core/CMakeFiles/core.dir/ARDecrypt.cpp.o
  1218. [ 44%] Building CXX object Source/Core/Core/CMakeFiles/core.dir/BootManager.cpp.o
  1219. [ 44%] Building CXX object Source/Core/Core/CMakeFiles/core.dir/Core.cpp.o
  1220. [ 44%] Building CXX object Source/Core/Core/CMakeFiles/core.dir/ConfigManager.cpp.o
  1221. [ 45%] Building CXX object Source/Core/Core/CMakeFiles/core.dir/DSPEmulator.cpp.o
  1222. [ 45%] Building CXX object Source/Core/Core/CMakeFiles/core.dir/CoreTiming.cpp.o
  1223. [ 45%] Building CXX object Source/Core/Core/CMakeFiles/core.dir/GeckoCodeConfig.cpp.o
  1224. [ 45%] Building CXX object Source/Core/Core/CMakeFiles/core.dir/GeckoCode.cpp.o
  1225. [ 45%] Building CXX object Source/Core/Core/CMakeFiles/core.dir/HotkeyManager.cpp.o
  1226. [ 45%] Building CXX object Source/Core/Core/CMakeFiles/core.dir/MemTools.cpp.o
  1227. [ 45%] Building CXX object Source/Core/Core/CMakeFiles/core.dir/Movie.cpp.o
  1228. [ 45%] Building CXX object Source/Core/Core/CMakeFiles/core.dir/NetPlayClient.cpp.o
  1229. [ 46%] Building CXX object Source/Core/Core/CMakeFiles/core.dir/NetPlayServer.cpp.o
  1230. [ 46%] Building CXX object Source/Core/Core/CMakeFiles/core.dir/PatchEngine.cpp.o
  1231. [ 46%] Building CXX object Source/Core/Core/CMakeFiles/core.dir/State.cpp.o
  1232. [ 46%] Building CXX object Source/Core/Core/CMakeFiles/core.dir/SysConf.cpp.o
  1233. [ 46%] Building CXX object Source/Core/Core/CMakeFiles/core.dir/TitleDatabase.cpp.o
  1234. [ 46%] Building CXX object Source/Core/Core/CMakeFiles/core.dir/WiiRoot.cpp.o
  1235. [ 46%] Building CXX object Source/Core/Core/CMakeFiles/core.dir/WiiUtils.cpp.o
  1236. [ 46%] Building CXX object Source/Core/Core/CMakeFiles/core.dir/Boot/Boot_BS2Emu.cpp.o
  1237. [ 46%] Building CXX object Source/Core/Core/CMakeFiles/core.dir/Boot/Boot.cpp.o
  1238. /home/mrturcot/mitch/builds/dolphin-emu-git/src/dolphin-emu/Source/Core/Core/State.cpp: In function ‘void State::CompressAndDumpState(State::CompressAndDumpState_args)’:
  1239. /home/mrturcot/mitch/builds/dolphin-emu-git/src/dolphin-emu/Source/Core/Core/State.cpp:340:10: warning: ‘char* strncpy(char*, const char*, size_t)’ specified bound 6 equals destination size [-Wstringop-truncation]
  1240.    strncpy(header.gameID, SConfig::GetInstance().GetGameID().c_str(), 6);
  1241.    ~~~~~~~^~~~~~~~~~~~~~~~~~~~~~~~~~~~~~~~~~~~~~~~~~~~~~~~~~~~~~~~~~~~~~
  1242. [ 47%] Building CXX object Source/Core/Core/CMakeFiles/core.dir/Boot/Boot_WiiWAD.cpp.o
  1243. [ 47%] Building CXX object Source/Core/Core/CMakeFiles/core.dir/Boot/DolReader.cpp.o
  1244. [ 47%] Building CXX object Source/Core/Core/CMakeFiles/core.dir/Boot/ElfReader.cpp.o
  1245. [ 47%] Building CXX object Source/Core/Core/CMakeFiles/core.dir/Config/GraphicsSettings.cpp.o
  1246. In file included from /home/mrturcot/mitch/builds/dolphin-emu-git/src/dolphin-emu/Source/Core/Core/Boot/Boot.h:19,
  1247.                  from /home/mrturcot/mitch/builds/dolphin-emu-git/src/dolphin-emu/Source/Core/Core/Boot/Boot_BS2Emu.cpp:17:
  1248. /home/mrturcot/mitch/builds/dolphin-emu-git/src/dolphin-emu/Source/Core/DiscIO/Volume.h: In static member function ‘static bool CBoot::RunApploader(bool, const DiscIO::Volume&)’:
  1249. /home/mrturcot/mitch/builds/dolphin-emu-git/src/dolphin-emu/Source/Core/DiscIO/Volume.h:52:15: warning: ‘<anonymous>’ may be used uninitialized in this function [-Wmaybe-uninitialized]
  1250.        return {};
  1251.                ^
  1252. /home/mrturcot/mitch/builds/dolphin-emu-git/src/dolphin-emu/Source/Core/DiscIO/Volume.h:52:15: warning: ‘<anonymous>’ may be used uninitialized in this function [-Wmaybe-uninitialized]
  1253.        return {};
  1254.                ^
  1255. /home/mrturcot/mitch/builds/dolphin-emu-git/src/dolphin-emu/Source/Core/DiscIO/Volume.h:52:15: warning: ‘<anonymous>’ may be used uninitialized in this function [-Wmaybe-uninitialized]
  1256.        return {};
  1257.                ^
  1258. [ 47%] Building CXX object Source/Core/Core/CMakeFiles/core.dir/Config/MainSettings.cpp.o
  1259. [ 47%] Building CXX object Source/Core/Core/CMakeFiles/core.dir/Config/NetplaySettings.cpp.o
  1260. [ 47%] Building CXX object Source/Core/Core/CMakeFiles/core.dir/Config/SYSCONFSettings.cpp.o
  1261. [ 47%] Building CXX object Source/Core/Core/CMakeFiles/core.dir/Config/UISettings.cpp.o
  1262. [ 48%] Building CXX object Source/Core/Core/CMakeFiles/core.dir/Config/WiimoteInputSettings.cpp.o
  1263. [ 48%] Building CXX object Source/Core/Core/CMakeFiles/core.dir/ConfigLoaders/BaseConfigLoader.cpp.o
  1264. [ 48%] Building CXX object Source/Core/Core/CMakeFiles/core.dir/ConfigLoaders/GameConfigLoader.cpp.o
  1265. [ 48%] Building CXX object Source/Core/Core/CMakeFiles/core.dir/ConfigLoaders/IsSettingSaveable.cpp.o
  1266. [ 48%] Building CXX object Source/Core/Core/CMakeFiles/core.dir/ConfigLoaders/MovieConfigLoader.cpp.o
  1267. [ 48%] Building CXX object Source/Core/Core/CMakeFiles/core.dir/ConfigLoaders/NetPlayConfigLoader.cpp.o
  1268. [ 48%] Building CXX object Source/Core/Core/CMakeFiles/core.dir/Debugger/Debugger_SymbolMap.cpp.o
  1269. [ 48%] Building CXX object Source/Core/Core/CMakeFiles/core.dir/Debugger/Dump.cpp.o
  1270. [ 50%] Building CXX object Source/Core/Core/CMakeFiles/core.dir/Debugger/PPCDebugInterface.cpp.o
  1271. [ 50%] Building CXX object Source/Core/Core/CMakeFiles/core.dir/Debugger/RSO.cpp.o
  1272. [ 50%] Building CXX object Source/Core/Core/CMakeFiles/core.dir/DSP/DSPAccelerator.cpp.o
  1273. [ 50%] Building CXX object Source/Core/Core/CMakeFiles/core.dir/DSP/DSPAnalyzer.cpp.o
  1274. [ 50%] Building CXX object Source/Core/Core/CMakeFiles/core.dir/DSP/DSPAssembler.cpp.o
  1275. [ 50%] Building CXX object Source/Core/Core/CMakeFiles/core.dir/DSP/DSPCaptureLogger.cpp.o
  1276. [ 50%] Building CXX object Source/Core/Core/CMakeFiles/core.dir/DSP/DSPCodeUtil.cpp.o
  1277. [ 50%] Building CXX object Source/Core/Core/CMakeFiles/core.dir/DSP/DSPCore.cpp.o
  1278. [ 51%] Building CXX object Source/Core/Core/CMakeFiles/core.dir/DSP/DSPDisassembler.cpp.o
  1279. [ 51%] Building CXX object Source/Core/Core/CMakeFiles/core.dir/DSP/DSPHWInterface.cpp.o
  1280. [ 51%] Building CXX object Source/Core/Core/CMakeFiles/core.dir/DSP/DSPMemoryMap.cpp.o
  1281. [ 51%] Building CXX object Source/Core/Core/CMakeFiles/core.dir/DSP/DSPStacks.cpp.o
  1282. [ 51%] Building CXX object Source/Core/Core/CMakeFiles/core.dir/DSP/DSPTables.cpp.o
  1283. [ 51%] Building CXX object Source/Core/Core/CMakeFiles/core.dir/DSP/LabelMap.cpp.o
  1284. [ 51%] Building CXX object Source/Core/Core/CMakeFiles/core.dir/DSP/Interpreter/DSPIntArithmetic.cpp.o
  1285. [ 51%] Building CXX object Source/Core/Core/CMakeFiles/core.dir/DSP/Interpreter/DSPIntBranch.cpp.o
  1286. [ 51%] Building CXX object Source/Core/Core/CMakeFiles/core.dir/DSP/Interpreter/DSPIntCCUtil.cpp.o
  1287. [ 52%] Building CXX object Source/Core/Core/CMakeFiles/core.dir/DSP/Interpreter/DSPInterpreter.cpp.o
  1288. [ 52%] Building CXX object Source/Core/Core/CMakeFiles/core.dir/DSP/Interpreter/DSPIntExtOps.cpp.o
  1289. [ 52%] Building CXX object Source/Core/Core/CMakeFiles/core.dir/DSP/Interpreter/DSPIntLoadStore.cpp.o
  1290. [ 52%] Building CXX object Source/Core/Core/CMakeFiles/core.dir/DSP/Interpreter/DSPIntMisc.cpp.o
  1291. [ 52%] Building CXX object Source/Core/Core/CMakeFiles/core.dir/DSP/Interpreter/DSPIntMultiplier.cpp.o
  1292. [ 52%] Building CXX object Source/Core/Core/CMakeFiles/core.dir/DSP/Interpreter/DSPIntTables.cpp.o
  1293. [ 52%] Building CXX object Source/Core/Core/CMakeFiles/core.dir/DSP/Jit/DSPEmitterBase.cpp.o
  1294. [ 52%] Building CXX object Source/Core/Core/CMakeFiles/core.dir/FifoPlayer/FifoAnalyzer.cpp.o
  1295. [ 53%] Building CXX object Source/Core/Core/CMakeFiles/core.dir/FifoPlayer/FifoDataFile.cpp.o
  1296. [ 53%] Building CXX object Source/Core/Core/CMakeFiles/core.dir/FifoPlayer/FifoPlaybackAnalyzer.cpp.o
  1297. [ 53%] Building CXX object Source/Core/Core/CMakeFiles/core.dir/FifoPlayer/FifoPlayer.cpp.o
  1298. [ 53%] Building CXX object Source/Core/Core/CMakeFiles/core.dir/FifoPlayer/FifoRecordAnalyzer.cpp.o
  1299. [ 53%] Building CXX object Source/Core/Core/CMakeFiles/core.dir/FifoPlayer/FifoRecorder.cpp.o
  1300. [ 53%] Building CXX object Source/Core/Core/CMakeFiles/core.dir/HLE/HLE.cpp.o
  1301. [ 53%] Building CXX object Source/Core/Core/CMakeFiles/core.dir/HLE/HLE_Misc.cpp.o
  1302. [ 53%] Building CXX object Source/Core/Core/CMakeFiles/core.dir/HLE/HLE_OS.cpp.o
  1303. [ 54%] Building CXX object Source/Core/Core/CMakeFiles/core.dir/HLE/HLE_VarArgs.cpp.o
  1304. [ 54%] Building CXX object Source/Core/Core/CMakeFiles/core.dir/HW/AudioInterface.cpp.o
  1305. [ 54%] Building CXX object Source/Core/Core/CMakeFiles/core.dir/HW/CPU.cpp.o
  1306. [ 54%] Building CXX object Source/Core/Core/CMakeFiles/core.dir/HW/DSP.cpp.o
  1307. [ 54%] Building CXX object Source/Core/Core/CMakeFiles/core.dir/HW/DSPHLE/UCodes/AX.cpp.o
  1308. [ 54%] Building CXX object Source/Core/Core/CMakeFiles/core.dir/HW/DSPHLE/UCodes/AXWii.cpp.o
  1309. [ 54%] Building CXX object Source/Core/Core/CMakeFiles/core.dir/HW/DSPHLE/UCodes/CARD.cpp.o
  1310. [ 54%] Building CXX object Source/Core/Core/CMakeFiles/core.dir/HW/DSPHLE/UCodes/GBA.cpp.o
  1311. [ 55%] Building CXX object Source/Core/Core/CMakeFiles/core.dir/HW/DSPHLE/UCodes/INIT.cpp.o
  1312. [ 55%] Building CXX object Source/Core/Core/CMakeFiles/core.dir/HW/DSPHLE/UCodes/ROM.cpp.o
  1313. [ 55%] Building CXX object Source/Core/Core/CMakeFiles/core.dir/HW/DSPHLE/UCodes/UCodes.cpp.o
  1314. [ 55%] Building CXX object Source/Core/Core/CMakeFiles/core.dir/HW/DSPHLE/UCodes/Zelda.cpp.o
  1315. [ 55%] Building CXX object Source/Core/Core/CMakeFiles/core.dir/HW/DSPHLE/MailHandler.cpp.o
  1316. [ 55%] Building CXX object Source/Core/Core/CMakeFiles/core.dir/HW/DSPHLE/DSPHLE.cpp.o
  1317. [ 55%] Building CXX object Source/Core/Core/CMakeFiles/core.dir/HW/DSPLLE/DSPDebugInterface.cpp.o
  1318. [ 55%] Building CXX object Source/Core/Core/CMakeFiles/core.dir/HW/DSPLLE/DSPHost.cpp.o
  1319. [ 55%] Building CXX object Source/Core/Core/CMakeFiles/core.dir/HW/DSPLLE/DSPSymbols.cpp.o
  1320. [ 56%] Building CXX object Source/Core/Core/CMakeFiles/core.dir/HW/DSPLLE/DSPLLEGlobals.cpp.o
  1321. [ 56%] Building CXX object Source/Core/Core/CMakeFiles/core.dir/HW/DSPLLE/DSPLLE.cpp.o
  1322. [ 56%] Building CXX object Source/Core/Core/CMakeFiles/core.dir/HW/DVD/DVDInterface.cpp.o
  1323. [ 56%] Building CXX object Source/Core/Core/CMakeFiles/core.dir/HW/DVD/DVDMath.cpp.o
  1324. [ 56%] Building CXX object Source/Core/Core/CMakeFiles/core.dir/HW/DVD/DVDThread.cpp.o
  1325. [ 56%] Building CXX object Source/Core/Core/CMakeFiles/core.dir/HW/DVD/FileMonitor.cpp.o
  1326. [ 56%] Building CXX object Source/Core/Core/CMakeFiles/core.dir/HW/EXI/EXI_Channel.cpp.o
  1327. [ 56%] Building CXX object Source/Core/Core/CMakeFiles/core.dir/HW/EXI/EXI.cpp.o
  1328. [ 57%] Building CXX object Source/Core/Core/CMakeFiles/core.dir/HW/EXI/EXI_Device.cpp.o
  1329. [ 57%] Building CXX object Source/Core/Core/CMakeFiles/core.dir/HW/EXI/EXI_DeviceAD16.cpp.o
  1330. [ 57%] Building CXX object Source/Core/Core/CMakeFiles/core.dir/HW/EXI/EXI_DeviceAGP.cpp.o
  1331. [ 57%] Building CXX object Source/Core/Core/CMakeFiles/core.dir/HW/EXI/EXI_DeviceDummy.cpp.o
  1332. [ 57%] Building CXX object Source/Core/Core/CMakeFiles/core.dir/HW/EXI/EXI_DeviceEthernet.cpp.o
  1333. [ 57%] Building CXX object Source/Core/Core/CMakeFiles/core.dir/HW/EXI/EXI_DeviceGecko.cpp.o
  1334. [ 57%] Building CXX object Source/Core/Core/CMakeFiles/core.dir/HW/EXI/EXI_DeviceIPL.cpp.o
  1335. [ 57%] Building CXX object Source/Core/Core/CMakeFiles/core.dir/HW/EXI/EXI_DeviceMemoryCard.cpp.o
  1336. [ 58%] Building CXX object Source/Core/Core/CMakeFiles/core.dir/HW/EXI/EXI_DeviceMic.cpp.o
  1337. [ 58%] Building CXX object Source/Core/Core/CMakeFiles/core.dir/HW/GCKeyboard.cpp.o
  1338. [ 58%] Building CXX object Source/Core/Core/CMakeFiles/core.dir/HW/GCKeyboardEmu.cpp.o
  1339. [ 58%] Building CXX object Source/Core/Core/CMakeFiles/core.dir/HW/GCMemcard/GCMemcard.cpp.o
  1340. [ 58%] Building CXX object Source/Core/Core/CMakeFiles/core.dir/HW/GCMemcard/GCMemcardDirectory.cpp.o
  1341. [ 58%] Building CXX object Source/Core/Core/CMakeFiles/core.dir/HW/GCMemcard/GCMemcardRaw.cpp.o
  1342. [ 58%] Building CXX object Source/Core/Core/CMakeFiles/core.dir/HW/GCPad.cpp.o
  1343. [ 58%] Building CXX object Source/Core/Core/CMakeFiles/core.dir/HW/GCPadEmu.cpp.o
  1344. /home/mrturcot/mitch/builds/dolphin-emu-git/src/dolphin-emu/Source/Core/Core/HW/EXI/EXI_DeviceIPL.cpp: In member function ‘virtual void ExpansionInterface::CEXIIPL::TransferByte(u8&)’:
  1345. /home/mrturcot/mitch/builds/dolphin-emu-git/src/dolphin-emu/Source/Core/Core/HW/EXI/EXI_DeviceIPL.cpp:290:30: warning: comparison of unsigned expression >= 0 is always true [-Wtype-limits]
  1346.  #define IN_RANGE(x) (address >= x##_BASE && address < x##_BASE + x##_SIZE)
  1347.                       ~~~~~~~~^~~~~~~~~~~~~~~~~~~~~~~~~~~~~~~~~~~~~~~~~~~~~
  1348.  #define DEV_ADDR(x) (address - x##_BASE)
  1349.  ~~~~~~~~~~~~~~~~~~~~~~~~~~~~~~~~~~~~~~~~
  1350.  #define DEV_ADDR_CURSOR(x) (DEV_ADDR(x) + m_cursor++)
  1351.  ~~~~~~~~~~~~~~~~~~~~~~~~~~~~~~~~~~~~~~~~~~~~~~~~~~~~~
  1352.  
  1353.                                
  1354.      auto UartFifoAccess = [&]() {
  1355.      ~~~~~~~~~~~~~~~~~~~~~~~~~~~~~
  1356.        if (m_command.is_write())
  1357.        ~~~~~~~~~~~~~~~~~~~~~~~~~
  1358.        {
  1359.        ~                      
  1360.          if (data != '\0')
  1361.          ~~~~~~~~~~~~~~~~~    
  1362.            m_buffer += data;
  1363.            ~~~~~~~~~~~~~~~~~  
  1364.  
  1365.                                
  1366.          if (data == '\r')
  1367.          ~~~~~~~~~~~~~~~~~    
  1368.          {
  1369.          ~                    
  1370.            NOTICE_LOG(OSREPORT, "%s", SHIFTJISToUTF8(m_buffer).c_str());
  1371.            ~~~~~~~~~~~~~~~~~~~~~~~~~~~~~~~~~~~~~~~~~~~~~~~~~~~~~~~~~~~~~
  1372.            m_buffer.clear();
  1373.            ~~~~~~~~~~~~~~~~~  
  1374.          }
  1375.          ~                    
  1376.        }
  1377.        ~                      
  1378.        else
  1379.        ~~~~                    
  1380.        {
  1381.        ~                      
  1382.          // "Queue Length"... return 0 cause we're instant
  1383.          ~~~~~~~~~~~~~~~~~~~~~~~~~~~~~~~~~~~~~~~~~~~~~~~~~
  1384.          data = 0;
  1385.          ~~~~~~~~~            
  1386.        }
  1387.        ~                      
  1388.      };
  1389.      ~~                        
  1390.  
  1391.                                
  1392.      if (IN_RANGE(ROM))
  1393.      ~~~~~~~~~~~~~~~~          
  1394. /home/mrturcot/mitch/builds/dolphin-emu-git/src/dolphin-emu/Source/Core/Core/HW/EXI/EXI_DeviceIPL.cpp:313:9: note: in expansion of macro ‘IN_RANGE’
  1395.      if (IN_RANGE(ROM))
  1396.          ^~~~~~~~
  1397. [ 59%] Building CXX object Source/Core/Core/CMakeFiles/core.dir/HW/GPFifo.cpp.o
  1398. [ 59%] Building CXX object Source/Core/Core/CMakeFiles/core.dir/HW/HW.cpp.o
  1399. [ 59%] Building CXX object Source/Core/Core/CMakeFiles/core.dir/HW/Memmap.cpp.o
  1400. [ 59%] Building CXX object Source/Core/Core/CMakeFiles/core.dir/HW/MemoryInterface.cpp.o
  1401. /home/mrturcot/mitch/builds/dolphin-emu-git/src/dolphin-emu/Source/Core/Core/HW/GCMemcard/GCMemcard.cpp: In member function ‘u32 GCMemcard::RemoveFile(u8)’:
  1402. /home/mrturcot/mitch/builds/dolphin-emu-git/src/dolphin-emu/Source/Core/Core/HW/GCMemcard/GCMemcard.cpp:767:63: warning: ‘void* memset(void*, int, size_t)’ writing to an object of non-trivial type ‘std::array<DEntry, 127>::value_type’ {aka ‘struct DEntry’}; use assignment instead [-Wclass-memaccess]
  1403.    memset(&(UpdatedDir.m_dir_entries[index]), 0xFF, DENTRY_SIZE);
  1404.                                                                ^
  1405. In file included from /home/mrturcot/mitch/builds/dolphin-emu-git/src/dolphin-emu/Source/Core/Core/HW/GCMemcard/GCMemcard.cpp:5:
  1406. /home/mrturcot/mitch/builds/dolphin-emu-git/src/dolphin-emu/Source/Core/Core/HW/GCMemcard/GCMemcard.h:189:8: note: ‘std::array<DEntry, 127>::value_type’ {aka ‘struct DEntry’} declared here
  1407.  struct DEntry
  1408.         ^~~~~~
  1409. /home/mrturcot/mitch/builds/dolphin-emu-git/src/dolphin-emu/Source/Core/Core/HW/GCMemcard/GCMemcard.cpp: In member function ‘bool GCMemcard::Format(bool, u16)’:
  1410. /home/mrturcot/mitch/builds/dolphin-emu-git/src/dolphin-emu/Source/Core/Core/HW/GCMemcard/GCMemcard.cpp:1242:43: warning: ‘void* memset(void*, int, size_t)’ writing to an object of non-trivial type ‘struct Header’; use assignment instead [-Wclass-memaccess]
  1411.    memset(&m_header_block, 0xFF, BLOCK_SIZE);
  1412.                                            ^
  1413. In file included from /home/mrturcot/mitch/builds/dolphin-emu-git/src/dolphin-emu/Source/Core/Core/HW/GCMemcard/GCMemcard.cpp:5:
  1414. /home/mrturcot/mitch/builds/dolphin-emu-git/src/dolphin-emu/Source/Core/Core/HW/GCMemcard/GCMemcard.h:103:8: note: ‘struct Header’ declared here
  1415.  struct Header
  1416.         ^~~~~~
  1417. /home/mrturcot/mitch/builds/dolphin-emu-git/src/dolphin-emu/Source/Core/Core/HW/GCMemcard/GCMemcard.cpp:1243:50: warning: ‘void* memset(void*, int, size_t)’ writing to an object of non-trivial type ‘std::array<Directory, 2>::value_type’ {aka ‘struct Directory’}; use assignment instead [-Wclass-memaccess]
  1418.    memset(&m_directory_blocks[0], 0xFF, BLOCK_SIZE);
  1419.                                                   ^
  1420. In file included from /home/mrturcot/mitch/builds/dolphin-emu-git/src/dolphin-emu/Source/Core/Core/HW/GCMemcard/GCMemcard.cpp:5:
  1421. /home/mrturcot/mitch/builds/dolphin-emu-git/src/dolphin-emu/Source/Core/Core/HW/GCMemcard/GCMemcard.h:273:8: note: ‘std::array<Directory, 2>::value_type’ {aka ‘struct Directory’} declared here
  1422.  struct Directory
  1423.         ^~~~~~~~~
  1424. /home/mrturcot/mitch/builds/dolphin-emu-git/src/dolphin-emu/Source/Core/Core/HW/GCMemcard/GCMemcard.cpp:1244:50: warning: ‘void* memset(void*, int, size_t)’ writing to an object of non-trivial type ‘std::array<Directory, 2>::value_type’ {aka ‘struct Directory’}; use assignment instead [-Wclass-memaccess]
  1425.    memset(&m_directory_blocks[1], 0xFF, BLOCK_SIZE);
  1426.                                                   ^
  1427. In file included from /home/mrturcot/mitch/builds/dolphin-emu-git/src/dolphin-emu/Source/Core/Core/HW/GCMemcard/GCMemcard.cpp:5:
  1428. /home/mrturcot/mitch/builds/dolphin-emu-git/src/dolphin-emu/Source/Core/Core/HW/GCMemcard/GCMemcard.h:273:8: note: ‘std::array<Directory, 2>::value_type’ {aka ‘struct Directory’} declared here
  1429.  struct Directory
  1430.         ^~~~~~~~~
  1431. /home/mrturcot/mitch/builds/dolphin-emu-git/src/dolphin-emu/Source/Core/Core/HW/GCMemcard/GCMemcard.cpp:1245:41: warning: ‘void* memset(void*, int, size_t)’ clearing an object of non-trivial type ‘std::array<BlockAlloc, 2>::value_type’ {aka ‘struct BlockAlloc’}; use assignment or value-initialization instead [-Wclass-memaccess]
  1432.    memset(&m_bat_blocks[0], 0, BLOCK_SIZE);
  1433.                                          ^
  1434. In file included from /home/mrturcot/mitch/builds/dolphin-emu-git/src/dolphin-emu/Source/Core/Core/HW/GCMemcard/GCMemcard.cpp:5:
  1435. /home/mrturcot/mitch/builds/dolphin-emu-git/src/dolphin-emu/Source/Core/Core/HW/GCMemcard/GCMemcard.h:296:8: note: ‘std::array<BlockAlloc, 2>::value_type’ {aka ‘struct BlockAlloc’} declared here
  1436.  struct BlockAlloc
  1437.         ^~~~~~~~~~
  1438. /home/mrturcot/mitch/builds/dolphin-emu-git/src/dolphin-emu/Source/Core/Core/HW/GCMemcard/GCMemcard.cpp:1246:41: warning: ‘void* memset(void*, int, size_t)’ clearing an object of non-trivial type ‘std::array<BlockAlloc, 2>::value_type’ {aka ‘struct BlockAlloc’}; use assignment or value-initialization instead [-Wclass-memaccess]
  1439.    memset(&m_bat_blocks[1], 0, BLOCK_SIZE);
  1440.                                          ^
  1441. In file included from /home/mrturcot/mitch/builds/dolphin-emu-git/src/dolphin-emu/Source/Core/Core/HW/GCMemcard/GCMemcard.cpp:5:
  1442. /home/mrturcot/mitch/builds/dolphin-emu-git/src/dolphin-emu/Source/Core/Core/HW/GCMemcard/GCMemcard.h:296:8: note: ‘std::array<BlockAlloc, 2>::value_type’ {aka ‘struct BlockAlloc’} declared here
  1443.  struct BlockAlloc
  1444.         ^~~~~~~~~~
  1445. [ 59%] Building CXX object Source/Core/Core/CMakeFiles/core.dir/HW/MMIO.cpp.o
  1446. [ 59%] Building CXX object Source/Core/Core/CMakeFiles/core.dir/HW/ProcessorInterface.cpp.o
  1447. [ 59%] Building CXX object Source/Core/Core/CMakeFiles/core.dir/HW/SI/SI.cpp.o
  1448. [ 59%] Building CXX object Source/Core/Core/CMakeFiles/core.dir/HW/SI/SI_Device.cpp.o
  1449. [ 59%] Building CXX object Source/Core/Core/CMakeFiles/core.dir/HW/SI/SI_DeviceDanceMat.cpp.o
  1450. [ 60%] Building CXX object Source/Core/Core/CMakeFiles/core.dir/HW/SI/SI_DeviceGBA.cpp.o
  1451. [ 60%] Building CXX object Source/Core/Core/CMakeFiles/core.dir/HW/SI/SI_DeviceGCAdapter.cpp.o
  1452. [ 60%] Building CXX object Source/Core/Core/CMakeFiles/core.dir/HW/SI/SI_DeviceGCController.cpp.o
  1453. [ 60%] Building CXX object Source/Core/Core/CMakeFiles/core.dir/HW/SI/SI_DeviceGCSteeringWheel.cpp.o
  1454. [ 60%] Building CXX object Source/Core/Core/CMakeFiles/core.dir/HW/SI/SI_DeviceKeyboard.cpp.o
  1455. [ 60%] Building CXX object Source/Core/Core/CMakeFiles/core.dir/HW/SI/SI_DeviceNull.cpp.o
  1456. [ 60%] Building CXX object Source/Core/Core/CMakeFiles/core.dir/HW/Sram.cpp.o
  1457. [ 60%] Building CXX object Source/Core/Core/CMakeFiles/core.dir/HW/StreamADPCM.cpp.o
  1458. [ 61%] Building CXX object Source/Core/Core/CMakeFiles/core.dir/HW/SystemTimers.cpp.o
  1459. [ 61%] Building CXX object Source/Core/Core/CMakeFiles/core.dir/HW/VideoInterface.cpp.o
  1460. [ 61%] Building CXX object Source/Core/Core/CMakeFiles/core.dir/HW/WII_IPC.cpp.o
  1461. [ 61%] Building CXX object Source/Core/Core/CMakeFiles/core.dir/HW/Wiimote.cpp.o
  1462. [ 61%] Building CXX object Source/Core/Core/CMakeFiles/core.dir/HW/WiimoteCommon/DataReport.cpp.o
  1463. [ 61%] Building CXX object Source/Core/Core/CMakeFiles/core.dir/HW/WiimoteEmu/WiimoteEmu.cpp.o
  1464. [ 61%] Building CXX object Source/Core/Core/CMakeFiles/core.dir/HW/WiimoteEmu/Camera.cpp.o
  1465. [ 61%] Building CXX object Source/Core/Core/CMakeFiles/core.dir/HW/WiimoteEmu/Dynamics.cpp.o
  1466. [ 63%] Building CXX object Source/Core/Core/CMakeFiles/core.dir/HW/WiimoteEmu/EmuSubroutines.cpp.o
  1467. [ 63%] Building CXX object Source/Core/Core/CMakeFiles/core.dir/HW/WiimoteEmu/Encryption.cpp.o
  1468. [ 63%] Building CXX object Source/Core/Core/CMakeFiles/core.dir/HW/WiimoteEmu/ExtensionPort.cpp.o
  1469. [ 63%] Building CXX object Source/Core/Core/CMakeFiles/core.dir/HW/WiimoteEmu/I2CBus.cpp.o
  1470. /home/mrturcot/mitch/builds/dolphin-emu-git/src/dolphin-emu/Source/Core/Core/HW/WiimoteEmu/Camera.cpp: In instantiation of ‘WiimoteEmu::CameraLogic::Update(const Common::Matrix44&, bool)::<lambda(auto:1&)> [with auto:1 = const Common::TVec3<float>]’:
  1471. /usr/include/c++/8.2.1/bits/stl_algo.h:4304:24:   required from ‘_OIter std::transform(_IIter, _IIter, _OIter, _UnaryOperation) [with _IIter = const Common::TVec3<float>*; _OIter = WiimoteEmu::CameraLogic::Update(const Common::Matrix44&, bool)::CameraPoint*; _UnaryOperation = WiimoteEmu::CameraLogic::Update(const Common::Matrix44&, bool)::<lambda(auto:1&)>]’
  1472. /home/mrturcot/mitch/builds/dolphin-emu-git/src/dolphin-emu/Source/Core/Core/HW/WiimoteEmu/Camera.cpp:123:4:   required from here
  1473. /home/mrturcot/mitch/builds/dolphin-emu-git/src/dolphin-emu/Source/Core/Core/HW/WiimoteEmu/Camera.cpp:116:43: internal compiler error: in tsubst_copy, at cp/pt.c:15478
  1474.        const auto point_size = std::lround(MAX_POINT_SIZE / point.w / 2);
  1475.                                            ^~~~~~~~~~~~~~
  1476. Please submit a full bug report,
  1477. with preprocessed source if appropriate.
  1478. See <https://bugs.archlinux.org/> for instructions.
  1479. make[2]: *** [Source/Core/Core/CMakeFiles/core.dir/build.make:1831: Source/Core/Core/CMakeFiles/core.dir/HW/WiimoteEmu/Camera.cpp.o] Error 1
  1480. make[2]: *** Waiting for unfinished jobs....
  1481. make[1]: *** [CMakeFiles/Makefile2:934: Source/Core/Core/CMakeFiles/core.dir/all] Error 2
  1482. make: *** [Makefile:152: all] Error 2
  1483. ==> ERROR: A failure occurred in build().
  1484.     Aborting...
  1485. [1] mrturcot@GL552VW
  1486. [~/mitch/builds/dolphin-emu-git] >$
RAW Paste Data
We use cookies for various purposes including analytics. By continuing to use Pastebin, you agree to our use of cookies as described in the Cookies Policy. OK, I Understand
 
Top