SHARE
TWEET

Untitled

a guest Jan 12th, 2014 165 Never
Not a member of Pastebin yet? Sign Up, it unlocks many cool features!
  1. nvidia-installer log file '/var/log/nvidia-installer.log'
  2. creation time: Sun Jan 12 16:07:16 2014
  3. installer version: 319.37
  4.  
  5. PATH: /usr/local/cuda-5.5/bin:/usr/local/sbin:/usr/local/bin:/usr/sbin:/usr/bin:/sbin:/bin
  6.  
  7. nvidia-installer command line:
  8.     ./nvidia-installer
  9.     --ui=none
  10.     --no-questions
  11.     --accept-license
  12.     --disable-nouveau
  13.  
  14. Using built-in stream user interface
  15. -> License accepted by command line option.
  16. -> Installing NVIDIA driver version 319.37.
  17. WARNING: One or more modprobe configuration files to disable Nouveau are already present at: /etc/modprobe.d/nvidia-installer-disable-nouveau.conf.  Please be sure you have rebooted your system since these files were written.  If you have rebooted, then Nouveau may be enabled for other reasons, such as being included in the system initial ramdisk or in your X configuration file.  Please consult the NVIDIA driver README and your Linux distribution's documentation for details on how to correctly disable the Nouveau kernel driver.
  18. -> For some distributions, Nouveau can be disabled by adding a file in the modprobe configuration directory.  Would you like nvidia-installer to attempt to create this modprobe file for you? (Answer: Yes)
  19. -> One or more modprobe configuration files to disable Nouveau have been written.  For some distributions, this may be sufficient to disable Nouveau; other distributions may require modification of the initial ramdisk.  Please reboot your system and attempt NVIDIA driver installation again.  Note if you later wish to reenable Nouveau, you will need to delete these files: /etc/modprobe.d/nvidia-installer-disable-nouveau.conf
  20. -> Performing CC sanity check with CC="cc".
  21. -> Kernel source path: '/lib/modules/3.12-kali1-amd64/source'
  22. -> Kernel output path: '/lib/modules/3.12-kali1-amd64/build'
  23. -> Performing rivafb check.
  24. -> Performing nvidiafb check.
  25. -> Performing Xen check.
  26. -> Cleaning kernel module build directory.
  27.    executing: 'cd ./kernel; make clean'...
  28. -> Building kernel module:
  29.    executing: 'cd ./kernel; make module SYSSRC=/lib/modules/3.12-kali1-amd64/source SYSOUT=/lib/modules/3.12-kali1-amd64/build'...
  30.    NVIDIA: calling KBUILD...
  31.    make -C /lib/modules/3.12-kali1-amd64/build \
  32.         KBUILD_SRC=/usr/src/linux-headers-3.12-kali1-common \
  33.         KBUILD_EXTMOD="/tmp/selfgz21288/NVIDIA-Linux-x86_64-319.37/kernel" -f /usr/src/linux-headers-3.12-kali1-common/Makefile \
  34.         modules
  35.    test -e include/generated/autoconf.h -a -e include/config/auto.conf || (             \
  36.         echo >&2;                                                       \
  37.         echo >&2 "  ERROR: Kernel configuration is invalid.";           \
  38.         echo >&2 "         include/generated/autoconf.h or include/config/auto.conf are missing.";\
  39.         echo >&2 "         Run 'make oldconfig && make prepare' on kernel src to fix it.";      \
  40.         echo >&2 ;                                                      \
  41.         /bin/false)
  42.    mkdir -p /tmp/selfgz21288/NVIDIA-Linux-x86_64-319.37/kernel/.tmp_versions ; rm -f /tmp/selfgz21288/NVIDIA-Linux-x86_64-319.37/kernel/.tmp_versions/*
  43.    make -f /usr/src/linux-headers-3.12-kali1-common/scripts/Makefile.build obj=/tmp/selfgz21288/NVIDIA-Linux-x86_64-319.37/kernel
  44.      cc -Wp,-MD,/tmp/selfgz21288/NVIDIA-Linux-x86_64-319.37/kernel/.nv.o.d  -nostdinc -isystem /usr/lib/gcc/x86_64-linux-gnu/4.7/include -I/usr/src/linux-headers-3.12-kali1-common/arch/x86/include -Iarch/x86/include/generated  -I/usr/src/linux-headers-3.12-kali1-common/include -Iinclude -I/usr/src/linux-headers-3.12-kali1-common/arch/x86/include/uapi -Iarch/x86/include/generated/uapi -I/usr/src/linux-headers-3.12-kali1-common/include/uapi -Iinclude/generated/uapi -include /usr/src/linux-headers-3.12-kali1-common/include/linux/kconfig.h   -I/tmp/selfgz21288/NVIDIA-Linux-x86_64-319.37/kernel -D__KERNEL__ -Wall -Wundef -Wstrict-prototypes -Wno-trigraphs -fno-strict-aliasing -fno-common -Werror-implicit-function-declaration -Wno-format-security -fno-delete-null-pointer-checks -O2 -m64 -mno-mmx -mno-sse -mtune=generic -mno-red-zone -mcmodel=kernel -funit-at-a-time -maccumulate-outgoing-args -fstack-protector -DCONFIG_AS_CFI=1 -DCONFIG_AS_CFI_SIGNAL_FRAME=1 -DCONFIG_AS_CFI_SECTIONS=1 -DCONFIG_AS_FXSAVEQ=1 -DCONFIG_AS_AVX=1 -DCONFIG_AS_AVX2=1 -pipe -Wno-sign-compare -fno-asynchronous-unwind-tables -mno-sse -mno-mmx -mno-sse2 -mno-3dnow -mn
  45.    o-avx -Wframe-larger-than=2048 -Wno-unused-but-set-variable -fomit-frame-pointer -g -Wdeclaration-after-statement -Wno-pointer-sign -fno-strict-overflow -fconserve-stack -DCC_HAVE_ASM_GOTO   -I/tmp/selfgz21288/NVIDIA-Linux-x86_64-319.37/kernel -Wall -MD -Wsign-compare -Wno-cast-qual -Wno-error -D__KERNEL__ -DMODULE -DNVRM -DNV_VERSION_STRING=\"319.37\" -Wno-unused-function -Wuninitialized -mno-red-zone -mcmodel=kernel -UDEBUG -U_DEBUG -DNDEBUG -D__linux__  -DMODULE  -D"KBUILD_STR(s)=#s" -D"KBUILD_BASENAME=KBUILD_STR(nv)"  -D"KBUILD_MODNAME=KBUILD_STR(nvidia)" -c -o /tmp/selfgz21288/NVIDIA-Linux-x86_64-319.37/kernel/.tmp_nv.o /tmp/selfgz21288/NVIDIA-Linux-x86_64-319.37/kernel/nv.c
  46.    In file included from /usr/src/linux-headers-3.12-kali1-common/include/linux/kernel.h:10:0,
  47.                     from /usr/src/linux-headers-3.12-kali1-common/include/linux/sched.h:15,
  48.                     from /usr/src/linux-headers-3.12-kali1-common/include/linux/utsname.h:5,
  49.                     from /tmp/selfgz21288/NVIDIA-Linux-x86_64-319.37/kernel/nv-linux.h:44,
  50.                     from /tmp/selfgz21288/NVIDIA-Linux-x86_64-319.37/kernel/nv.c:13:
  51.    /usr/src/linux-headers-3.12-kali1-common/include/linux/bitops.h: In function ‘hweight_long’:
  52.    /usr/src/linux-headers-3.12-kali1-common/include/linux/bitops.h:66:41: warning: signed and unsigned type in conditional expression [-Wsign-compare]
  53.    In file included from /usr/src/linux-headers-3.12-kali1-common/arch/x86/include/asm/cpumask.h:4:0,
  54.                     from /usr/src/linux-headers-3.12-kali1-common/arch/x86/include/asm/msr.h:10,
  55.                     from /usr/src/linux-headers-3.12-kali1-common/arch/x86/include/asm/processor.h:20,
  56.                     from /usr/src/linux-headers-3.12-kali1-common/arch/x86/include/asm/thread_info.h:22,
  57.                     from /usr/src/linux-headers-3.12-kali1-common/include/linux/thread_info.h:54,
  58.                     from /usr/src/linux-headers-3.12-kali1-common/include/linux/preempt.h:9,
  59.                     from /usr/src/linux-headers-3.12-kali1-common/include/linux/spinlock.h:50,
  60.                     from /usr/src/linux-headers-3.12-kali1-common/include/linux/seqlock.h:35,
  61.                     from /usr/src/linux-headers-3.12-kali1-common/include/linux/time.h:5,
  62.                     from /usr/src/linux-headers-3.12-kali1-common/include/uapi/linux/timex.h:56,
  63.                     from /usr/src/linux-headers-3.12-kali1-common/include/linux/timex.h:56,
  64.                     from /usr/src/linux-headers-3.12-kali1-common/include/linux/sched.h:17,
  65.                     from /usr/src/linux-headers-3.12-kali1-common/include/linux/utsname.h:5,
  66.                     from /tmp/selfgz21288/NVIDIA-Linux-x86_64-319.37/kernel/nv-linux.h:44,
  67.                     from /tmp/selfgz21288/NVIDIA-Linux-x86_64-319.37/kernel/nv.c:13:
  68.    /usr/src/linux-headers-3.12-kali1-common/include/linux/cpumask.h: In function ‘cpumask_parse’:
  69.    /usr/src/linux-headers-3.12-kali1-common/include/linux/cpumask.h:603:26: warning: signed and unsigned type in conditional expression [-Wsign-compare]
  70.    In file included from /usr/src/linux-headers-3.12-kali1-common/arch/x86/include/asm/uaccess.h:542:0,
  71.                     from /usr/src/linux-headers-3.12-kali1-common/include/linux/poll.h:11,
  72.                     from /tmp/selfgz21288/NVIDIA-Linux-x86_64-319.37/kernel/nv-linux.h:115,
  73.                     from /tmp/selfgz21288/NVIDIA-Linux-x86_64-319.37/kernel/nv.c:13:
  74.    /usr/src/linux-headers-3.12-kali1-common/arch/x86/include/asm/uaccess_64.h: In function ‘copy_from_user’:
  75.    /usr/src/linux-headers-3.12-kali1-common/arch/x86/include/asm/uaccess_64.h:62:6: warning: comparison between signed and unsigned integer expressions [-Wsign-compare]
  76.      cc -Wp,-MD,/tmp/selfgz21288/NVIDIA-Linux-x86_64-319.37/kernel/.nv-acpi.o.d  -nostdinc -isystem /usr/lib/gcc/x86_64-linux-gnu/4.7/include -I/usr/src/linux-headers-3.12-kali1-common/arch/x86/include -Iarch/x86/include/generated  -I/usr/src/linux-headers-3.12-kali1-common/include -Iinclude -I/usr/src/linux-headers-3.12-kali1-common/arch/x86/include/uapi -Iarch/x86/include/generated/uapi -I/usr/src/linux-headers-3.12-kali1-common/include/uapi -Iinclude
  77.    /generated/uapi -include /usr/src/linux-headers-3.12-kali1-common/include/linux/kconfig.h   -I/tmp/selfgz21288/NVIDIA-Linux-x86_64-319.37/kernel -D__KERNEL__ -Wall -Wundef -Wstrict-prototypes -Wno-trigraphs -fno-strict-aliasing -fno-common -Werror-implicit-function-declaration -Wno-format-security -fno-delete-null-pointer-checks -O2 -m64 -mno-mmx -mno-sse -mtune=generic -mno-red-zone -mcmodel=kernel -funit-at-a-time -maccumulate-outgoing-args -fstack-protector -DCONFIG_AS_CFI=1 -DCONFIG_AS_CFI_SIGNAL_FRAME=1 -DCONFIG_AS_CFI_SECTIONS=1 -DCONFIG_AS_FXSAVEQ=1 -DCONFIG_AS_AVX=1 -DCONFIG_AS_AVX2=1 -pipe -Wno-sign-compare -fno-asynchronous-unwind-tables -mno-sse -mno-mmx -mno-sse2 -mno-3dnow -mno-avx -Wframe-larger-than=2048 -Wno-unused-but-set-variable -fomit-frame-pointer -g -Wdeclaration-after-statement -Wno-pointer-sign -fno-strict-overflow -fconserve-stack -DCC_HAVE_ASM_GOTO   -I/tmp/selfgz21288/NVIDIA-Linux-x86_64-319.37/kernel -Wall -MD -Wsign-compare -Wno-cast-qual -Wno-error -D__KERNEL__ -DMODULE -DNVRM -D
  78.    NV_VERSION_STRING=\"319.37\" -Wno-unused-function -Wuninitialized -mno-red-zone -mcmodel=kernel -UDEBUG -U_DEBUG -DNDEBUG -D__linux__  -DMODULE  -D"KBUILD_STR(s)=#s" -D"KBUILD_BASENAME=KBUILD_STR(nv_acpi)"  -D"KBUILD_MODNAME=KBUILD_STR(nvidia)" -c -o /tmp/selfgz21288/NVIDIA-Linux-x86_64-319.37/kernel/.tmp_nv-acpi.o /tmp/selfgz21288/NVIDIA-Linux-x86_64-319.37/kernel/nv-acpi.c
  79.    In file included from /usr/src/linux-headers-3.12-kali1-common/include/linux/kernel.h:10:0,
  80.                     from /usr/src/linux-headers-3.12-kali1-common/include/linux/sched.h:15,
  81.                     from /usr/src/linux-headers-3.12-kali1-common/include/linux/utsname.h:5,
  82.                     from /tmp/selfgz21288/NVIDIA-Linux-x86_64-319.37/kernel/nv-linux.h:44,
  83.                     from /tmp/selfgz21288/NVIDIA-Linux-x86_64-319.37/kernel/nv-acpi.c:15:
  84.    /usr/src/linux-headers-3.12-kali1-common/include/linux/bitops.h: In function ‘hweight_long’:
  85.    /usr/src/linux-headers-3.12-kali1-common/include/linux/bitops.h:66:41: warning: signed and unsigned type in conditional expression [-Wsign-compare]
  86.    In file included from /usr/src/linux-headers-3.12-kali1-common/arch/x86/include/asm/cpumask.h:4:0,
  87.                     from /usr/src/linux-headers-3.12-kali1-common/arch/x86/include/asm/msr.h:10,
  88.                     from /usr/src/linux-headers-3.12-kali1-common/arch/x86/include/asm/processor.h:20,
  89.                     from /usr/src/linux-headers-3.12-kali1-common/arch/x86/include/asm/thread_info.h:22,
  90.                     from /usr/src/linux-headers-3.12-kali1-common/include/linux/thread_info.h:54,
  91.                     from /usr/src/linux-headers-3.12-kali1-common/include/linux/preempt.h:9,
  92.                     from /usr/src/linux-headers-3.12-kali1-common/include/linux/spinlock.h:50,
  93.                     from /usr/src/linux-headers-3.12-kali1-common/include/linux/seqlock.h:35,
  94.                     from /usr/src/linux-headers-3.12-kali1-common/include/linux/time.h:5,
  95.                     from /usr/src/linux-headers-3.12-kali1-common/include/uapi/linux/timex.h:56,
  96.                     from /usr/src/linux-headers-3.12-kali1-common/include/linux/timex.h:56,
  97.                     from /usr/src/linux-headers-3.12-kali1-common/include/linux/sched.h:17,
  98.                     from /usr/src/linux-headers-3.12-kali1-common/include/linux/utsname.h:5,
  99.                     from /tmp/selfgz21288/NVIDIA-Linux-x86_64-319.37/kernel/nv-linux.h:44,
  100.                     from /tmp/selfgz21288/NVIDIA-Linux-x86_64-319.37/kernel/nv-acpi.c:15:
  101.    /usr/src/linux-headers-3.12-kali1-common/include/linux/cpumask.h: In function ‘cpumask_parse’:
  102.    /usr/src/linux-headers-3.12-kali1-common/include/linux/cpumask.h:603:26: warning: signed and unsigned type in conditional expression [-Wsign-compare]
  103.    In file included from /usr/src/linux-headers-3.12-kali1-common/arch/x86/include/asm/uaccess.h:542:0,
  104.                     from /usr/src/linux-headers-3.12-kali1-common/include/linux/poll.h:11,
  105.                     from /tmp/selfgz21288/NVIDIA-Linux-x86_64-319.37/kernel/nv-linux.h:115,
  106.                     from /tmp/selfgz21288/NVIDIA-Linux-x86_64-319.37/kernel/nv-acpi.c:15:
  107.    /usr/src/linux-headers-3.12-kali1-common/arch/x86/include/asm/uaccess_64.h: In function ‘copy_from_user’:
  108.    /usr/src/linux-headers-3.12-kali1-common/arch/x86/include/asm/uaccess_64.h:62:6: warning: comparison between signed and unsigned integer expressions [-Wsign-compare]
  109.    /tmp/selfgz21288/NVIDIA-Linux-x86_64-319.37/kernel/nv-acpi.c: At top level:
  110.    /tmp/selfgz21288/NVIDIA-Linux-x86_64-319.37/kernel/nv-acpi.c:70:9: warning: initialization from incompatible pointer type [enabled by default]
  111.    /tmp/selfgz21288/NVIDIA-Linux-x86_64-319.37/kernel/nv-acpi.c:70:9: warning: (near initialization for ‘nv_acpi_driver_template.ops.remove’) [enabled by default]
  112.      cc -Wp,-MD,/tmp/selfgz21288/NVIDIA-Linux-x86_64-319.37/kernel/.nv-chrdev.o.d  -nostdinc -isystem /usr/lib/gcc/x86_64-linux-gnu/4.7/include -I/usr/src/linux-headers-3.12-kali1-common/arch/x86/include -Iarch/x86/include/generated  -I/usr/src/linux-headers-3.12-kali1-common/include -Iinclude -I/usr/src/linux-headers-3.12-kali1-common/arch/x86/include/uapi -Iarch/x86
  113.    /include/generated/uapi -I/usr/src/linux-headers-3.12-kali1-common/include/uapi -Iinclude/generated/uapi -include /usr/src/linux-headers-3.12-kali1-common/include/linux/kconfig.h   -I/tmp/selfgz21288/NVIDIA-Linux-x86_64-319.37/kernel -D__KERNEL__ -Wall -Wundef -Wstrict-prototypes -Wno-trigraphs -fno-strict-aliasing -fno-common -Werror-implicit-function-declaration -Wno-format-security -fno-delete-null-pointer-checks -O2 -m64 -mno-mmx -mno-sse -mtune=generic -mno-red-zone -mcmodel=kernel -funit-at-a-time -maccumulate-outgoing-args -fstack-protector -DCONFIG_AS_CFI=1 -DCONFIG_AS_CFI_SIGNAL_FRAME=1 -DCONFIG_AS_CFI_SECTIONS=1 -DCONFIG_AS_FXSAVEQ=1 -DCONFIG_AS_AVX=1 -DCONFIG_AS_AVX2=1 -pipe -Wno-sign-compare -fno-asynchronous-unwind-tables -mno-sse -mno-mmx -mno-sse2 -mno-3dnow -mno-avx -Wframe-larger-than=2048 -Wno-unused-but-set-variable -fomit-frame-pointer -g -Wdeclaration-after-statement -Wno-pointer-sign -fno-strict-overflow -fconserve-stack -DCC_HAVE_ASM_GOTO   -I/tmp/selfgz21288/NVIDIA-Linux-x86_64-319.37/
  114.    kernel -Wall -MD -Wsign-compare -Wno-cast-qual -Wno-error -D__KERNEL__ -DMODULE -DNVRM -DNV_VERSION_STRING=\"319.37\" -Wno-unused-function -Wuninitialized -mno-red-zone -mcmodel=kernel -UDEBUG -U_DEBUG -DNDEBUG -D__linux__  -DMODULE  -D"KBUILD_STR(s)=#s" -D"KBUILD_BASENAME=KBUILD_STR(nv_chrdev)"  -D"KBUILD_MODNAME=KBUILD_STR(nvidia)" -c -o /tmp/selfgz21288/NVIDIA-Linux-x86_64-319.37/kernel/.tmp_nv-chrdev.o /tmp/selfgz21288/NVIDIA-Linux-x86_64-319.37/kernel/nv-chrdev.c
  115.    In file included from /usr/src/linux-headers-3.12-kali1-common/include/linux/kernel.h:10:0,
  116.                     from /usr/src/linux-headers-3.12-kali1-common/include/linux/sched.h:15,
  117.                     from /usr/src/linux-headers-3.12-kali1-common/include/linux/utsname.h:5,
  118.                     from /tmp/selfgz21288/NVIDIA-Linux-x86_64-319.37/kernel/nv-linux.h:44,
  119.                     from /tmp/selfgz21288/NVIDIA-Linux-x86_64-319.37/kernel/nv-chrdev.c:15:
  120.    /usr/src/linux-headers-3.12-kali1-common/include/linux/bitops.h: In function ‘hweight_long’:
  121.    /usr/src/linux-headers-3.12-kali1-common/include/linux/bitops.h:66:41: warning: signed and unsigned type in conditional expression [-Wsign-compare]
  122.    In file included from /usr/src/linux-headers-3.12-kali1-common/arch/x86/include/asm/cpumask.h:4:0,
  123.                     from /usr/src/linux-headers-3.12-kali1-common/arch/x86/include/asm/msr.h:10,
  124.                     from /usr/src/linux-headers-3.12-kali1-common/arch/x86/include/asm/processor.h:20,
  125.                     from /usr/src/linux-headers-3.12-kali1-common/arch/x86/include/asm/thread_info.h:22,
  126.                     from /usr/src/linux-headers-3.12-kali1-common/include/linux/thread_info.h:54,
  127.                     from /usr/src/linux-headers-3.12-kali1-common/include/linux/preempt.h:9,
  128.                     from /usr/src/linux-headers-3.12-kali1-common/include/linux/spinlock.h:50,
  129.                     from /usr/src/linux-headers-3.12-kali1-common/include/linux/seqlock.h:35,
  130.                     from /usr/src/linux-headers-3.12-kali1-common/include/linux/time.h:5,
  131.                     from /usr/src/linux-headers-3.12-kali1-common/include/uapi/linux/timex.h:56,
  132.                     from /usr/src/linux-headers-3.12-kali1-common/include/linux/timex.h:56,
  133.                     from /usr/src/linux-headers-3.12-kali1-common/include/linux/sched.h:17,
  134.                     from /usr/src/linux-headers-3.12-kali1-common/include/linux/utsname.h:5,
  135.                     from /tmp/selfgz21288/NVIDIA-Linux-x86_64-319.37/kernel/nv-linux.h:44,
  136.                     from /tmp/selfgz21288/NVIDIA-Linux-x86_64-319.37/kernel/nv-chrdev.c:15:
  137.    /usr/src/linux-headers-3.12-kali1-common/include/linux/cpumask.h: In function ‘cpumask_parse’:
  138.    /usr/src/linux-headers-3.12-kali1-common/include/linux/cpumask.h:603:26: warning: signed and unsigned type in conditional expression [-Wsign-compare]
  139.    In file included from /usr/src/linux-headers-3.12-kali1-common/arch/x86/include/asm/uaccess.h:542:0,
  140.                     from /usr/src/linux-headers-3.12-kali1-common/include/linux/poll.h:11,
  141.                     from /tmp/selfgz21288/NVIDIA-Linux-x86_64-319.37/kernel/nv-linux.h:115,
  142.                     from /tmp/selfgz21288/NVIDIA-Linux-x86_64-319.37/kernel/nv-chrdev.c:15:
  143.    /usr/src/linux-headers-3.12-kali1-common/arch/x86/include/asm/uaccess_64.h: In function ‘copy_from_user’:
  144.    /usr/src/linux-headers-3.12-kali1-common/arch/x86/include/asm/uaccess_64.h:62:6: warning: comparison between signed and unsigned integer expressions [-Wsign-compare]
  145.      cc -Wp,-MD,/tmp/selfgz21288/NVIDIA-Linux-x86_64-319.37/kernel/.nv-cray.o.d  -nostdinc -isystem /usr/lib/gcc/x86_64-linux-gnu/4.7/include -I/usr/src/linux-headers-3.12-kali1-common/arch/x86/include -Iarch/x86/include/generated  -I/usr/src/linux-headers-3.12-kali1-common/include -Iinclude -I/usr/src/linux-headers-3.12-kali1-common/arch/x86/include/uapi -Iarch/x86/include/generated/uapi -I/usr/src/linux-headers-3.12-kali1-common/include/uapi -Iinclude/generated/uapi -include /usr/src/linux-headers-3.12-kali1-common/include/linux/kconfig.h   -I/tmp/selfgz21288/NVIDIA-Linux-x86_64-319.37/kernel -D__KERNEL__ -Wall -Wundef -Wstrict-prototypes -Wn
  146.    o-trigraphs -fno-strict-aliasing -fno-common -Werror-implicit-function-declaration -Wno-format-security -fno-delete-null-pointer-checks -O2 -m64 -mno-mmx -mno-sse -mtune=generic -mno-red-zone -mcmodel=kernel -funit-at-a-time -maccumulate-outgoing-args -fstack-protector -DCONFIG_AS_CFI=1 -DCONFIG_AS_CFI_SIGNAL_FRAME=1 -DCONFIG_AS_CFI_SECTIONS=1 -DCONFIG_AS_FXSAVEQ=1 -DCONFIG_AS_AVX=1 -DCONFIG_AS_AVX2=1 -pipe -Wno-sign-compare -fno-asynchronous-unwind-tables -mno-sse -mno-mmx -mno-sse2 -mno-3dnow -mno-avx -Wframe-larger-than=2048 -Wno-unused-but-set-variable -fomit-frame-pointer -g -Wdeclaration-after-statement -Wno-pointer-sign -fno-strict-overflow -fconserve-stack -DCC_HAVE_ASM_GOTO   -I/tmp/selfgz21288/NVIDIA-Linux-x86_64-319.37/kernel -Wall -MD -Wsign-compare -Wno-cast-qual -Wno-error -D__KERNEL__ -DMODULE -DNVRM -DNV_VERSION_STRING=\"319.37\" -Wno-unused-function -Wuninitialized -mno-red-zone -mcmodel=kernel -UDEBUG -U_DEBUG -DNDEBUG -D__linux__  -DMODULE  -D"KBUILD_STR(s)=#s" -D"KBUILD_BASENAME=KBUILD_STR
  147.    (nv_cray)"  -D"KBUILD_MODNAME=KBUILD_STR(nvidia)" -c -o /tmp/selfgz21288/NVIDIA-Linux-x86_64-319.37/kernel/.tmp_nv-cray.o /tmp/selfgz21288/NVIDIA-Linux-x86_64-319.37/kernel/nv-cray.c
  148.    In file included from /usr/src/linux-headers-3.12-kali1-common/include/linux/kernel.h:10:0,
  149.                     from /usr/src/linux-headers-3.12-kali1-common/include/linux/sched.h:15,
  150.                     from /usr/src/linux-headers-3.12-kali1-common/include/linux/utsname.h:5,
  151.                     from /tmp/selfgz21288/NVIDIA-Linux-x86_64-319.37/kernel/nv-linux.h:44,
  152.                     from /tmp/selfgz21288/NVIDIA-Linux-x86_64-319.37/kernel/nv-cray.c:15:
  153.    /usr/src/linux-headers-3.12-kali1-common/include/linux/bitops.h: In function ‘hweight_long’:
  154.    /usr/src/linux-headers-3.12-kali1-common/include/linux/bitops.h:66:41: warning: signed and unsigned type in conditional expression [-Wsign-compare]
  155.    In file included from /usr/src/linux-headers-3.12-kali1-common/arch/x86/include/asm/cpumask.h:4:0,
  156.                     from /usr/src/linux-headers-3.12-kali1-common/arch/x86/include/asm/msr.h:10,
  157.                     from /usr/src/linux-headers-3.12-kali1-common/arch/x86/include/asm/processor.h:20,
  158.                     from /usr/src/linux-headers-3.12-kali1-common/arch/x86/include/asm/thread_info.h:22,
  159.                     from /usr/src/linux-headers-3.12-kali1-common/include/linux/thread_info.h:54,
  160.                     from /usr/src/linux-headers-3.12-kali1-common/include/linux/preempt.h:9,
  161.                     from /usr/src/linux-headers-3.12-kali1-common/include/linux/spinlock.h:50,
  162.                     from /usr/src/linux-headers-3.12-kali1-common/include/linux/seqlock.h:35,
  163.                     from /usr/src/linux-headers-3.12-kali1-common/include/linux/time.h:5,
  164.                     from /usr/src/linux-headers-3.12-kali1-common/include/uapi/linux/timex.h:56,
  165.                     from /usr/src/linux-headers-3.12-kali1-common/include/linux/timex.h:56,
  166.                     from /usr/src/linux-headers-3.12-kali1-common/include/linux/sched.h:17,
  167.                     from /usr/src/linux-headers-3.12-kali1-common/include/linux/utsname.h:5,
  168.                     from /tmp/selfgz21288/NVIDIA-Linux-x86_64-319.37/kernel/nv-linux.h:44,
  169.                     from /tmp/selfgz21288/NVIDIA-Linux-x86_64-319.37/kernel/nv-cray.c:15:
  170.    /usr/src/linux-headers-3.12-kali1-common/include/linux/cpumask.h: In function ‘cpumask_parse’:
  171.    /usr/src/linux-headers-3.12-kali1-common/include/linux/cpumask.h:603:26: warning: signed and unsigned type in conditional expression [-Wsign-compare]
  172.    In file included from /usr/src/linux-headers-3.12-kali1-common/arch/x86/include/asm/uaccess.h:542:0,
  173.                     from /usr/src/linux-headers-3.12-kali1-common/include/linux/poll.h:11,
  174.                     from /tmp/selfgz21288/NVIDIA-Linux-x86_64-319.37/kernel/nv-linux.h:115,
  175.                     from /tmp/selfgz21288/NVIDIA-Linux-x86_64-319.37/kernel/nv-cray.c:15:
  176.    /usr/src/linux-headers-3.12-kali1-common/arch/x86/include/asm/uaccess_64.h: In function ‘copy_from_user’:
  177.    /usr/src/linux-headers-3.12-kali1-common/arch/x86/include/asm/uaccess_64.h:62:6: warning: comparison between signed and unsigned integer expressions [-Wsign-compare]
  178.      cc -Wp,-MD,/tmp/selfgz21288/NVIDIA-Linux-x86_64-319.37/kernel/.nv-drm.o.d  -nostdinc -isystem /usr/lib/gcc/x86_64-linux-gnu/4.7/include -I/usr/src/linux-headers-3.12-kali1-common/arch/x86/include -Iarch/x86/include/generated  -I/usr/src/linux-headers-3.12-kali1-common/include -Iinclude -I/usr/src/linux-headers-3.12-kali1-common/arch/x86/include/uapi -Iarch/x86/include/generated/uapi -I/usr/src/linux-headers-3.12-kali1-common/include/uapi -Iinclude/generated/uapi -include /usr/src/linux-headers-3.12-kali1-common/include/linux/kconfig.h   -I/tmp/selfgz21288/NVIDIA-Linux-x86_64-319.37/kernel -D__KERNEL__ -Wall -Wundef -Wstrict-prototypes -Wno-trigraphs -fno-strict-aliasing -fno-common -Werror-implicit-function-declaration -Wno-format-security -fno-delete-null-pointer-checks -O2 -m64 -mno-mmx -mno-sse -mtune=generic -mno-red-zone -mcmodel=kernel -funit-at-a-time -maccumulate-outgoing-args -fstack-protector -DCONFIG_AS_CFI=1 -DCONFIG_
  179.    AS_CFI_SIGNAL_FRAME=1 -DCONFIG_AS_CFI_SECTIONS=1 -DCONFIG_AS_FXSAVEQ=1 -DCONFIG_AS_AVX=1 -DCONFIG_AS_AVX2=1 -pipe -Wno-sign-compare -fno-asynchronous-unwind-tables -mno-sse -mno-mmx -mno-sse2 -mno-3dnow -mno-avx -Wframe-larger-than=2048 -Wno-unused-but-set-variable -fomit-frame-pointer -g -Wdeclaration-after-statement -Wno-pointer-sign -fno-strict-overflow -fconserve-stack -DCC_HAVE_ASM_GOTO   -I/tmp/selfgz21288/NVIDIA-Linux-x86_64-319.37/kernel -Wall -MD -Wsign-compare -Wno-cast-qual -Wno-error -D__KERNEL__ -DMODULE -DNVRM -DNV_VERSION_STRING=\"319.37\" -Wno-unused-function -Wuninitialized -mno-red-zone -mcmodel=kernel -UDEBUG -U_DEBUG -DNDEBUG -D__linux__  -DMODULE  -D"KBUILD_STR(s)=#s" -D"KBUILD_BASENAME=KBUILD_STR(nv_drm)"  -D"KBUILD_MODNAME=KBUILD_STR(nvidia)" -c -o /tmp/selfgz21288/NVIDIA-Linux-x86_64-319.37/kernel/.tmp_nv-drm.o /tmp/selfgz21288/NVIDIA-Linux-x86_64-319.37/kernel/nv-drm.c
  180.    In file included from /usr/src/linux-headers-3.12-kali1-common/include/linux/kernel.h:10:0,
  181.                     from /usr/src/linux-headers-3.12-kali1-common/include/linux/sched.h:15,
  182.                     from /usr/src/linux-headers-3.12-kali1-common/include/linux/utsname.h:5,
  183.                     from /tmp/selfgz21288/NVIDIA-Linux-x86_64-319.37/kernel/nv-linux.h:44,
  184.                     from /tmp/selfgz21288/NVIDIA-Linux-x86_64-319.37/kernel/nv-drm.c:15:
  185.    /usr/src/linux-headers-3.12-kali1-common/include/linux/bitops.h: In function ‘hweight_long’:
  186.    /usr/src/linux-headers-3.12-kali1-common/include/linux/bitops.h:66:41: warning: signed and unsigned type in conditional expression [-Wsign-compare]
  187.    In file included from /usr/src/linux-headers-3.12-kali1-common/arch/x86/include/asm/cpumask.h:4:0,
  188.                     from /usr/src/linux-headers-3.12-kali1-common/arch/x86/include/asm/msr.h:10,
  189.                     from /usr/src/linux-headers-3.12-kali1-common/arch/x86/include/asm/processor.h:20,
  190.                     from /usr/src/linux-headers-3.12-kali1-common/arch/x86/include/asm/thread_info.h:22,
  191.                     from /usr/src/linux-headers-3.12-kali1-common/include/linux/thread_info.h:54,
  192.                     from /usr/src/linux-headers-3.12-kali1-common/include/linux/preempt.h:9,
  193.                     from /usr/src/linux-headers-3.12-kali1-common/include/linux/spinlock.h:50,
  194.                     from /usr/src/linux-headers-3.12-kali1-common/include/linux/seqlock.h:35,
  195.                     from /usr/src/linux-headers-3.12-kali1-common/include/linux/time.h:5,
  196.                     from /usr/src/linux-headers-3.12-kali1-common/include/uapi/linux/timex.h:56,
  197.                     from /usr/src/linux-headers-3.12-kali1-common/include/linux/timex.h:56,
  198.                     from /usr/src/linux-headers-3.12-kali1-common/include/linux/sched.h:17,
  199.                     from /usr/src/linux-headers-3.12-kali1-common/include/linux/utsname.h:5,
  200.                     from /tmp/selfgz21288/NVIDIA-Linux-x86_64-319.37/kernel/nv-linux.h:44,
  201.                     from /tmp/selfgz21288/NVIDIA-Linux-x86_64-319.37/kernel/nv-drm.c:15:
  202.    /usr/src/linux-headers-3.12-kali1-common/include/linux/cpumask.h: In function ‘cpumask_parse’:
  203.    /usr/src/linux-headers-3.12-kali1-common/include/linux/cpumask.h:603:26: warning: signed and unsigned type in conditional expression [-Wsign-compare]
  204.    In file included from /usr/src/linux-headers-3.12-kali1-common/arch/x86/include/asm/uaccess.h:542:0,
  205.                     from /usr/src/linux-headers-3.12-kali1-common/include/linux/poll.h:11,
  206.                     from /tmp/selfgz21288/NVIDIA-Linux-x86_64-319.37/kernel/nv-linux.h:115,
  207.                     from /tmp/selfgz21288/NVIDIA-Linux-x86_64-319.37/kernel/nv-drm.c:15:
  208.    /usr/src/linux-headers-3.12-kali1-common/arch/x86/include/asm/uaccess_64.h: In function ‘copy_from_user’:
  209.    /usr/src/linux-headers-3.12-kali1-common/arch/x86/include/asm/uaccess_64.h:62:6: warning: comparison between signed and unsigned integer expressions [-Wsign-compare]
  210.    In file included from /usr/src/linux-headers-3.12-kali1-common/include/drm/drm_crtc.h:32:0,
  211.                     from /usr/src/linux-headers-3.12-kali1-common/include/drm/drmP.h:701,
  212.                     from /tmp/selfgz21288/NVIDIA-Linux-x86_64-319.37/kernel/nv-drm.c:19:
  213.    /usr/src/linux-headers-3.12-kali1-common/include/linux/fb.h: In function ‘__fb_pad_aligned_buffer’:
  214.    /usr/src/linux-headers-3.12-kali1-common/include/linux/fb.h:650:17: warning: comparison between signed and unsigned integer expressions [-Wsign-compare]
  215.    /tmp/selfgz21288/NVIDIA-Linux-x86_64-319.37/kernel/nv-drm.c: At top level:
  216.    /tmp/selfgz21288/NVIDIA-Linux-x86_64-319.37/kernel/nv-drm.c:109:15: error: ‘drm_fasync’ undeclared here (not in a function)
  217.    /tmp/selfgz21288/NVIDIA-Linux-x86_64-319.37/kernel/nv-drm.c: In function ‘nv_alloc_os_descriptor_handle’:
  218.    /tmp/selfgz21288/NVIDIA-Linux-x86_64-319.37/kernel/nv-drm.c:205:9: error: void value not ignored as it ought to be
  219.    make[4]: *** [/tmp/selfgz21288/NVIDIA-Linux-x86_64-319.37/kernel/nv-drm.o] Error 1
  220.    make[3]: *** [_module_/tmp/selfgz21288/NVIDIA-Linux-x86_64-319.37/kernel] Error 2
  221.    make[2]: *** [sub-make] Error 2
  222.    NVIDIA: left KBUILD.
  223.    nvidia.ko failed to build!
  224.    make[1]: *** [module] Error 1
  225.    make: *** [module] Error 2
  226. -> Error.
  227. ERROR: Unable to build the NVIDIA kernel module.
  228. ERROR: Installation has failed.  Please see the file '/var/log/nvidia-installer.log' for details.  You may find suggestions on fixing installation problems in the README available on the Linux driver download page at www.nvidia.com.
RAW Paste Data
We use cookies for various purposes including analytics. By continuing to use Pastebin, you agree to our use of cookies as described in the Cookies Policy. OK, I Understand
 
Top