Guest User

Untitled

a guest
Jan 29th, 2017
166
Never
Not a member of Pastebin yet? Sign Up, it unlocks many cool features!
  1. make[3]: Entering directory '/tmp/yaourt-tmp-juliohm/aur-gstreamer0.10-ugly/src/gst-plugins-ugly/gst/asfdemux'
  2. CC libgstasf_la-gstasfdemux.lo
  3. CC libgstasf_la-gstasf.lo
  4. In file included from /usr/include/gstreamer-0.10/gst/gst.h:32:0,
  5. from gstasf.c:24:
  6. /usr/include/gstreamer-0.10/gst/gstversion.h:48:27: error: expected declaration specifiers or ‘...’ before ‘(’ token
  7. #define GST_VERSION_MAJOR (0)
  8. ^
  9. gstasf.c:68:21: note: in expansion of macro ‘GST_VERSION_MAJOR’
  10. GST_PLUGIN_DEFINE2 (GST_VERSION_MAJOR,
  11. ^~~~~~~~~~~~~~~~~
  12. /usr/include/gstreamer-0.10/gst/gstversion.h:54:27: error: expected declaration specifiers or ‘...’ before ‘(’ token
  13. #define GST_VERSION_MINOR (10)
  14. ^
  15. gstasf.c:69:5: note: in expansion of macro ‘GST_VERSION_MINOR’
  16. GST_VERSION_MINOR,
  17. ^~~~~~~~~~~~~~~~~
  18. gstasf.c:70:5: error: unknown type name ‘asf’
  19. asf,
  20. ^~~
  21. gstasf.c:71:5: error: expected declaration specifiers or ‘...’ before string constant
  22. "Demuxes and muxes audio and video in Microsofts ASF format",
  23. ^~~~~~~~~~~~~~~~~~~~~~~~~~~~~~~~~~~~~~~~~~~~~~~~~~~~~~~~~~~~
  24. gstasf.c:72:5: error: expected declaration specifiers or ‘...’ before ‘plugin_init’
  25. plugin_init, VERSION, GST_LICENSE, GST_PACKAGE_NAME, GST_PACKAGE_ORIGIN)
  26. ^~~~~~~~~~~
  27. In file included from gstasf.c:21:0:
  28. ../../config.h:264:17: error: expected declaration specifiers or ‘...’ before string constant
  29. #define VERSION "0.10.19"
  30. ^
  31. gstasf.c:72:18: note: in expansion of macro ‘VERSION’
  32. plugin_init, VERSION, GST_LICENSE, GST_PACKAGE_NAME, GST_PACKAGE_ORIGIN)
  33. ^~~~~~~
  34. ../../config.h:42:21: error: expected declaration specifiers or ‘...’ before string constant
  35. #define GST_LICENSE "LGPL"
  36. ^
  37. gstasf.c:72:27: note: in expansion of macro ‘GST_LICENSE’
  38. plugin_init, VERSION, GST_LICENSE, GST_PACKAGE_NAME, GST_PACKAGE_ORIGIN)
  39. ^~~~~~~~~~~
  40. ../../config.h:45:26: error: expected declaration specifiers or ‘...’ before string constant
  41. #define GST_PACKAGE_NAME "GStreamer Ugly Plugins (Archlinux)"
  42. ^
  43. ../../config.h:45:26: note: in definition of macro ‘GST_PACKAGE_NAME’
  44. #define GST_PACKAGE_NAME "GStreamer Ugly Plugins (Archlinux)"
  45. ^~~~~~~~~~~~~~~~~~~~~~~~~~~~~~~~~~~~
  46. ../../config.h:48:28: error: expected declaration specifiers or ‘...’ before string constant
  47. #define GST_PACKAGE_ORIGIN "http://www.archlinux.org/"
  48. ^
  49. gstasf.c:72:58: note: in expansion of macro ‘GST_PACKAGE_ORIGIN’
  50. plugin_init, VERSION, GST_LICENSE, GST_PACKAGE_NAME, GST_PACKAGE_ORIGIN)
  51. ^~~~~~~~~~~~~~~~~~
  52. gstasf.c:35:1: warning: ‘plugin_init’ defined but not used [-Wunused-function]
  53. plugin_init (GstPlugin * plugin)
  54. ^~~~~~~~~~~
  55. make[3]: *** [Makefile:612: libgstasf_la-gstasf.lo] Error 1
  56. make[3]: Leaving directory '/tmp/yaourt-tmp-juliohm/aur-gstreamer0.10-ugly/src/gst-plugins-ugly/gst/asfdemux'
  57. make[2]: *** [Makefile:781: asfdemux] Error 2
  58. make[2]: Leaving directory '/tmp/yaourt-tmp-juliohm/aur-gstreamer0.10-ugly/src/gst-plugins-ugly/gst'
  59. make[1]: *** [Makefile:600: all-recursive] Error 1
  60. make[1]: Leaving directory '/tmp/yaourt-tmp-juliohm/aur-gstreamer0.10-ugly/src/gst-plugins-ugly'
  61. make: *** [Makefile:529: all] Error 2
  62. == ERROR: A failure occurred in build().
  63. Aborting...
  64. == ERROR: Makepkg was unable to build gstreamer0.10-ugly.
RAW Paste Data