SHARE
TWEET

Untitled

a guest Jun 23rd, 2016 73 Never
Not a member of Pastebin yet? Sign Up, it unlocks many cool features!
  1. #################################################
  2.          ForgeGradle 2.2-SNAPSHOT-59f33ec        
  3.   https://github.com/MinecraftForge/ForgeGradle  
  4. #################################################
  5.                Powered by MCP unknown              
  6.              http://modcoderpack.com            
  7.          by: Searge, ProfMobius, Fesh0r,        
  8.          R4wk, ZeuX, IngisKahn, bspkrs          
  9. #################################################
  10. :deobfCompileDummyTask
  11. :deobfProvidedDummyTask
  12. :getVersionJson
  13. :extractUserdev UP-TO-DATE
  14. :extractDependencyATs SKIPPED
  15. :extractMcpData SKIPPED
  16. :extractMcpMappings SKIPPED
  17. :genSrgs SKIPPED
  18. :downloadClient SKIPPED
  19. :downloadServer SKIPPED
  20. :splitServerJar SKIPPED
  21. :mergeJars SKIPPED
  22. :deobfMcSRG SKIPPED
  23. :decompileMc FAILED
  24.  
  25. FAILURE: Build failed with an exception.
  26.  
  27. * What went wrong:
  28. Execution failed for task ':decompileMc'.
  29. > Java heap space
  30.  
  31. * Try:
  32. Run with --info or --debug option to get more log output.
  33.  
  34. * Exception is:
  35. org.gradle.api.tasks.TaskExecutionException: Execution failed for task ':decompileMc'.
  36.     at org.gradle.api.internal.tasks.execution.ExecuteActionsTaskExecuter.executeActions(ExecuteActionsTaskExecuter.java:69)
  37.     at org.gradle.api.internal.tasks.execution.ExecuteActionsTaskExecuter.execute(ExecuteActionsTaskExecuter.java:46)
  38.     at org.gradle.api.internal.tasks.execution.PostExecutionAnalysisTaskExecuter.execute(PostExecutionAnalysisTaskExecuter.java:35)
  39.     at org.gradle.api.internal.tasks.execution.SkipUpToDateTaskExecuter.execute(SkipUpToDateTaskExecuter.java:64)
  40.     at org.gradle.api.internal.tasks.execution.ValidatingTaskExecuter.execute(ValidatingTaskExecuter.java:58)
  41.     at org.gradle.api.internal.tasks.execution.SkipEmptySourceFilesTaskExecuter.execute(SkipEmptySourceFilesTaskExecuter.java:52)
  42.     at org.gradle.api.internal.tasks.execution.SkipTaskWithNoActionsExecuter.execute(SkipTaskWithNoActionsExecuter.java:52)
  43.     at org.gradle.api.internal.tasks.execution.SkipOnlyIfTaskExecuter.execute(SkipOnlyIfTaskExecuter.java:53)
  44.     at org.gradle.api.internal.tasks.execution.ExecuteAtMostOnceTaskExecuter.execute(ExecuteAtMostOnceTaskExecuter.java:43)
  45.     at org.gradle.execution.taskgraph.DefaultTaskGraphExecuter$EventFiringTaskWorker.execute(DefaultTaskGraphExecuter.java:203)
  46.     at org.gradle.execution.taskgraph.DefaultTaskGraphExecuter$EventFiringTaskWorker.execute(DefaultTaskGraphExecuter.java:185)
  47.     at org.gradle.execution.taskgraph.AbstractTaskPlanExecutor$TaskExecutorWorker.processTask(AbstractTaskPlanExecutor.java:62)
  48.     at org.gradle.execution.taskgraph.AbstractTaskPlanExecutor$TaskExecutorWorker.run(AbstractTaskPlanExecutor.java:50)
  49.     at org.gradle.execution.taskgraph.DefaultTaskPlanExecutor.process(DefaultTaskPlanExecutor.java:25)
  50.     at org.gradle.execution.taskgraph.DefaultTaskGraphExecuter.execute(DefaultTaskGraphExecuter.java:110)
  51.     at org.gradle.execution.SelectedTaskExecutionAction.execute(SelectedTaskExecutionAction.java:37)
  52.     at org.gradle.execution.DefaultBuildExecuter.execute(DefaultBuildExecuter.java:37)
  53.     at org.gradle.execution.DefaultBuildExecuter.access$000(DefaultBuildExecuter.java:23)
  54.     at org.gradle.execution.DefaultBuildExecuter$1.proceed(DefaultBuildExecuter.java:43)
  55.     at org.gradle.execution.DryRunBuildExecutionAction.execute(DryRunBuildExecutionAction.java:32)
  56.     at org.gradle.execution.DefaultBuildExecuter.execute(DefaultBuildExecuter.java:37)
  57.     at org.gradle.execution.DefaultBuildExecuter.execute(DefaultBuildExecuter.java:30)
  58.     at org.gradle.initialization.DefaultGradleLauncher$4.run(DefaultGradleLauncher.java:155)
  59.     at org.gradle.internal.Factories$1.create(Factories.java:22)
  60.     at org.gradle.internal.progress.DefaultBuildOperationExecutor.run(DefaultBuildOperationExecutor.java:90)
  61.     at org.gradle.internal.progress.DefaultBuildOperationExecutor.run(DefaultBuildOperationExecutor.java:52)
  62.     at org.gradle.initialization.DefaultGradleLauncher.doBuildStages(DefaultGradleLauncher.java:152)
  63.     at org.gradle.initialization.DefaultGradleLauncher.access$200(DefaultGradleLauncher.java:33)
  64.     at org.gradle.initialization.DefaultGradleLauncher$1.create(DefaultGradleLauncher.java:100)
  65.     at org.gradle.initialization.DefaultGradleLauncher$1.create(DefaultGradleLauncher.java:94)
  66.     at org.gradle.internal.progress.DefaultBuildOperationExecutor.run(DefaultBuildOperationExecutor.java:90)
  67.     at org.gradle.internal.progress.DefaultBuildOperationExecutor.run(DefaultBuildOperationExecutor.java:62)
  68.     at org.gradle.initialization.DefaultGradleLauncher.doBuild(DefaultGradleLauncher.java:94)
  69.     at org.gradle.initialization.DefaultGradleLauncher.run(DefaultGradleLauncher.java:83)
  70.     at org.gradle.launcher.exec.InProcessBuildActionExecuter$DefaultBuildController.run(InProcessBuildActionExecuter.java:94)
  71.     at org.gradle.tooling.internal.provider.ExecuteBuildActionRunner.run(ExecuteBuildActionRunner.java:28)
  72.     at org.gradle.launcher.exec.ChainingBuildActionRunner.run(ChainingBuildActionRunner.java:35)
  73.     at org.gradle.launcher.exec.InProcessBuildActionExecuter.execute(InProcessBuildActionExecuter.java:43)
  74.     at org.gradle.launcher.exec.InProcessBuildActionExecuter.execute(InProcessBuildActionExecuter.java:28)
  75.     at org.gradle.launcher.exec.ContinuousBuildActionExecuter.execute(ContinuousBuildActionExecuter.java:77)
  76.     at org.gradle.launcher.exec.ContinuousBuildActionExecuter.execute(ContinuousBuildActionExecuter.java:47)
  77.     at org.gradle.launcher.exec.DaemonUsageSuggestingBuildActionExecuter.execute(DaemonUsageSuggestingBuildActionExecuter.java:51)
  78.     at org.gradle.launcher.exec.DaemonUsageSuggestingBuildActionExecuter.execute(DaemonUsageSuggestingBuildActionExecuter.java:28)
  79.     at org.gradle.launcher.cli.RunBuildAction.run(RunBuildAction.java:43)
  80.     at org.gradle.internal.Actions$RunnableActionAdapter.execute(Actions.java:170)
  81.     at org.gradle.launcher.cli.CommandLineActionFactory$ParseAndBuildAction.execute(CommandLineActionFactory.java:237)
  82.     at org.gradle.launcher.cli.CommandLineActionFactory$ParseAndBuildAction.execute(CommandLineActionFactory.java:210)
  83.     at org.gradle.launcher.cli.JavaRuntimeValidationAction.execute(JavaRuntimeValidationAction.java:35)
  84.     at org.gradle.launcher.cli.JavaRuntimeValidationAction.execute(JavaRuntimeValidationAction.java:24)
  85.     at org.gradle.launcher.cli.CommandLineActionFactory$WithLogging.execute(CommandLineActionFactory.java:206)
  86.     at org.gradle.launcher.cli.CommandLineActionFactory$WithLogging.execute(CommandLineActionFactory.java:169)
  87.     at org.gradle.launcher.cli.ExceptionReportingAction.execute(ExceptionReportingAction.java:33)
  88.     at org.gradle.launcher.cli.ExceptionReportingAction.execute(ExceptionReportingAction.java:22)
  89.     at org.gradle.launcher.Main.doAction(Main.java:33)
  90.     at org.gradle.launcher.bootstrap.EntryPoint.run(EntryPoint.java:45)
  91.     at org.gradle.launcher.bootstrap.ProcessBootstrap.runNoExit(ProcessBootstrap.java:54)
  92.     at org.gradle.launcher.bootstrap.ProcessBootstrap.run(ProcessBootstrap.java:35)
  93.     at org.gradle.launcher.GradleMain.main(GradleMain.java:23)
  94.     at org.gradle.wrapper.BootstrapMainStarter.start(BootstrapMainStarter.java:30)
  95.     at org.gradle.wrapper.WrapperExecutor.execute(WrapperExecutor.java:127)
  96.     at org.gradle.wrapper.GradleWrapperMain.main(GradleWrapperMain.java:61)
  97. Caused by: java.lang.OutOfMemoryError: Java heap space
  98.     at org.jetbrains.java.decompiler.struct.consts.ConstantPool.<init>(ConstantPool.java:54)
  99.     at org.jetbrains.java.decompiler.struct.StructClass.<init>(StructClass.java:87)
  100.     at org.jetbrains.java.decompiler.struct.StructClass.<init>(StructClass.java:75)
  101.     at org.jetbrains.java.decompiler.struct.StructContext.addArchive(StructContext.java:167)
  102.     at org.jetbrains.java.decompiler.struct.StructContext.addSpace(StructContext.java:100)
  103.     at org.jetbrains.java.decompiler.struct.StructContext.addSpace(StructContext.java:78)
  104.     at org.jetbrains.java.decompiler.main.Fernflower.addAllClasspath(Fernflower.java:119)
  105.     at org.jetbrains.java.decompiler.main.Fernflower.<init>(Fernflower.java:48)
  106.     at org.jetbrains.java.decompiler.main.decompiler.BaseDecompiler.<init>(BaseDecompiler.java:32)
  107.     at net.minecraftforge.gradle.tasks.ApplyFernFlowerTask.applyFernFlower(ApplyFernFlowerTask.java:94)
  108.     at org.gradle.internal.reflect.JavaMethod.invoke(JavaMethod.java:75)
  109.     at org.gradle.api.internal.project.taskfactory.AnnotationProcessingTaskFactory$StandardTaskAction.doExecute(AnnotationProcessingTaskFactory.java:226)
  110.     at org.gradle.api.internal.project.taskfactory.AnnotationProcessingTaskFactory$StandardTaskAction.execute(AnnotationProcessingTaskFactory.java:219)
  111.     at org.gradle.api.internal.project.taskfactory.AnnotationProcessingTaskFactory$StandardTaskAction.execute(AnnotationProcessingTaskFactory.java:208)
  112.     at org.gradle.api.internal.AbstractTask$TaskActionWrapper.execute(AbstractTask.java:585)
  113.     at org.gradle.api.internal.AbstractTask$TaskActionWrapper.execute(AbstractTask.java:568)
  114.     at org.gradle.api.internal.tasks.execution.ExecuteActionsTaskExecuter.executeAction(ExecuteActionsTaskExecuter.java:80)
  115.     at org.gradle.api.internal.tasks.execution.ExecuteActionsTaskExecuter.executeActions(ExecuteActionsTaskExecuter.java:61)
  116.     at org.gradle.api.internal.tasks.execution.ExecuteActionsTaskExecuter.execute(ExecuteActionsTaskExecuter.java:46)
  117.     at org.gradle.api.internal.tasks.execution.PostExecutionAnalysisTaskExecuter.execute(PostExecutionAnalysisTaskExecuter.java:35)
  118.     at org.gradle.api.internal.tasks.execution.SkipUpToDateTaskExecuter.execute(SkipUpToDateTaskExecuter.java:64)
  119.     at org.gradle.api.internal.tasks.execution.ValidatingTaskExecuter.execute(ValidatingTaskExecuter.java:58)
  120.  
  121.  
  122. BUILD FAILED
  123.  
  124. Total time: 31.522 secs
RAW Paste Data
We use cookies for various purposes including analytics. By continuing to use Pastebin, you agree to our use of cookies as described in the Cookies Policy. OK, I Understand
 
Top