Guest User

Untitled

a guest
Aug 21st, 2013
91
Never
Not a member of Pastebin yet? Sign Up, it unlocks many cool features!
  1. [root@joaoekika minetest]# make -j2
  2. Scanning dependencies of target jthread
  3. [ 1%] Building CXX object src/json/CMakeFiles/jsoncpp.dir/jsoncpp.cpp.o
  4. [ 2%] Building CXX object src/jthread/CMakeFiles/jthread.dir/pthread/jmutex.cpp.o
  5. [ 3%] Building CXX object src/jthread/CMakeFiles/jthread.dir/pthread/jthread.cpp.o
  6. Linking CXX static library libjthread.a
  7. [ 3%] Built target jthread
  8. Linking CXX static library libjsoncpp.a
  9. [ 3%] Built target jsoncpp
  10. Scanning dependencies of target minetestserver
  11. [ 4%] [ 5%] Building CXX object src/CMakeFiles/minetestserver.dir/script/common/c_content.cpp.o
  12. Building CXX object src/CMakeFiles/minetestserver.dir/script/common/c_converter.cpp.o
  13. In file included from /minetest/src/server.h:25,
  14. from /minetest/src/script/common/c_content.cpp:29:
  15. /minetest/src/map.h:481: error: reference to 'u64' is ambiguous
  16. /minetest/src/irrlichttypes.h:37: error: candidates are: typedef uint64_t u64
  17. /usr/include/irrlicht/irrTypes.h:98: error: typedef long unsigned int irr::u64
  18. /minetest/src/map.h:481: error: reference to 'u64' is ambiguous
  19. /minetest/src/irrlichttypes.h:37: error: candidates are: typedef uint64_t u64
  20. /usr/include/irrlicht/irrTypes.h:98: error: typedef long unsigned int irr::u64
  21. /minetest/src/map.h:481: error: 'u64' does not name a type
  22. /minetest/src/map.h:493: error: reference to 'u64' is ambiguous
  23. /minetest/src/irrlichttypes.h:37: error: candidates are: typedef uint64_t u64
  24. /usr/include/irrlicht/irrTypes.h:98: error: typedef long unsigned int irr::u64
  25. /minetest/src/map.h:493: error: reference to 'u64' is ambiguous
  26. /minetest/src/irrlichttypes.h:37: error: candidates are: typedef uint64_t u64
  27. /usr/include/irrlicht/irrTypes.h:98: error: typedef long unsigned int irr::u64
  28. /minetest/src/map.h:493: error: 'u64' does not name a type
  29. [ 6%] Building CXX object src/CMakeFiles/minetestserver.dir/script/common/c_internal.cpp.o
  30. In file included from /minetest/src/mapgen.h:29,
  31. from /minetest/src/script/common/c_content.cpp:33:
  32. /minetest/src/settings.h:566: error: reference to 'u64' is ambiguous
  33. /minetest/src/irrlichttypes.h:37: error: candidates are: typedef uint64_t u64
  34. /usr/include/irrlicht/irrTypes.h:98: error: typedef long unsigned int irr::u64
  35. /minetest/src/settings.h:566: error: reference to 'u64' is ambiguous
  36. /minetest/src/irrlichttypes.h:37: error: candidates are: typedef uint64_t u64
  37. /usr/include/irrlicht/irrTypes.h:98: error: typedef long unsigned int irr::u64
  38. /minetest/src/settings.h:566: error: 'u64' does not name a type
  39. /minetest/src/settings.h:887: error: reference to 'u64' is ambiguous
  40. /minetest/src/irrlichttypes.h:37: error: candidates are: typedef uint64_t u64
  41. /usr/include/irrlicht/irrTypes.h:98: error: typedef long unsigned int irr::u64
  42. /minetest/src/settings.h:887: error: reference to 'u64' is ambiguous
  43. /minetest/src/irrlichttypes.h:37: error: candidates are: typedef uint64_t u64
  44. /usr/include/irrlicht/irrTypes.h:98: error: typedef long unsigned int irr::u64
  45. /minetest/src/settings.h:887: error: 'u64' has not been declared
  46. /minetest/src/settings.h: In member function 'bool Settings::getStruct(std::string, std::string, void*, size_t)':
  47. /minetest/src/settings.h:629: error: reference to 'u64' is ambiguous
  48. /minetest/src/irrlichttypes.h:37: error: candidates are: typedef uint64_t u64
  49. /usr/include/irrlicht/irrTypes.h:98: error: typedef long unsigned int irr::u64
  50. /minetest/src/settings.h:629: error: reference to 'u64' is ambiguous
  51. /minetest/src/irrlichttypes.h:37: error: candidates are: typedef uint64_t u64
  52. /usr/include/irrlicht/irrTypes.h:98: error: typedef long unsigned int irr::u64
  53. /minetest/src/settings.h:629: error: reference to 'u64' is ambiguous
  54. /minetest/src/irrlichttypes.h:37: error: candidates are: typedef uint64_t u64
  55. /usr/include/irrlicht/irrTypes.h:98: error: typedef long unsigned int irr::u64
  56. /minetest/src/settings.h:629: error: reference to 'u64' is ambiguous
  57. /minetest/src/irrlichttypes.h:37: error: candidates are: typedef uint64_t u64
  58. /usr/include/irrlicht/irrTypes.h:98: error: typedef long unsigned int irr::u64
  59. /minetest/src/settings.h:629: error: reference to 'u64' is ambiguous
  60. /minetest/src/irrlichttypes.h:37: error: candidates are: typedef uint64_t u64
  61. /usr/include/irrlicht/irrTypes.h:98: error: typedef long unsigned int irr::u64
  62. /minetest/src/settings.h:629: error: reference to 'u64' is ambiguous
  63. /minetest/src/irrlichttypes.h:37: error: candidates are: typedef uint64_t u64
  64. /usr/include/irrlicht/irrTypes.h:98: error: typedef long unsigned int irr::u64
  65. /minetest/src/settings.h:630: error: reference to 'u64' is ambiguous
  66. /minetest/src/irrlichttypes.h:37: error: candidates are: typedef uint64_t u64
  67. /usr/include/irrlicht/irrTypes.h:98: error: typedef long unsigned int irr::u64
  68. /minetest/src/settings.h:630: error: reference to 'u64' is ambiguous
  69. /minetest/src/irrlichttypes.h:37: error: candidates are: typedef uint64_t u64
  70. /usr/include/irrlicht/irrTypes.h:98: error: typedef long unsigned int irr::u64
  71. /minetest/src/settings.h:632: error: reference to 'u64' is ambiguous
  72. /minetest/src/irrlichttypes.h:37: error: candidates are: typedef uint64_t u64
  73. /usr/include/irrlicht/irrTypes.h:98: error: typedef long unsigned int irr::u64
  74. /minetest/src/settings.h:632: error: reference to 'u64' is ambiguous
  75. /minetest/src/irrlichttypes.h:37: error: candidates are: typedef uint64_t u64
  76. /usr/include/irrlicht/irrTypes.h:98: error: typedef long unsigned int irr::u64
  77. /minetest/src/settings.h:632: error: expected primary-expression before ')' token
  78. /minetest/src/settings.h:632: error: expected ';' before 'bufpos'
  79. /minetest/src/settings.h:634: error: reference to 's64' is ambiguous
  80. /minetest/src/irrlichttypes.h:36: error: candidates are: typedef int64_t s64
  81. /usr/include/irrlicht/irrTypes.h:108: error: typedef long int irr::s64
  82. /minetest/src/settings.h:634: error: reference to 's64' is ambiguous
  83. /minetest/src/irrlichttypes.h:36: error: candidates are: typedef int64_t s64
  84. /usr/include/irrlicht/irrTypes.h:108: error: typedef long int irr::s64
  85. /minetest/src/settings.h:634: error: expected primary-expression before ')' token
  86. /minetest/src/settings.h:634: error: expected ';' before 'bufpos'
  87. /minetest/src/settings.h:636: error: reference to 'u64' is ambiguous
  88. /minetest/src/irrlichttypes.h:37: error: candidates are: typedef uint64_t u64
  89. /usr/include/irrlicht/irrTypes.h:98: error: typedef long unsigned int irr::u64
  90. /minetest/src/settings.h:636: error: reference to 'u64' is ambiguous
  91. /minetest/src/irrlichttypes.h:37: error: candidates are: typedef uint64_t u64
  92. /usr/include/irrlicht/irrTypes.h:98: error: typedef long unsigned int irr::u64
  93. /minetest/src/settings.h: In member function 'bool Settings::setStruct(std::string, std::string, void*)':
  94. /minetest/src/settings.h:781: error: reference to 'u64' is ambiguous
  95. /minetest/src/irrlichttypes.h:37: error: candidates are: typedef uint64_t u64
  96. /usr/include/irrlicht/irrTypes.h:98: error: typedef long unsigned int irr::u64
  97. /minetest/src/settings.h:781: error: reference to 'u64' is ambiguous
  98. /minetest/src/irrlichttypes.h:37: error: candidates are: typedef uint64_t u64
  99. /usr/include/irrlicht/irrTypes.h:98: error: typedef long unsigned int irr::u64
  100. /minetest/src/settings.h:781: error: reference to 'u64' is ambiguous
  101. /minetest/src/irrlichttypes.h:37: error: candidates are: typedef uint64_t u64
  102. /usr/include/irrlicht/irrTypes.h:98: error: typedef long unsigned int irr::u64
  103. /minetest/src/settings.h:781: error: reference to 'u64' is ambiguous
  104. /minetest/src/irrlichttypes.h:37: error: candidates are: typedef uint64_t u64
  105. /usr/include/irrlicht/irrTypes.h:98: error: typedef long unsigned int irr::u64
  106. /minetest/src/settings.h:781: error: reference to 'u64' is ambiguous
  107. /minetest/src/irrlichttypes.h:37: error: candidates are: typedef uint64_t u64
  108. /usr/include/irrlicht/irrTypes.h:98: error: typedef long unsigned int irr::u64
  109. /minetest/src/settings.h:781: error: reference to 'u64' is ambiguous
  110. /minetest/src/irrlichttypes.h:37: error: candidates are: typedef uint64_t u64
  111. /usr/include/irrlicht/irrTypes.h:98: error: typedef long unsigned int irr::u64
  112. /minetest/src/settings.h:784: error: reference to 'u64' is ambiguous
  113. /minetest/src/irrlichttypes.h:37: error: candidates are: typedef uint64_t u64
  114. /usr/include/irrlicht/irrTypes.h:98: error: typedef long unsigned int irr::u64
  115. /minetest/src/settings.h:784: error: reference to 'u64' is ambiguous
  116. /minetest/src/irrlichttypes.h:37: error: candidates are: typedef uint64_t u64
  117. /usr/include/irrlicht/irrTypes.h:98: error: typedef long unsigned int irr::u64
  118. /minetest/src/settings.h:784: error: expected primary-expression before ')' token
  119. /minetest/src/settings.h:784: error: expected ')' before 'bufpos'
  120. /minetest/src/settings.h:785: error: reference to 'u64' is ambiguous
  121. /minetest/src/irrlichttypes.h:37: error: candidates are: typedef uint64_t u64
  122. /usr/include/irrlicht/irrTypes.h:98: error: typedef long unsigned int irr::u64
  123. /minetest/src/settings.h:785: error: reference to 'u64' is ambiguous
  124. /minetest/src/irrlichttypes.h:37: error: candidates are: typedef uint64_t u64
  125. /usr/include/irrlicht/irrTypes.h:98: error: typedef long unsigned int irr::u64
  126. In file included from /minetest/src/script/common/c_content.cpp:33:
  127. /minetest/src/mapgen.h: At global scope:
  128. /minetest/src/mapgen.h:73: error: reference to 'u64' is ambiguous
  129. /minetest/src/irrlichttypes.h:37: error: candidates are: typedef uint64_t u64
  130. /usr/include/irrlicht/irrTypes.h:98: error: typedef long unsigned int irr::u64
  131. /minetest/src/mapgen.h:73: error: reference to 'u64' is ambiguous
  132. /minetest/src/irrlichttypes.h:37: error: candidates are: typedef uint64_t u64
  133. /usr/include/irrlicht/irrTypes.h:98: error: typedef long unsigned int irr::u64
  134. /minetest/src/mapgen.h:73: error: 'u64' does not name a type
  135. /minetest/src/mapgen.h: In constructor 'MapgenParams::MapgenParams()':
  136. /minetest/src/mapgen.h:79: error: 'seed' was not declared in this scope
  137. [ 7%] Building CXX object src/CMakeFiles/minetestserver.dir/script/common/c_types.cpp.o
  138. make[2]: *** [src/CMakeFiles/minetestserver.dir/script/common/c_content.cpp.o] Error 1
  139. make[2]: *** Waiting for unfinished jobs....
  140. make[1]: *** [src/CMakeFiles/minetestserver.dir/all] Error 2
  141. make: *** [all] Error 2
  142. [root@joaoekika minetest]# make -j2
  143. [ 1%] [ 3%] Built target jsoncpp
  144. Built target jthread
  145. [ 4%] [ 5%] Building CXX object src/CMakeFiles/minetestserver.dir/script/common/c_content.cpp.o
  146. Building CXX object src/CMakeFiles/minetestserver.dir/script/cpp_api/s_base.cpp.o
  147. In file included from /minetest/src/server.h:25,
  148. from /minetest/src/script/common/c_content.cpp:29:
  149. /minetest/src/map.h:481: error: reference to 'u64' is ambiguous
  150. /minetest/src/irrlichttypes.h:37: error: candidates are: typedef uint64_t u64
  151. /usr/include/irrlicht/irrTypes.h:98: error: typedef long unsigned int irr::u64
  152. /minetest/src/map.h:481: error: reference to 'u64' is ambiguous
  153. /minetest/src/irrlichttypes.h:37: error: candidates are: typedef uint64_t u64
  154. /usr/include/irrlicht/irrTypes.h:98: error: typedef long unsigned int irr::u64
  155. /minetest/src/map.h:481: error: 'u64' does not name a type
  156. /minetest/src/map.h:493: error: reference to 'u64' is ambiguous
  157. /minetest/src/irrlichttypes.h:37: error: candidates are: typedef uint64_t u64
  158. /usr/include/irrlicht/irrTypes.h:98: error: typedef long unsigned int irr::u64
  159. /minetest/src/map.h:493: error: reference to 'u64' is ambiguous
  160. /minetest/src/irrlichttypes.h:37: error: candidates are: typedef uint64_t u64
  161. /usr/include/irrlicht/irrTypes.h:98: error: typedef long unsigned int irr::u64
  162. /minetest/src/map.h:493: error: 'u64' does not name a type
  163. [ 6%] Building CXX object src/CMakeFiles/minetestserver.dir/script/cpp_api/s_entity.cpp.o
  164. In file included from /minetest/src/mapgen.h:29,
  165. from /minetest/src/script/common/c_content.cpp:33:
  166. /minetest/src/settings.h:566: error: reference to 'u64' is ambiguous
  167. /minetest/src/irrlichttypes.h:37: error: candidates are: typedef uint64_t u64
  168. /usr/include/irrlicht/irrTypes.h:98: error: typedef long unsigned int irr::u64
  169. /minetest/src/settings.h:566: error: reference to 'u64' is ambiguous
  170. /minetest/src/irrlichttypes.h:37: error: candidates are: typedef uint64_t u64
  171. /usr/include/irrlicht/irrTypes.h:98: error: typedef long unsigned int irr::u64
  172. /minetest/src/settings.h:566: error: 'u64' does not name a type
  173. /minetest/src/settings.h:887: error: reference to 'u64' is ambiguous
  174. /minetest/src/irrlichttypes.h:37: error: candidates are: typedef uint64_t u64
  175. /usr/include/irrlicht/irrTypes.h:98: error: typedef long unsigned int irr::u64
  176. /minetest/src/settings.h:887: error: reference to 'u64' is ambiguous
  177. /minetest/src/irrlichttypes.h:37: error: candidates are: typedef uint64_t u64
  178. /usr/include/irrlicht/irrTypes.h:98: error: typedef long unsigned int irr::u64
  179. /minetest/src/settings.h:887: error: 'u64' has not been declared
  180. /minetest/src/settings.h: In member function 'bool Settings::getStruct(std::string, std::string, void*, size_t)':
  181. /minetest/src/settings.h:629: error: reference to 'u64' is ambiguous
  182. /minetest/src/irrlichttypes.h:37: error: candidates are: typedef uint64_t u64
  183. /usr/include/irrlicht/irrTypes.h:98: error: typedef long unsigned int irr::u64
  184. /minetest/src/settings.h:629: error: reference to 'u64' is ambiguous
  185. /minetest/src/irrlichttypes.h:37: error: candidates are: typedef uint64_t u64
  186. /usr/include/irrlicht/irrTypes.h:98: error: typedef long unsigned int irr::u64
  187. /minetest/src/settings.h:629: error: reference to 'u64' is ambiguous
  188. /minetest/src/irrlichttypes.h:37: error: candidates are: typedef uint64_t u64
  189. /usr/include/irrlicht/irrTypes.h:98: error: typedef long unsigned int irr::u64
  190. /minetest/src/settings.h:629: error: reference to 'u64' is ambiguous
  191. /minetest/src/irrlichttypes.h:37: error: candidates are: typedef uint64_t u64
  192. /usr/include/irrlicht/irrTypes.h:98: error: typedef long unsigned int irr::u64
  193. /minetest/src/settings.h:629: error: reference to 'u64' is ambiguous
  194. /minetest/src/irrlichttypes.h:37: error: candidates are: typedef uint64_t u64
  195. /usr/include/irrlicht/irrTypes.h:98: error: typedef long unsigned int irr::u64
  196. /minetest/src/settings.h:629: error: reference to 'u64' is ambiguous
  197. /minetest/src/irrlichttypes.h:37: error: candidates are: typedef uint64_t u64
  198. /usr/include/irrlicht/irrTypes.h:98: error: typedef long unsigned int irr::u64
  199. /minetest/src/settings.h:630: error: reference to 'u64' is ambiguous
  200. /minetest/src/irrlichttypes.h:37: error: candidates are: typedef uint64_t u64
  201. /usr/include/irrlicht/irrTypes.h:98: error: typedef long unsigned int irr::u64
  202. /minetest/src/settings.h:630: error: reference to 'u64' is ambiguous
  203. /minetest/src/irrlichttypes.h:37: error: candidates are: typedef uint64_t u64
  204. /usr/include/irrlicht/irrTypes.h:98: error: typedef long unsigned int irr::u64
  205. /minetest/src/settings.h:632: error: reference to 'u64' is ambiguous
  206. /minetest/src/irrlichttypes.h:37: error: candidates are: typedef uint64_t u64
  207. /usr/include/irrlicht/irrTypes.h:98: error: typedef long unsigned int irr::u64
  208. /minetest/src/settings.h:632: error: reference to 'u64' is ambiguous
  209. /minetest/src/irrlichttypes.h:37: error: candidates are: typedef uint64_t u64
  210. /usr/include/irrlicht/irrTypes.h:98: error: typedef long unsigned int irr::u64
  211. /minetest/src/settings.h:632: error: expected primary-expression before ')' token
  212. /minetest/src/settings.h:632: error: expected ';' before 'bufpos'
  213. /minetest/src/settings.h:634: error: reference to 's64' is ambiguous
  214. /minetest/src/irrlichttypes.h:36: error: candidates are: typedef int64_t s64
  215. /usr/include/irrlicht/irrTypes.h:108: error: typedef long int irr::s64
  216. /minetest/src/settings.h:634: error: reference to 's64' is ambiguous
  217. /minetest/src/irrlichttypes.h:36: error: candidates are: typedef int64_t s64
  218. /usr/include/irrlicht/irrTypes.h:108: error: typedef long int irr::s64
  219. /minetest/src/settings.h:634: error: expected primary-expression before ')' token
  220. /minetest/src/settings.h:634: error: expected ';' before 'bufpos'
  221. /minetest/src/settings.h:636: error: reference to 'u64' is ambiguous
  222. /minetest/src/irrlichttypes.h:37: error: candidates are: typedef uint64_t u64
  223. /usr/include/irrlicht/irrTypes.h:98: error: typedef long unsigned int irr::u64
  224. /minetest/src/settings.h:636: error: reference to 'u64' is ambiguous
  225. /minetest/src/irrlichttypes.h:37: error: candidates are: typedef uint64_t u64
  226. /usr/include/irrlicht/irrTypes.h:98: error: typedef long unsigned int irr::u64
  227. /minetest/src/settings.h: In member function 'bool Settings::setStruct(std::string, std::string, void*)':
  228. /minetest/src/settings.h:781: error: reference to 'u64' is ambiguous
  229. /minetest/src/irrlichttypes.h:37: error: candidates are: typedef uint64_t u64
  230. /usr/include/irrlicht/irrTypes.h:98: error: typedef long unsigned int irr::u64
  231. /minetest/src/settings.h:781: error: reference to 'u64' is ambiguous
  232. /minetest/src/irrlichttypes.h:37: error: candidates are: typedef uint64_t u64
  233. /usr/include/irrlicht/irrTypes.h:98: error: typedef long unsigned int irr::u64
  234. /minetest/src/settings.h:781: error: reference to 'u64' is ambiguous
  235. /minetest/src/irrlichttypes.h:37: error: candidates are: typedef uint64_t u64
  236. /usr/include/irrlicht/irrTypes.h:98: error: typedef long unsigned int irr::u64
  237. /minetest/src/settings.h:781: error: reference to 'u64' is ambiguous
  238. /minetest/src/irrlichttypes.h:37: error: candidates are: typedef uint64_t u64
  239. /usr/include/irrlicht/irrTypes.h:98: error: typedef long unsigned int irr::u64
  240. /minetest/src/settings.h:781: error: reference to 'u64' is ambiguous
  241. /minetest/src/irrlichttypes.h:37: error: candidates are: typedef uint64_t u64
  242. /usr/include/irrlicht/irrTypes.h:98: error: typedef long unsigned int irr::u64
  243. /minetest/src/settings.h:781: error: reference to 'u64' is ambiguous
  244. /minetest/src/irrlichttypes.h:37: error: candidates are: typedef uint64_t u64
  245. /usr/include/irrlicht/irrTypes.h:98: error: typedef long unsigned int irr::u64
  246. /minetest/src/settings.h:784: error: reference to 'u64' is ambiguous
  247. /minetest/src/irrlichttypes.h:37: error: candidates are: typedef uint64_t u64
  248. /usr/include/irrlicht/irrTypes.h:98: error: typedef long unsigned int irr::u64
  249. /minetest/src/settings.h:784: error: reference to 'u64' is ambiguous
  250. /minetest/src/irrlichttypes.h:37: error: candidates are: typedef uint64_t u64
  251. /usr/include/irrlicht/irrTypes.h:98: error: typedef long unsigned int irr::u64
  252. /minetest/src/settings.h:784: error: expected primary-expression before ')' token
  253. /minetest/src/settings.h:784: error: expected ')' before 'bufpos'
  254. /minetest/src/settings.h:785: error: reference to 'u64' is ambiguous
  255. /minetest/src/irrlichttypes.h:37: error: candidates are: typedef uint64_t u64
  256. /usr/include/irrlicht/irrTypes.h:98: error: typedef long unsigned int irr::u64
  257. /minetest/src/settings.h:785: error: reference to 'u64' is ambiguous
  258. /minetest/src/irrlichttypes.h:37: error: candidates are: typedef uint64_t u64
  259. /usr/include/irrlicht/irrTypes.h:98: error: typedef long unsigned int irr::u64
  260. In file included from /minetest/src/script/common/c_content.cpp:33:
  261. /minetest/src/mapgen.h: At global scope:
  262. /minetest/src/mapgen.h:73: error: reference to 'u64' is ambiguous
  263. /minetest/src/irrlichttypes.h:37: error: candidates are: typedef uint64_t u64
  264. /usr/include/irrlicht/irrTypes.h:98: error: typedef long unsigned int irr::u64
  265. /minetest/src/mapgen.h:73: error: reference to 'u64' is ambiguous
  266. /minetest/src/irrlichttypes.h:37: error: candidates are: typedef uint64_t u64
  267. /usr/include/irrlicht/irrTypes.h:98: error: typedef long unsigned int irr::u64
  268. /minetest/src/mapgen.h:73: error: 'u64' does not name a type
  269. /minetest/src/mapgen.h: In constructor 'MapgenParams::MapgenParams()':
  270. /minetest/src/mapgen.h:79: error: 'seed' was not declared in this scope
  271. make[2]: *** [src/CMakeFiles/minetestserver.dir/script/common/c_content.cpp.o] Error 1
  272. make[2]: *** Waiting for unfinished jobs....
  273. make[1]: *** [src/CMakeFiles/minetestserver.dir/all] Error 2
  274. make: *** [all] Error 2
RAW Paste Data

Adblocker detected! Please consider disabling it...

We've detected AdBlock Plus or some other adblocking software preventing Pastebin.com from fully loading.

We don't have any obnoxious sound, or popup ads, we actively block these annoying types of ads!

Please add Pastebin.com to your ad blocker whitelist or disable your adblocking software.

×