SHARE
TWEET

Untitled

a guest Oct 18th, 2019 70 Never
Not a member of Pastebin yet? Sign Up, it unlocks many cool features!
  1. > Configure project :
  2. This mapping 'stable_39' was designed for MC 1.12! Use at your own peril.
  3. #################################################
  4.          ForgeGradle 2.3-SNAPSHOT-6084129e
  5.   https://github.com/MinecraftForge/ForgeGradle
  6. #################################################
  7.                  Powered by MCP
  8.              http://modcoderpack.com
  9.      by: Searge, ProfMobius, R4wk, ZeuX
  10.      Fesh0r, IngisKahn, bspkrs, LexManos
  11. #################################################
  12. Found AccessTransformer: InitiativeMod_at.cfg
  13.  
  14. > Task :recompileMc FAILED
  15.  
  16. FAILURE: Build failed with an exception.
  17.  
  18. * What went wrong:
  19. Execution failed for task ':recompileMc'.
  20. > Compile failed; see the compiler error output for details.
  21.  
  22. * Try:
  23. Run with --info or --debug option to get more log output. Run with --scan to get full insights.
  24.  
  25. * Exception is:
  26. org.gradle.api.tasks.TaskExecutionException: Execution failed for task ':recompileMc'.
  27.         at org.gradle.api.internal.tasks.execution.ExecuteActionsTaskExecuter.executeActions(ExecuteActionsTaskExecuter.java:110)
  28.         at org.gradle.api.internal.tasks.execution.ExecuteActionsTaskExecuter.execute(ExecuteActionsTaskExecuter.java:77)
  29.         at org.gradle.api.internal.tasks.execution.OutputDirectoryCreatingTaskExecuter.execute(OutputDirectoryCreatingTaskExecuter.java:51)
  30.         at org.gradle.api.internal.tasks.execution.SkipUpToDateTaskExecuter.execute(SkipUpToDateTaskExecuter.java:59)
  31.         at org.gradle.api.internal.tasks.execution.ResolveTaskOutputCachingStateExecuter.execute(ResolveTaskOutputCachingStateExecuter.java:54)
  32.         at org.gradle.api.internal.tasks.execution.ValidatingTaskExecuter.execute(ValidatingTaskExecuter.java:59)
  33.         at org.gradle.api.internal.tasks.execution.SkipEmptySourceFilesTaskExecuter.execute(SkipEmptySourceFilesTaskExecuter.java:101)
  34.         at org.gradle.api.internal.tasks.execution.FinalizeInputFilePropertiesTaskExecuter.execute(FinalizeInputFilePropertiesTaskExecuter.java:44)
  35.         at org.gradle.api.internal.tasks.execution.CleanupStaleOutputsExecuter.execute(CleanupStaleOutputsExecuter.java:91)
  36.         at org.gradle.api.internal.tasks.execution.ResolveTaskArtifactStateTaskExecuter.execute(ResolveTaskArtifactStateTaskExecuter.java:62)
  37.         at org.gradle.api.internal.tasks.execution.SkipTaskWithNoActionsExecuter.execute(SkipTaskWithNoActionsExecuter.java:59)
  38.         at org.gradle.api.internal.tasks.execution.SkipOnlyIfTaskExecuter.execute(SkipOnlyIfTaskExecuter.java:54)
  39.         at org.gradle.api.internal.tasks.execution.ExecuteAtMostOnceTaskExecuter.execute(ExecuteAtMostOnceTaskExecuter.java:43)
  40.         at org.gradle.api.internal.tasks.execution.CatchExceptionTaskExecuter.execute(CatchExceptionTaskExecuter.java:34)
  41.         at org.gradle.api.internal.tasks.execution.EventFiringTaskExecuter$1.run(EventFiringTaskExecuter.java:51)
  42.         at org.gradle.internal.operations.DefaultBuildOperationExecutor$RunnableBuildOperationWorker.execute(DefaultBuildOperationExecutor.java:317)
  43.         at org.gradle.internal.operations.DefaultBuildOperationExecutor$RunnableBuildOperationWorker.execute(DefaultBuildOperationExecutor.java:309)
  44.         at org.gradle.internal.operations.DefaultBuildOperationExecutor.execute(DefaultBuildOperationExecutor.java:185)
  45.         at org.gradle.internal.operations.DefaultBuildOperationExecutor.run(DefaultBuildOperationExecutor.java:97)
  46.         at org.gradle.internal.operations.DelegatingBuildOperationExecutor.run(DelegatingBuildOperationExecutor.java:31)
  47.         at org.gradle.api.internal.tasks.execution.EventFiringTaskExecuter.execute(EventFiringTaskExecuter.java:46)
  48.         at org.gradle.execution.taskgraph.DefaultTaskExecutionGraph$ExecuteTaskAction.execute(DefaultTaskExecutionGraph.java:262)
  49.         at org.gradle.execution.taskgraph.DefaultTaskExecutionGraph$ExecuteTaskAction.execute(DefaultTaskExecutionGraph.java:246)
  50.         at org.gradle.execution.taskgraph.DefaultTaskPlanExecutor$TaskExecutorWorker$1.execute(DefaultTaskPlanExecutor.java:136)
  51.         at org.gradle.execution.taskgraph.DefaultTaskPlanExecutor$TaskExecutorWorker$1.execute(DefaultTaskPlanExecutor.java:130)
  52.         at org.gradle.execution.taskgraph.DefaultTaskPlanExecutor$TaskExecutorWorker.execute(DefaultTaskPlanExecutor.java:201)
  53.         at org.gradle.execution.taskgraph.DefaultTaskPlanExecutor$TaskExecutorWorker.executeWithTask(DefaultTaskPlanExecutor.java:192)
  54.         at org.gradle.execution.taskgraph.DefaultTaskPlanExecutor$TaskExecutorWorker.run(DefaultTaskPlanExecutor.java:130)
  55.         at org.gradle.internal.concurrent.ExecutorPolicy$CatchAndRecordFailures.onExecute(ExecutorPolicy.java:63)
  56.         at org.gradle.internal.concurrent.ManagedExecutorImpl$1.run(ManagedExecutorImpl.java:46)
  57.         at org.gradle.internal.concurrent.ThreadFactoryImpl$ManagedThreadRunnable.run(ThreadFactoryImpl.java:55)
  58. Caused by: : Compile failed; see the compiler error output for details.
  59.         at org.apache.tools.ant.taskdefs.Javac.compile(Javac.java:1426)
  60.         at org.apache.tools.ant.taskdefs.Javac.execute(Javac.java:1130)
  61.         at org.apache.tools.ant.UnknownElement.execute(UnknownElement.java:293)
  62.         at org.apache.tools.ant.dispatch.DispatchUtils.execute(DispatchUtils.java:106)
  63.         at org.gradle.api.internal.project.ant.BasicAntBuilder.nodeCompleted(BasicAntBuilder.java:78)
  64.         at org.gradle.api.internal.project.ant.BasicAntBuilder.doInvokeMethod(BasicAntBuilder.java:103)
  65.         at net.minecraftforge.gradle.user.TaskRecompileMc.doStuff(TaskRecompileMc.java:84)
  66.         at org.gradle.internal.reflect.JavaMethod.invoke(JavaMethod.java:73)
  67.         at org.gradle.api.internal.project.taskfactory.StandardTaskAction.doExecute(StandardTaskAction.java:46)
  68.         at org.gradle.api.internal.project.taskfactory.StandardTaskAction.execute(StandardTaskAction.java:39)
  69.         at org.gradle.api.internal.project.taskfactory.StandardTaskAction.execute(StandardTaskAction.java:26)
  70.         at org.gradle.api.internal.AbstractTask$TaskActionWrapper.execute(AbstractTask.java:794)
  71.         at org.gradle.api.internal.AbstractTask$TaskActionWrapper.execute(AbstractTask.java:761)
  72.         at org.gradle.api.internal.tasks.execution.ExecuteActionsTaskExecuter$1.run(ExecuteActionsTaskExecuter.java:131)
  73.         at org.gradle.internal.operations.DefaultBuildOperationExecutor$RunnableBuildOperationWorker.execute(DefaultBuildOperationExecutor.java:317)
  74.         at org.gradle.internal.operations.DefaultBuildOperationExecutor$RunnableBuildOperationWorker.execute(DefaultBuildOperationExecutor.java:309)
  75.         at org.gradle.internal.operations.DefaultBuildOperationExecutor.execute(DefaultBuildOperationExecutor.java:185)
  76.         at org.gradle.internal.operations.DefaultBuildOperationExecutor.run(DefaultBuildOperationExecutor.java:97)
  77.         at org.gradle.internal.operations.DelegatingBuildOperationExecutor.run(DelegatingBuildOperationExecutor.java:31)
  78.         at org.gradle.api.internal.tasks.execution.ExecuteActionsTaskExecuter.executeAction(ExecuteActionsTaskExecuter.java:120)
  79.         at org.gradle.api.internal.tasks.execution.ExecuteActionsTaskExecuter.executeActions(ExecuteActionsTaskExecuter.java:99)
  80.         ... 30 more
  81.  
  82.  
  83. * Get more help at https://help.gradle.org
  84.  
  85. BUILD FAILED in 1m 5s
  86. 10 actionable tasks: 10 executed
RAW Paste Data
We use cookies for various purposes including analytics. By continuing to use Pastebin, you agree to our use of cookies as described in the Cookies Policy. OK, I Understand
 
Top