Advertisement
Guest User

Untitled

a guest
Jan 24th, 2012
173
Never
Not a member of Pastebin yet? Sign Up, it unlocks many cool features!
  1. make -C /lib/modules/3.2.1-2-ARCH/build M=/home/jb/Bureau/install-driver-mbox/mbox2-kernel modules
  2. make[1] : on entre dans le répertoire « /usr/src/linux-3.2.1-2-ARCH »
  3. CC [M] /home/jb/Bureau/install-driver-mbox/mbox2-kernel/card.o
  4. /home/jb/Bureau/install-driver-mbox/mbox2-kernel/card.c:69:15: erreur: expected declaration specifiers or ‘...’ before string constant
  5. /home/jb/Bureau/install-driver-mbox/mbox2-kernel/card.c:70:20: erreur: expected declaration specifiers or ‘...’ before string constant
  6. /home/jb/Bureau/install-driver-mbox/mbox2-kernel/card.c:71:16: erreur: expected declaration specifiers or ‘...’ before string constant
  7. /home/jb/Bureau/install-driver-mbox/mbox2-kernel/card.c:72:25: erreur: expected declaration specifiers or ‘...’ before string constant
  8. /home/jb/Bureau/install-driver-mbox/mbox2-kernel/card.c: In function ‘snd_usb_audio_create’:
  9. /home/jb/Bureau/install-driver-mbox/mbox2-kernel/card.c:314:45: erreur: ‘THIS_MODULE’ undeclared (first use in this function)
  10. /home/jb/Bureau/install-driver-mbox/mbox2-kernel/card.c:314:45: note: each undeclared identifier is reported only once for each function it appears in
  11. /home/jb/Bureau/install-driver-mbox/mbox2-kernel/card.c: Hors de toute fonction :
  12. /home/jb/Bureau/install-driver-mbox/mbox2-kernel/card.c:630:1: attention : la définition de données n'a pas de type ni de classe de stockage [enabled by default]
  13. /home/jb/Bureau/install-driver-mbox/mbox2-kernel/card.c:630:1: attention : type defaults to ‘int’ in declaration of ‘MODULE_DEVICE_TABLE’ [-Wimplicit-int]
  14. /home/jb/Bureau/install-driver-mbox/mbox2-kernel/card.c:630:1: attention : noms de paramètres (sans type) dans la déclaration de fonction [enabled by default]
  15. /home/jb/Bureau/install-driver-mbox/mbox2-kernel/card.c: In function ‘snd_usb_audio_init’:
  16. /home/jb/Bureau/install-driver-mbox/mbox2-kernel/card.c:651:9: erreur: ‘THIS_MODULE’ undeclared (first use in this function)
  17. /home/jb/Bureau/install-driver-mbox/mbox2-kernel/card.c: Hors de toute fonction :
  18. /home/jb/Bureau/install-driver-mbox/mbox2-kernel/quirks.h:23:12: attention : ‘mbox2_skip_setting_quirk’ declared ‘static’ but never defined [-Wunused-function]
  19. /home/jb/Bureau/install-driver-mbox/mbox2-kernel/quirks.h:26:12: attention : ‘snd_usb_mbox2_boot_quirk’ declared ‘static’ but never defined [-Wunused-function]
  20. /home/jb/Bureau/install-driver-mbox/mbox2-kernel/card.c: In function ‘snd_usb_audio_init’:
  21. /home/jb/Bureau/install-driver-mbox/mbox2-kernel/card.c:652:1: attention : contrôle a atteint la fin non void de la fonction [-Wreturn-type]
  22. make[2]: *** [/home/jb/Bureau/install-driver-mbox/mbox2-kernel/card.o] Erreur 1
  23. make[1]: *** [_module_/home/jb/Bureau/install-driver-mbox/mbox2-kernel] Erreur 2
  24. make[1] : on quitte le répertoire « /usr/src/linux-3.2.1-2-ARCH »
  25. make: *** [all] Erreur 2
Advertisement
RAW Paste Data Copied
Advertisement