SHARE
TWEET

Untitled

a guest Apr 26th, 2020 30 Never
Not a member of Pastebin yet? Sign Up, it unlocks many cool features!
  1. [INFO] Error stacktraces are turned on.
  2. [INFO] Scanning for projects...
  3. [WARNING] The project org.apache.maven.shared:maven-filtering:jar:3.1.1 uses prerequisites which is only intended for maven-plugin projects but not for non maven-plugin projects. For such purposes you should use the maven-enforcer-plugin. See https://maven.apache.org/enforcer/enforcer-rules/requireMavenVersion.html
  4. [INFO]
  5. [INFO] --------------< org.apache.maven.shared:maven-filtering >---------------
  6. [INFO] Building Apache Maven Filtering 3.1.1
  7. [INFO] --------------------------------[ jar ]---------------------------------
  8. [INFO]
  9. [INFO] --- maven-enforcer-plugin:1.4.1:enforce (enforce-bytecode-version) @ maven-filtering ---
  10. [INFO]
  11. [INFO] --- maven-enforcer-plugin:1.4.1:enforce (ban-known-bad-maven-versions) @ maven-filtering ---
  12. [INFO]
  13. [INFO] --- apache-rat-plugin:0.11:check (rat-check) @ maven-filtering ---
  14. [INFO] 51 implicit excludes (use -debug for more details).
  15. [INFO] Exclude: DEPENDENCIES
  16. [INFO] 76 resources included (use -debug for more details)
  17. [INFO] Rat check: Summary of files. Unapproved: 0 unknown: 0 generated: 0 approved: 75 licence.
  18. [INFO]
  19. [INFO] --- maven-remote-resources-plugin:1.5:process (process-resource-bundles) @ maven-filtering ---
  20. [INFO]
  21. [INFO] --- maven-resources-plugin:2.7:resources (default-resources) @ maven-filtering ---
  22. [INFO] Using 'UTF-8' encoding to copy filtered resources.
  23. [INFO] skip non existing resourceDirectory C:\Users\User\Documents\programming\resources-testbed\maven-filtering\src\main\resources
  24. [INFO] Copying 3 resources
  25. [INFO]
  26. [INFO] --- maven-compiler-plugin:3.5.1:compile (default-compile) @ maven-filtering ---
  27. [INFO] Nothing to compile - all classes are up to date
  28. [INFO]
  29. [INFO] --- plexus-component-metadata:1.6:generate-metadata (default) @ maven-filtering ---
  30. [INFO] ------------------------------------------------------------------------
  31. [INFO] BUILD FAILURE
  32. [INFO] ------------------------------------------------------------------------
  33. [INFO] Total time:  3.050 s
  34. [INFO] Finished at: 2020-04-26T15:08:48+02:00
  35. [INFO] ------------------------------------------------------------------------
  36. [ERROR] Failed to execute goal org.codehaus.plexus:plexus-component-metadata:1.6:generate-metadata (default) on project maven-filtering: Error generating metadata: : Failed to extract descriptors: IllegalArgumentException -> [Help 1]
  37. org.apache.maven.lifecycle.LifecycleExecutionException: Failed to execute goal org.codehaus.plexus:plexus-component-metadata:1.6:generate-metadata (default) on project maven-filtering: Error generating metadata:
  38.     at org.apache.maven.lifecycle.internal.MojoExecutor.execute (MojoExecutor.java:215)
  39.     at org.apache.maven.lifecycle.internal.MojoExecutor.execute (MojoExecutor.java:156)
  40.     at org.apache.maven.lifecycle.internal.MojoExecutor.execute (MojoExecutor.java:148)
  41.     at org.apache.maven.lifecycle.internal.LifecycleModuleBuilder.buildProject (LifecycleModuleBuilder.java:117)
  42.     at org.apache.maven.lifecycle.internal.LifecycleModuleBuilder.buildProject (LifecycleModuleBuilder.java:81)
  43.     at org.apache.maven.lifecycle.internal.builder.singlethreaded.SingleThreadedBuilder.build (SingleThreadedBuilder.java:56)
  44.     at org.apache.maven.lifecycle.internal.LifecycleStarter.execute (LifecycleStarter.java:128)
  45.     at org.apache.maven.DefaultMaven.doExecute (DefaultMaven.java:305)
  46.     at org.apache.maven.DefaultMaven.doExecute (DefaultMaven.java:192)
  47.     at org.apache.maven.DefaultMaven.execute (DefaultMaven.java:105)
  48.     at org.apache.maven.cli.MavenCli.execute (MavenCli.java:957)
  49.     at org.apache.maven.cli.MavenCli.doMain (MavenCli.java:289)
  50.     at org.apache.maven.cli.MavenCli.main (MavenCli.java:193)
  51.     at jdk.internal.reflect.NativeMethodAccessorImpl.invoke0 (Native Method)
  52.     at jdk.internal.reflect.NativeMethodAccessorImpl.invoke (NativeMethodAccessorImpl.java:62)
  53.     at jdk.internal.reflect.DelegatingMethodAccessorImpl.invoke (DelegatingMethodAccessorImpl.java:43)
  54.     at java.lang.reflect.Method.invoke (Method.java:567)
  55.     at org.codehaus.plexus.classworlds.launcher.Launcher.launchEnhanced (Launcher.java:282)
  56.     at org.codehaus.plexus.classworlds.launcher.Launcher.launch (Launcher.java:225)
  57.     at org.codehaus.plexus.classworlds.launcher.Launcher.mainWithExitCode (Launcher.java:406)
  58.     at org.codehaus.plexus.classworlds.launcher.Launcher.main (Launcher.java:347)
  59. Caused by: org.apache.maven.plugin.MojoExecutionException: Error generating metadata:
  60.     at org.codehaus.plexus.maven.plugin.PlexusDescriptorMojo.execute (PlexusDescriptorMojo.java:86)
  61.     at org.apache.maven.plugin.DefaultBuildPluginManager.executeMojo (DefaultBuildPluginManager.java:137)
  62.     at org.apache.maven.lifecycle.internal.MojoExecutor.execute (MojoExecutor.java:210)
  63.     at org.apache.maven.lifecycle.internal.MojoExecutor.execute (MojoExecutor.java:156)
  64.     at org.apache.maven.lifecycle.internal.MojoExecutor.execute (MojoExecutor.java:148)
  65.     at org.apache.maven.lifecycle.internal.LifecycleModuleBuilder.buildProject (LifecycleModuleBuilder.java:117)
  66.     at org.apache.maven.lifecycle.internal.LifecycleModuleBuilder.buildProject (LifecycleModuleBuilder.java:81)
  67.     at org.apache.maven.lifecycle.internal.builder.singlethreaded.SingleThreadedBuilder.build (SingleThreadedBuilder.java:56)
  68.     at org.apache.maven.lifecycle.internal.LifecycleStarter.execute (LifecycleStarter.java:128)
  69.     at org.apache.maven.DefaultMaven.doExecute (DefaultMaven.java:305)
  70.     at org.apache.maven.DefaultMaven.doExecute (DefaultMaven.java:192)
  71.     at org.apache.maven.DefaultMaven.execute (DefaultMaven.java:105)
  72.     at org.apache.maven.cli.MavenCli.execute (MavenCli.java:957)
  73.     at org.apache.maven.cli.MavenCli.doMain (MavenCli.java:289)
  74.     at org.apache.maven.cli.MavenCli.main (MavenCli.java:193)
  75.     at jdk.internal.reflect.NativeMethodAccessorImpl.invoke0 (Native Method)
  76.     at jdk.internal.reflect.NativeMethodAccessorImpl.invoke (NativeMethodAccessorImpl.java:62)
  77.     at jdk.internal.reflect.DelegatingMethodAccessorImpl.invoke (DelegatingMethodAccessorImpl.java:43)
  78.     at java.lang.reflect.Method.invoke (Method.java:567)
  79.     at org.codehaus.plexus.classworlds.launcher.Launcher.launchEnhanced (Launcher.java:282)
  80.     at org.codehaus.plexus.classworlds.launcher.Launcher.launch (Launcher.java:225)
  81.     at org.codehaus.plexus.classworlds.launcher.Launcher.mainWithExitCode (Launcher.java:406)
  82.     at org.codehaus.plexus.classworlds.launcher.Launcher.main (Launcher.java:347)
  83. Caused by: java.lang.Exception: Failed to extract descriptors
  84.     at org.codehaus.plexus.metadata.DefaultMetadataGenerator.generateDescriptor (DefaultMetadataGenerator.java:81)
  85.     at org.codehaus.plexus.maven.plugin.PlexusDescriptorMojo.execute (PlexusDescriptorMojo.java:82)
  86.     at org.apache.maven.plugin.DefaultBuildPluginManager.executeMojo (DefaultBuildPluginManager.java:137)
  87.     at org.apache.maven.lifecycle.internal.MojoExecutor.execute (MojoExecutor.java:210)
  88.     at org.apache.maven.lifecycle.internal.MojoExecutor.execute (MojoExecutor.java:156)
  89.     at org.apache.maven.lifecycle.internal.MojoExecutor.execute (MojoExecutor.java:148)
  90.     at org.apache.maven.lifecycle.internal.LifecycleModuleBuilder.buildProject (LifecycleModuleBuilder.java:117)
  91.     at org.apache.maven.lifecycle.internal.LifecycleModuleBuilder.buildProject (LifecycleModuleBuilder.java:81)
  92.     at org.apache.maven.lifecycle.internal.builder.singlethreaded.SingleThreadedBuilder.build (SingleThreadedBuilder.java:56)
  93.     at org.apache.maven.lifecycle.internal.LifecycleStarter.execute (LifecycleStarter.java:128)
  94.     at org.apache.maven.DefaultMaven.doExecute (DefaultMaven.java:305)
  95.     at org.apache.maven.DefaultMaven.doExecute (DefaultMaven.java:192)
  96.     at org.apache.maven.DefaultMaven.execute (DefaultMaven.java:105)
  97.     at org.apache.maven.cli.MavenCli.execute (MavenCli.java:957)
  98.     at org.apache.maven.cli.MavenCli.doMain (MavenCli.java:289)
  99.     at org.apache.maven.cli.MavenCli.main (MavenCli.java:193)
  100.     at jdk.internal.reflect.NativeMethodAccessorImpl.invoke0 (Native Method)
  101.     at jdk.internal.reflect.NativeMethodAccessorImpl.invoke (NativeMethodAccessorImpl.java:62)
  102.     at jdk.internal.reflect.DelegatingMethodAccessorImpl.invoke (DelegatingMethodAccessorImpl.java:43)
  103.     at java.lang.reflect.Method.invoke (Method.java:567)
  104.     at org.codehaus.plexus.classworlds.launcher.Launcher.launchEnhanced (Launcher.java:282)
  105.     at org.codehaus.plexus.classworlds.launcher.Launcher.launch (Launcher.java:225)
  106.     at org.codehaus.plexus.classworlds.launcher.Launcher.mainWithExitCode (Launcher.java:406)
  107.     at org.codehaus.plexus.classworlds.launcher.Launcher.main (Launcher.java:347)
  108. Caused by: java.lang.IllegalArgumentException
  109.     at org.objectweb.asm.ClassReader.<init> (Unknown Source)
  110.     at org.objectweb.asm.ClassReader.<init> (Unknown Source)
  111.     at org.objectweb.asm.ClassReader.<init> (Unknown Source)
  112.     at org.codehaus.plexus.metadata.ann.AnnReader.read (AnnReader.java:45)
  113.     at org.codehaus.plexus.metadata.gleaner.AnnotationComponentGleaner.readClass (AnnotationComponentGleaner.java:136)
  114.     at org.codehaus.plexus.metadata.gleaner.AnnotationComponentGleaner.glean (AnnotationComponentGleaner.java:56)
  115.     at org.codehaus.plexus.metadata.ClassComponentDescriptorExtractor.extract (ClassComponentDescriptorExtractor.java:144)
  116.     at org.codehaus.plexus.metadata.ClassComponentDescriptorExtractor.extract (ClassComponentDescriptorExtractor.java:79)
  117.     at org.codehaus.plexus.metadata.DefaultMetadataGenerator.generateDescriptor (DefaultMetadataGenerator.java:76)
  118.     at org.codehaus.plexus.maven.plugin.PlexusDescriptorMojo.execute (PlexusDescriptorMojo.java:82)
  119.     at org.apache.maven.plugin.DefaultBuildPluginManager.executeMojo (DefaultBuildPluginManager.java:137)
  120.     at org.apache.maven.lifecycle.internal.MojoExecutor.execute (MojoExecutor.java:210)
  121.     at org.apache.maven.lifecycle.internal.MojoExecutor.execute (MojoExecutor.java:156)
  122.     at org.apache.maven.lifecycle.internal.MojoExecutor.execute (MojoExecutor.java:148)
  123.     at org.apache.maven.lifecycle.internal.LifecycleModuleBuilder.buildProject (LifecycleModuleBuilder.java:117)
  124.     at org.apache.maven.lifecycle.internal.LifecycleModuleBuilder.buildProject (LifecycleModuleBuilder.java:81)
  125.     at org.apache.maven.lifecycle.internal.builder.singlethreaded.SingleThreadedBuilder.build (SingleThreadedBuilder.java:56)
  126.     at org.apache.maven.lifecycle.internal.LifecycleStarter.execute (LifecycleStarter.java:128)
  127.     at org.apache.maven.DefaultMaven.doExecute (DefaultMaven.java:305)
  128.     at org.apache.maven.DefaultMaven.doExecute (DefaultMaven.java:192)
  129.     at org.apache.maven.DefaultMaven.execute (DefaultMaven.java:105)
  130.     at org.apache.maven.cli.MavenCli.execute (MavenCli.java:957)
  131.     at org.apache.maven.cli.MavenCli.doMain (MavenCli.java:289)
  132.     at org.apache.maven.cli.MavenCli.main (MavenCli.java:193)
  133.     at jdk.internal.reflect.NativeMethodAccessorImpl.invoke0 (Native Method)
  134.     at jdk.internal.reflect.NativeMethodAccessorImpl.invoke (NativeMethodAccessorImpl.java:62)
  135.     at jdk.internal.reflect.DelegatingMethodAccessorImpl.invoke (DelegatingMethodAccessorImpl.java:43)
  136.     at java.lang.reflect.Method.invoke (Method.java:567)
  137.     at org.codehaus.plexus.classworlds.launcher.Launcher.launchEnhanced (Launcher.java:282)
  138.     at org.codehaus.plexus.classworlds.launcher.Launcher.launch (Launcher.java:225)
  139.     at org.codehaus.plexus.classworlds.launcher.Launcher.mainWithExitCode (Launcher.java:406)
  140.     at org.codehaus.plexus.classworlds.launcher.Launcher.main (Launcher.java:347)
  141. [ERROR]
  142. [ERROR] Re-run Maven using the -X switch to enable full debug logging.
  143. [ERROR]
  144. [ERROR] For more information about the errors and possible solutions, please read the following articles:
  145. [ERROR] [Help 1] http://cwiki.apache.org/confluence/display/MAVEN/MojoExecutionException
RAW Paste Data
We use cookies for various purposes including analytics. By continuing to use Pastebin, you agree to our use of cookies as described in the Cookies Policy. OK, I Understand
Top