SHARE
TWEET

Untitled

5lava Aug 26th, 2018 6 in 96 days
Not a member of Pastebin yet? Sign Up, it unlocks many cool features!
  1. $ cmake -DWITH_BOOST=boost -DDOWNLOAD_BOOST=1 -DWITHOUT_SERVER=1
  2. -- Running cmake version 2.8.12.2
  3. -- Could NOT find Git (missing:  GIT_EXECUTABLE)
  4. -- Configuring with MAX_INDEXES = 64U
  5. -- The C compiler identification is GNU 4.8.5
  6. -- The CXX compiler identification is GNU 4.8.5
  7. -- Check for working C compiler: /usr/bin/cc
  8. -- Check for working C compiler: /usr/bin/cc -- works
  9. -- Detecting C compiler ABI info
  10. -- Detecting C compiler ABI info - done
  11. -- Check for working CXX compiler: /usr/bin/c++
  12. -- Check for working CXX compiler: /usr/bin/c++ -- works
  13. -- Detecting CXX compiler ABI info
  14. -- Detecting CXX compiler ABI info - done
  15. -- CMAKE_GENERATOR: Unix Makefiles
  16. -- Looking for SHM_HUGETLB
  17. -- Looking for SHM_HUGETLB - found
  18. -- Looking for sys/types.h
  19. -- Looking for sys/types.h - found
  20. -- Looking for stdint.h
  21. -- Looking for stdint.h - found
  22. -- Looking for stddef.h
  23. -- Looking for stddef.h - found
  24. -- Check size of void *
  25. -- Check size of void * - done
  26. -- SIZEOF_VOIDP 8
  27. -- Performing Test HAVE_C_SHIFT_OR_OPTIMIZATION_BUG
  28. -- Performing Test HAVE_C_SHIFT_OR_OPTIMIZATION_BUG - Failed
  29. -- Performing Test HAVE_CXX_SHIFT_OR_OPTIMIZATION_BUG
  30. -- Performing Test HAVE_CXX_SHIFT_OR_OPTIMIZATION_BUG - Failed
  31. -- Performing Test HAVE_C_FLOATING_POINT_FUSED_MADD
  32. -- Performing Test HAVE_C_FLOATING_POINT_FUSED_MADD - Failed
  33. -- Performing Test HAVE_CXX_FLOATING_POINT_FUSED_MADD
  34. -- Performing Test HAVE_CXX_FLOATING_POINT_FUSED_MADD - Failed
  35. -- Performing Test HAVE_C_FP_CONTRACT_FLAG
  36. -- Performing Test HAVE_C_FP_CONTRACT_FLAG - Success
  37. -- Performing Test HAVE_CXX_FP_CONTRACT_FLAG
  38. -- Performing Test HAVE_CXX_FP_CONTRACT_FLAG - Success
  39. -- Performing Test GNU03_SUPPORTED
  40. -- Performing Test GNU03_SUPPORTED - Success
  41. -- MySQL 5.7.22-22
  42. -- Packaging as: percona-server-5.7.22-22-Linux-x86_64
  43. -- Downloading boost_1_59_0.tar.gz to /home/slava/1/work/boost
  44. -- [download 0% complete]
  45. -- [download 1% complete]
  46. -- [download 2% complete]
  47. -- [download 3% complete]
  48. -- [download 4% complete]
  49. -- [download 5% complete]
  50. -- [download 6% complete]
  51. -- [download 7% complete]
  52. -- [download 8% complete]
  53. -- [download 9% complete]
  54. -- [download 10% complete]
  55. -- [download 11% complete]
  56. -- [download 12% complete]
  57. -- [download 13% complete]
  58. -- [download 14% complete]
  59. -- [download 15% complete]
  60. -- [download 16% complete]
  61. -- [download 17% complete]
  62. -- [download 18% complete]
  63. -- [download 19% complete]
  64. -- [download 20% complete]
  65. -- [download 21% complete]
  66. -- [download 22% complete]
  67. -- [download 23% complete]
  68. -- [download 24% complete]
  69. -- [download 25% complete]
  70. -- [download 26% complete]
  71. -- [download 27% complete]
  72. -- [download 28% complete]
  73. -- [download 29% complete]
  74. -- [download 30% complete]
  75. -- [download 31% complete]
  76. -- [download 32% complete]
  77. -- [download 33% complete]
  78. -- [download 34% complete]
  79. -- [download 35% complete]
  80. -- [download 36% complete]
  81. -- [download 37% complete]
  82. -- [download 38% complete]
  83. -- [download 39% complete]
  84. -- [download 40% complete]
  85. -- [download 41% complete]
  86. -- [download 42% complete]
  87. -- [download 43% complete]
  88. -- [download 44% complete]
  89. -- [download 45% complete]
  90. -- [download 46% complete]
  91. -- [download 47% complete]
  92. -- [download 48% complete]
  93. -- [download 49% complete]
  94. -- [download 50% complete]
  95. -- [download 51% complete]
  96. -- [download 52% complete]
  97. -- [download 53% complete]
  98. -- [download 54% complete]
  99. -- [download 55% complete]
  100. -- [download 56% complete]
  101. -- [download 57% complete]
  102. -- [download 58% complete]
  103. -- [download 59% complete]
  104. -- [download 60% complete]
  105. -- [download 61% complete]
  106. -- [download 62% complete]
  107. -- [download 63% complete]
  108. -- [download 64% complete]
  109. -- [download 65% complete]
  110. -- [download 66% complete]
  111. -- [download 67% complete]
  112. -- [download 68% complete]
  113. -- [download 69% complete]
  114. -- [download 70% complete]
  115. -- [download 71% complete]
  116. -- [download 72% complete]
  117. -- [download 73% complete]
  118. -- [download 74% complete]
  119. -- [download 75% complete]
  120. -- [download 76% complete]
  121. -- [download 77% complete]
  122. -- [download 78% complete]
  123. -- [download 79% complete]
  124. -- [download 80% complete]
  125. -- [download 81% complete]
  126. -- [download 82% complete]
  127. -- [download 83% complete]
  128. -- [download 84% complete]
  129. -- [download 85% complete]
  130. -- [download 86% complete]
  131. -- [download 87% complete]
  132. -- [download 88% complete]
  133. -- [download 89% complete]
  134. -- [download 90% complete]
  135. -- [download 91% complete]
  136. -- [download 92% complete]
  137. -- [download 93% complete]
  138. -- [download 94% complete]
  139. -- [download 95% complete]
  140. -- [download 96% complete]
  141. -- [download 97% complete]
  142. -- [download 98% complete]
  143. -- [download 99% complete]
  144. -- [download 100% complete]
  145. -- cd /home/slava/1/work/boost; tar xfz /home/slava/1/work/boost/boost_1_59_0.tar.gz
  146. -- Found /home/slava/1/work/boost/boost_1_59_0/boost/version.hpp
  147. -- BOOST_VERSION_NUMBER is #define BOOST_VERSION 105900
  148. -- BOOST_INCLUDE_DIR /home/slava/1/work/boost/boost_1_59_0
  149. -- Performing Test HAVE_LLVM_LIBCPP
  150. -- Performing Test HAVE_LLVM_LIBCPP - Failed
  151. -- Looking for include file pthread.h
  152. -- Looking for include file pthread.h - found
  153. -- Looking for pthread_create
  154. -- Looking for pthread_create - not found
  155. -- Looking for pthread_create in pthreads
  156. -- Looking for pthread_create in pthreads - not found
  157. -- Looking for pthread_create in pthread
  158. -- Looking for pthread_create in pthread - found
  159. -- Found Threads: TRUE
  160. -- Looking for floor
  161. -- Looking for floor - not found
  162. -- Looking for floor in m
  163. -- Looking for floor in m - found
  164. -- Looking for gethostbyname_r
  165. -- Looking for gethostbyname_r - found
  166. -- Looking for bind
  167. -- Looking for bind - found
  168. -- Looking for crypt
  169. -- Looking for crypt - not found
  170. -- Looking for crypt in crypt
  171. -- Looking for crypt in crypt - found
  172. -- Looking for setsockopt
  173. -- Looking for setsockopt - found
  174. -- Looking for dlopen
  175. -- Looking for dlopen - not found
  176. -- Looking for dlopen in dl
  177. -- Looking for dlopen in dl - found
  178. -- Looking for sched_yield
  179. -- Looking for sched_yield - found
  180. -- Looking for clock_gettime
  181. -- Looking for clock_gettime - found
  182. -- Looking for timer_create
  183. -- Looking for timer_create - not found
  184. -- Looking for timer_create in rt
  185. -- Looking for timer_create in rt - found
  186. -- Looking for atomic_thread_fence
  187. -- Looking for atomic_thread_fence - not found
  188. -- Looking for atomic_thread_fence in atomic
  189. -- Looking for atomic_thread_fence in atomic - not found
  190. -- Looking for backtrace
  191. -- Looking for backtrace - found
  192. -- Looking for include file alloca.h
  193. -- Looking for include file alloca.h - found
  194. -- Looking for include file arpa/inet.h
  195. -- Looking for include file arpa/inet.h - found
  196. -- Looking for include file crypt.h
  197. -- Looking for include file crypt.h - found
  198. -- Looking for include file dlfcn.h
  199. -- Looking for include file dlfcn.h - found
  200. -- Looking for include file execinfo.h
  201. -- Looking for include file execinfo.h - found
  202. -- Looking for include file fpu_control.h
  203. -- Looking for include file fpu_control.h - found
  204. -- Looking for include file grp.h
  205. -- Looking for include file grp.h - found
  206. -- Looking for include file ieeefp.h
  207. -- Looking for include file ieeefp.h - not found
  208. -- Looking for include file langinfo.h
  209. -- Looking for include file langinfo.h - found
  210. -- Looking for include file malloc.h
  211. -- Looking for include file malloc.h - found
  212. -- Looking for include file netinet/in.h
  213. -- Looking for include file netinet/in.h - found
  214. -- Looking for include file poll.h
  215. -- Looking for include file poll.h - found
  216. -- Looking for include file pwd.h
  217. -- Looking for include file pwd.h - found
  218. -- Looking for include file strings.h
  219. -- Looking for include file strings.h - found
  220. -- Looking for include file sys/cdefs.h
  221. -- Looking for include file sys/cdefs.h - found
  222. -- Looking for include file sys/ioctl.h
  223. -- Looking for include file sys/ioctl.h - found
  224. -- Looking for include file sys/mman.h
  225. -- Looking for include file sys/mman.h - found
  226. -- Looking for include file sys/resource.h
  227. -- Looking for include file sys/resource.h - found
  228. -- Looking for include file sys/select.h
  229. -- Looking for include file sys/select.h - found
  230. -- Looking for include file sys/socket.h
  231. -- Looking for include file sys/socket.h - found
  232. -- Looking for include files curses.h, term.h
  233. -- Looking for include files curses.h, term.h - found
  234. -- Looking for include file termios.h
  235. -- Looking for include file termios.h - found
  236. -- Looking for include file termio.h
  237. -- Looking for include file termio.h - found
  238. -- Looking for include file unistd.h
  239. -- Looking for include file unistd.h - found
  240. -- Looking for include file sys/wait.h
  241. -- Looking for include file sys/wait.h - found
  242. -- Looking for include file sys/param.h
  243. -- Looking for include file sys/param.h - found
  244. -- Looking for include file fnmatch.h
  245. -- Looking for include file fnmatch.h - found
  246. -- Looking for include file sys/un.h
  247. -- Looking for include file sys/un.h - found
  248. -- Looking for include file vis.h
  249. -- Looking for include file vis.h - not found
  250. -- Looking for include file sasl/sasl.h
  251. -- Looking for include file sasl/sasl.h - found
  252. -- Looking for include file sys/devpoll.h
  253. -- Looking for include file sys/devpoll.h - not found
  254. -- Looking for include file sys/epoll.h
  255. -- Looking for include file sys/epoll.h - found
  256. -- Looking for TAILQ_FOREACH
  257. -- Looking for TAILQ_FOREACH - found
  258. -- Looking for _aligned_malloc
  259. -- Looking for _aligned_malloc - not found
  260. -- Looking for backtrace
  261. -- Looking for backtrace - found
  262. -- Looking for printstack
  263. -- Looking for printstack - not found
  264. -- Looking for index
  265. -- Looking for index - found
  266. -- Looking for clock_gettime
  267. -- Looking for clock_gettime - found
  268. -- Looking for cuserid
  269. -- Looking for cuserid - found
  270. -- Looking for directio
  271. -- Looking for directio - not found
  272. -- Looking for ftruncate
  273. -- Looking for ftruncate - found
  274. -- Looking for compress
  275. -- Looking for compress - not found
  276. -- Looking for crypt
  277. -- Looking for crypt - found
  278. -- Looking for dlopen
  279. -- Looking for dlopen - found
  280. -- Looking for fchmod
  281. -- Looking for fchmod - found
  282. -- Looking for fcntl
  283. -- Looking for fcntl - found
  284. -- Looking for fdatasync
  285. -- Looking for fdatasync - found
  286. -- Looking for fdatasync
  287. -- Looking for fdatasync - found
  288. -- Looking for fedisableexcept
  289. -- Looking for fedisableexcept - found
  290. -- Looking for fseeko
  291. -- Looking for fseeko - found
  292. -- Looking for fsync
  293. -- Looking for fsync - found
  294. -- Looking for gethostbyaddr_r
  295. -- Looking for gethostbyaddr_r - found
  296. -- Looking for gethrtime
  297. -- Looking for gethrtime - not found
  298. -- Looking for getnameinfo
  299. -- Looking for getnameinfo - found
  300. -- Looking for getpass
  301. -- Looking for getpass - found
  302. -- Looking for getpassphrase
  303. -- Looking for getpassphrase - not found
  304. -- Looking for getpwnam
  305. -- Looking for getpwnam - found
  306. -- Looking for getpwuid
  307. -- Looking for getpwuid - found
  308. -- Looking for getrlimit
  309. -- Looking for getrlimit - found
  310. -- Looking for getrusage
  311. -- Looking for getrusage - found
  312. -- Looking for initgroups
  313. -- Looking for initgroups - found
  314. -- Looking for issetugid
  315. -- Looking for issetugid - not found
  316. -- Looking for getuid
  317. -- Looking for getuid - found
  318. -- Looking for geteuid
  319. -- Looking for geteuid - found
  320. -- Looking for getgid
  321. -- Looking for getgid - found
  322. -- Looking for getegid
  323. -- Looking for getegid - found
  324. -- Looking for lstat
  325. -- Looking for lstat - found
  326. -- Looking for madvise
  327. -- Looking for madvise - found
  328. -- Looking for malloc_info
  329. -- Looking for malloc_info - found
  330. -- Looking for memrchr
  331. -- Looking for memrchr - found
  332. -- Looking for mlock
  333. -- Looking for mlock - found
  334. -- Looking for mlockall
  335. -- Looking for mlockall - found
  336. -- Looking for mmap64
  337. -- Looking for mmap64 - found
  338. -- Looking for poll
  339. -- Looking for poll - found
  340. -- Looking for posix_fallocate
  341. -- Looking for posix_fallocate - found
  342. -- Looking for posix_memalign
  343. -- Looking for posix_memalign - found
  344. -- Looking for pread
  345. -- Looking for pread - found
  346. -- Looking for pthread_condattr_setclock
  347. -- Looking for pthread_condattr_setclock - found
  348. -- Looking for pthread_sigmask
  349. -- Looking for pthread_sigmask - found
  350. -- Looking for readlink
  351. -- Looking for readlink - found
  352. -- Looking for realpath
  353. -- Looking for realpath - found
  354. -- Looking for setfd
  355. -- Looking for setfd - not found
  356. -- Looking for sigaction
  357. -- Looking for sigaction - found
  358. -- Looking for sleep
  359. -- Looking for sleep - found
  360. -- Looking for stpcpy
  361. -- Looking for stpcpy - found
  362. -- Looking for stpncpy
  363. -- Looking for stpncpy - found
  364. -- Looking for strlcpy
  365. -- Looking for strlcpy - not found
  366. -- Looking for strndup
  367. -- Looking for strndup - found
  368. -- Looking for strnlen
  369. -- Looking for strnlen - found
  370. -- Looking for strlcat
  371. -- Looking for strlcat - not found
  372. -- Looking for strsignal
  373. -- Looking for strsignal - found
  374. -- Looking for fgetln
  375. -- Looking for fgetln - not found
  376. -- Looking for strsep
  377. -- Looking for strsep - found
  378. -- Looking for tell
  379. -- Looking for tell - not found
  380. -- Looking for vasprintf
  381. -- Looking for vasprintf - found
  382. -- Looking for memalign
  383. -- Looking for memalign - found
  384. -- Looking for nl_langinfo
  385. -- Looking for nl_langinfo - found
  386. -- Looking for ntohll
  387. -- Looking for ntohll - not found
  388. -- Looking for memset_s
  389. -- Looking for memset_s - not found
  390. -- Looking for clock_gettime
  391. -- Looking for clock_gettime - found
  392. -- Looking for epoll_create
  393. -- Looking for epoll_create - found
  394. -- Looking for inet_ntop
  395. -- Looking for inet_ntop - found
  396. -- Looking for kqueue
  397. -- Looking for kqueue - not found
  398. -- Looking for timeradd
  399. -- Looking for timeradd - found
  400. -- Looking for timerclear
  401. -- Looking for timerclear - found
  402. -- Looking for timercmp
  403. -- Looking for timercmp - found
  404. -- Looking for timerisset
  405. -- Looking for timerisset - found
  406. -- Looking for include file sys/time.h
  407. -- Looking for include file sys/time.h - found
  408. -- Looking for include file sys/times.h
  409. -- Looking for include file sys/times.h - found
  410. -- Looking for times
  411. -- Looking for times - found
  412. -- Looking for gettimeofday
  413. -- Looking for gettimeofday - found
  414. -- Looking for lrand48
  415. -- Looking for lrand48 - found
  416. -- Looking for TIOCGWINSZ
  417. -- Looking for TIOCGWINSZ - found
  418. -- Looking for FIONREAD
  419. -- Looking for FIONREAD - found
  420. -- Looking for FIONREAD
  421. -- Looking for FIONREAD - not found
  422. -- Looking for SIGEV_THREAD_ID
  423. -- Looking for SIGEV_THREAD_ID - found
  424. -- Looking for SIGEV_PORT
  425. -- Looking for SIGEV_PORT - not found
  426. -- Looking for log2
  427. -- Looking for log2 - found
  428. -- Looking for isinf
  429. -- Looking for isinf - found
  430. -- Performing Test HAVE_CXX_ISINF
  431. -- Performing Test HAVE_CXX_ISINF - Success
  432. -- Looking for timer_create
  433. -- Looking for timer_create - found
  434. -- Looking for timer_settime
  435. -- Looking for timer_settime - found
  436. -- Looking for kqueue
  437. -- Looking for kqueue - not found
  438. -- Looking for EVFILT_TIMER
  439. -- Looking for EVFILT_TIMER - not found
  440. -- Check if the system is big endian
  441. -- Searching 16 bit integer
  442. -- Check size of unsigned short
  443. -- Check size of unsigned short - done
  444. -- Using unsigned short
  445. -- Check if the system is big endian - little endian
  446. -- Check size of char *
  447. -- Check size of char * - done
  448. -- Check size of long
  449. -- Check size of long - done
  450. -- Check size of short
  451. -- Check size of short - done
  452. -- Check size of int
  453. -- Check size of int - done
  454. -- Check size of long long
  455. -- Check size of long long - done
  456. -- Check size of off_t
  457. -- Check size of off_t - done
  458. -- Check size of time_t
  459. -- Check size of time_t - done
  460. -- Check size of struct timespec
  461. -- Check size of struct timespec - done
  462. -- Check size of uint
  463. -- Check size of uint - done
  464. -- Check size of ulong
  465. -- Check size of ulong - done
  466. -- Check size of u_int32_t
  467. -- Check size of u_int32_t - done
  468. -- Performing Test HAVE_VISIBILITY_HIDDEN
  469. -- Performing Test HAVE_VISIBILITY_HIDDEN - Success
  470. -- Checking stack direction : -1
  471. -- Looking for include files time.h, sys/time.h
  472. -- Looking for include files time.h, sys/time.h - found
  473. -- Looking for O_NONBLOCK
  474. -- Looking for O_NONBLOCK - found
  475. -- Performing Test HAVE_PAUSE_INSTRUCTION
  476. -- Performing Test HAVE_PAUSE_INSTRUCTION - Success
  477. -- Performing Test HAVE_BUILTIN_UNREACHABLE
  478. -- Performing Test HAVE_BUILTIN_UNREACHABLE - Success
  479. -- Performing Test HAVE_BUILTIN_EXPECT
  480. -- Performing Test HAVE_BUILTIN_EXPECT - Success
  481. -- Performing Test HAVE_BUILTIN_STPCPY
  482. -- Performing Test HAVE_BUILTIN_STPCPY - Success
  483. -- Performing Test HAVE_GCC_ATOMIC_BUILTINS
  484. -- Performing Test HAVE_GCC_ATOMIC_BUILTINS - Success
  485. -- Performing Test HAVE_GCC_SYNC_BUILTINS
  486. -- Performing Test HAVE_GCC_SYNC_BUILTINS - Success
  487. -- Looking for netinet/in6.h
  488. -- Looking for netinet/in6.h - not found
  489. -- Check size of struct sockaddr_in6
  490. -- Check size of struct sockaddr_in6 - done
  491. -- Check size of struct in6_addr
  492. -- Check size of struct in6_addr - done
  493. -- Performing Test HAVE_SOCKADDR_STORAGE_SS_FAMILY
  494. -- Performing Test HAVE_SOCKADDR_STORAGE_SS_FAMILY - Success
  495. -- Performing Test HAVE_SOCKADDR_IN_SIN_LEN
  496. -- Performing Test HAVE_SOCKADDR_IN_SIN_LEN - Failed
  497. -- Performing Test HAVE_SOCKADDR_IN6_SIN6_LEN
  498. -- Performing Test HAVE_SOCKADDR_IN6_SIN6_LEN - Failed
  499. -- Performing Test HAVE_PTHREAD_THREADID_NP
  500. -- Performing Test HAVE_PTHREAD_THREADID_NP - Failed
  501. -- Performing Test HAVE_IMPLICIT_DEPENDENT_NAME_TYPING
  502. -- Performing Test HAVE_IMPLICIT_DEPENDENT_NAME_TYPING - Failed
  503. -- Looking for chown
  504. -- Looking for chown - found
  505. -- Looking for include file numa.h
  506. -- Looking for include file numa.h - not found
  507. -- Looking for include file numaif.h
  508. -- Looking for include file numaif.h - not found
  509. -- NUMA library missing or required version not available
  510. -- Check size of socklen_t
  511. -- Check size of socklen_t - failed
  512. -- Looking for crc32
  513. -- Looking for crc32 - found
  514. -- Looking for compressBound
  515. -- Looking for compressBound - found
  516. -- Looking for deflateBound
  517. -- Looking for deflateBound - found
  518. -- Performing Test HAVE_NO_UNUSED_CONST_VAR
  519. -- Performing Test HAVE_NO_UNUSED_CONST_VAR - Success
  520. -- Check size of mbstate_t
  521. -- Check size of mbstate_t - done
  522. -- Performing Test HAVE_LANGINFO_CODESET
  523. -- Performing Test HAVE_LANGINFO_CODESET - Success
  524. -- Looking for wcsdup
  525. -- Looking for wcsdup - found
  526. -- Check size of wchar_t
  527. -- Check size of wchar_t - done
  528. -- Check size of wint_t
  529. -- Check size of wint_t - done
  530. -- Found Curses: /usr/lib64/libcurses.so
  531. -- Looking for tputs in /usr/lib64/libcurses.so
  532. -- Looking for tputs in /usr/lib64/libcurses.so - found
  533. -- Looking for 3 include files stdio.h, ..., readline/history.h
  534. -- Looking for 3 include files stdio.h, ..., readline/history.h - found
  535. -- READLINE_INCLUDE_DIR /usr/include/readline
  536. -- READLINE_LIBRARY /usr/lib64/libreadline.so
  537. -- Performing Test READLINE_HAVE_HIST_ENTRY
  538. -- Performing Test READLINE_HAVE_HIST_ENTRY - Success
  539. -- Performing Test READLINE_USE_LIBEDIT_INTERFACE
  540. -- Performing Test READLINE_USE_LIBEDIT_INTERFACE - Success
  541. -- Performing Test READLINE_USE_NEW_READLINE_INTERFACE
  542. -- Performing Test READLINE_USE_NEW_READLINE_INTERFACE - Success
  543. -- Found CURL: /usr/lib64/libcurl.so (found version "7.29.0")
  544. -- CURL_LIBRARY = /usr/lib64/libcurl.so
  545. -- Performing Test HAVE_SYS_THREAD_SELFID
  546. -- Performing Test HAVE_SYS_THREAD_SELFID - Failed
  547. -- Performing Test HAVE_SYS_GETTID
  548. -- Performing Test HAVE_SYS_GETTID - Success
  549. -- Performing Test HAVE_PTHREAD_SETNAME_NP
  550. -- Performing Test HAVE_PTHREAD_SETNAME_NP - Failed
  551. -- Performing Test HAVE_PTHREAD_GETTHREADID_NP
  552. -- Performing Test HAVE_PTHREAD_GETTHREADID_NP - Failed
  553. -- Performing Test HAVE_INTEGER_PTHREAD_SELF
  554. -- Performing Test HAVE_INTEGER_PTHREAD_SELF - Success
  555. -- Creating LDAP authentication SASL client library.
  556. -- Looking for include file sasl/sasl.h
  557. -- Looking for include file sasl/sasl.h - found
  558. -- Looking for include file lber.h
  559. -- Looking for include file lber.h - found
  560. -- Library perconaserverclient depends on OSLIBS -lpthread;/usr/lib64/libz.so;m;rt;dl
  561. -- MERGE_CONVENIENCE_LIBRARIES TARGET perconaserverclient
  562. -- MERGE_CONVENIENCE_LIBRARIES LIBS clientlib;dbug;strings;vio;mysys;mysys_ssl;/usr/lib64/libz.so;yassl;taocrypt;dl
  563. -- MERGE_CONVENIENCE_LIBRARIES MYLIBS clientlib;dbug;strings;vio;mysys;mysys_ssl;yassl;taocrypt
  564. -- Looking for include file endian.h
  565. -- Looking for include file endian.h - found
  566. -- Looking for le64toh
  567. -- Looking for le64toh - found
  568. -- Looking for le32toh
  569. -- Looking for le32toh - found
  570. -- Looking for le16toh
  571. -- Looking for le16toh - found
  572. -- Check size of long long
  573. -- Check size of long long - done
  574. -- Check size of long
  575. -- Check size of long - done
  576. -- Check size of int
  577. -- Check size of int - done
  578. -- Check if the system is big endian
  579. -- Searching 16 bit integer
  580. -- Using unsigned short
  581. -- Check if the system is big endian - little endian
  582. -- Using cmake version 2.8.12.2
  583. -- Performing Test HAVE_UNUSED_BUT_SET_VARIABLE
  584. -- Performing Test HAVE_UNUSED_BUT_SET_VARIABLE - Success
  585. -- Disabling -Wunused-but-set-variable warning for building NDB
  586. -- Performing Test HAVE_STRICT_ALIASING
  587. -- Performing Test HAVE_STRICT_ALIASING - Success
  588. -- Disabling -Wstrict-aliasing warning for building NDB
  589. -- Not building NDB
  590. -- Performing Test HAVE_UNUSED_TYPEDEFS
  591. -- Performing Test HAVE_UNUSED_TYPEDEFS - Success
  592. -- The mysqlservices library is for server plugins only
  593. -- INSTALL perconaserverclient.pc lib/pkgconfig
  594. -- CMAKE_BUILD_TYPE: RelWithDebInfo
  595. -- COMPILE_DEFINITIONS: _GNU_SOURCE;_FILE_OFFSET_BITS=64;HAVE_CONFIG_H;HAVE_LIBEVENT1
  596. -- CMAKE_C_FLAGS:  -Wall -Wextra -Wformat-security -Wvla -Wwrite-strings -Wdeclaration-after-statement
  597. -- CMAKE_CXX_FLAGS:  -Wall -Wextra -Wformat-security -Wvla -Woverloaded-virtual -Wno-unused-parameter
  598. -- CMAKE_C_LINK_FLAGS:
  599. -- CMAKE_CXX_LINK_FLAGS:
  600. -- CMAKE_C_FLAGS_RELWITHDEBINFO: -O3 -D_FORTIFY_SOURCE=2 -g -fabi-version=2 -fno-omit-frame-pointer -fno-strict-aliasing -DDBUG_OFF -DNDEBUG
  601. -- CMAKE_CXX_FLAGS_RELWITHDEBINFO: -O3 -D_FORTIFY_SOURCE=2 -g -fabi-version=2 -fno-omit-frame-pointer -fno-strict-aliasing -DDBUG_OFF -DNDEBUG
  602. -- Configuring done
  603. -- Generating done
  604. -- Build files have been written to: /home/slava/1/work
  605.  
  606. $ make
  607. Scanning dependencies of target INFO_BIN
  608. [  0%] Built target INFO_BIN
  609. Scanning dependencies of target INFO_SRC
  610. [  0%] Built target INFO_SRC
  611. Scanning dependencies of target abi_check
  612. [  0%] Built target abi_check
  613. Scanning dependencies of target yassl
  614. [  0%] Building CXX object extra/yassl/CMakeFiles/yassl.dir/src/buffer.cpp.o
  615. [  0%] Building CXX object extra/yassl/CMakeFiles/yassl.dir/src/cert_wrapper.cpp.o
  616. [  1%] Building CXX object extra/yassl/CMakeFiles/yassl.dir/src/crypto_wrapper.cpp.o
  617. [  1%] Building CXX object extra/yassl/CMakeFiles/yassl.dir/src/handshake.cpp.o
  618. [  1%] Building CXX object extra/yassl/CMakeFiles/yassl.dir/src/lock.cpp.o
  619. [  1%] Building CXX object extra/yassl/CMakeFiles/yassl.dir/src/log.cpp.o
  620. [  2%] Building CXX object extra/yassl/CMakeFiles/yassl.dir/src/socket_wrapper.cpp.o
  621. [  2%] Building CXX object extra/yassl/CMakeFiles/yassl.dir/src/ssl.cpp.o
  622. [  2%] Building CXX object extra/yassl/CMakeFiles/yassl.dir/src/timer.cpp.o
  623. [  2%] Building CXX object extra/yassl/CMakeFiles/yassl.dir/src/yassl_error.cpp.o
  624. [  3%] Building CXX object extra/yassl/CMakeFiles/yassl.dir/src/yassl_imp.cpp.o
  625. [  3%] Building CXX object extra/yassl/CMakeFiles/yassl.dir/src/yassl_int.cpp.o
  626. [  3%] Building C object extra/yassl/CMakeFiles/yassl.dir/__/__/client/get_password.c.o
  627. Linking CXX static library ../../archive_output_directory/libyassl.a
  628. [  3%] Built target yassl
  629. Scanning dependencies of target taocrypt
  630. [  3%] Building CXX object extra/yassl/taocrypt/CMakeFiles/taocrypt.dir/src/aes.cpp.o
  631. [  3%] Building CXX object extra/yassl/taocrypt/CMakeFiles/taocrypt.dir/src/aestables.cpp.o
  632. [  4%] Building CXX object extra/yassl/taocrypt/CMakeFiles/taocrypt.dir/src/algebra.cpp.o
  633. [  4%] Building CXX object extra/yassl/taocrypt/CMakeFiles/taocrypt.dir/src/arc4.cpp.o
  634. [  4%] Building CXX object extra/yassl/taocrypt/CMakeFiles/taocrypt.dir/src/asn.cpp.o
  635. [  4%] Building CXX object extra/yassl/taocrypt/CMakeFiles/taocrypt.dir/src/coding.cpp.o
  636. [  5%] Building CXX object extra/yassl/taocrypt/CMakeFiles/taocrypt.dir/src/des.cpp.o
  637. [  5%] Building CXX object extra/yassl/taocrypt/CMakeFiles/taocrypt.dir/src/dh.cpp.o
  638. [  5%] Building CXX object extra/yassl/taocrypt/CMakeFiles/taocrypt.dir/src/dsa.cpp.o
  639. [  5%] Building CXX object extra/yassl/taocrypt/CMakeFiles/taocrypt.dir/src/file.cpp.o
  640. [  6%] Building CXX object extra/yassl/taocrypt/CMakeFiles/taocrypt.dir/src/hash.cpp.o
  641. [  6%] Building CXX object extra/yassl/taocrypt/CMakeFiles/taocrypt.dir/src/integer.cpp.o
  642. [  6%] Building CXX object extra/yassl/taocrypt/CMakeFiles/taocrypt.dir/src/md2.cpp.o
  643. [  6%] Building CXX object extra/yassl/taocrypt/CMakeFiles/taocrypt.dir/src/md4.cpp.o
  644. [  7%] Building CXX object extra/yassl/taocrypt/CMakeFiles/taocrypt.dir/src/md5.cpp.o
  645. [  7%] Building CXX object extra/yassl/taocrypt/CMakeFiles/taocrypt.dir/src/misc.cpp.o
  646. [  7%] Building CXX object extra/yassl/taocrypt/CMakeFiles/taocrypt.dir/src/random.cpp.o
  647. [  7%] Building CXX object extra/yassl/taocrypt/CMakeFiles/taocrypt.dir/src/ripemd.cpp.o
  648. [  8%] Building CXX object extra/yassl/taocrypt/CMakeFiles/taocrypt.dir/src/rsa.cpp.o
  649. [  8%] Building CXX object extra/yassl/taocrypt/CMakeFiles/taocrypt.dir/src/sha.cpp.o
  650. [  8%] Building CXX object extra/yassl/taocrypt/CMakeFiles/taocrypt.dir/src/rabbit.cpp.o
  651. [  9%] Building CXX object extra/yassl/taocrypt/CMakeFiles/taocrypt.dir/src/hc128.cpp.o
  652. Linking CXX static library ../../../archive_output_directory/libtaocrypt.a
  653. [  9%] Built target taocrypt
  654. Scanning dependencies of target strings
  655. [  9%] Building C object strings/CMakeFiles/strings.dir/bchange.c.o
  656. [ 10%] Building C object strings/CMakeFiles/strings.dir/ctype-big5.c.o
  657. [ 10%] Building C object strings/CMakeFiles/strings.dir/ctype-bin.c.o
  658. [ 10%] Building C object strings/CMakeFiles/strings.dir/ctype-cp932.c.o
  659. [ 10%] Building C object strings/CMakeFiles/strings.dir/ctype-czech.c.o
  660. [ 11%] Building C object strings/CMakeFiles/strings.dir/ctype-euc_kr.c.o
  661. [ 11%] Building C object strings/CMakeFiles/strings.dir/ctype-eucjpms.c.o
  662. [ 11%] Building C object strings/CMakeFiles/strings.dir/ctype-extra.c.o
  663. [ 12%] Building C object strings/CMakeFiles/strings.dir/ctype-gb2312.c.o
  664. [ 12%] Building C object strings/CMakeFiles/strings.dir/ctype-gbk.c.o
  665. [ 12%] Building C object strings/CMakeFiles/strings.dir/ctype-gb18030.c.o
  666. [ 12%] Building C object strings/CMakeFiles/strings.dir/ctype-latin1.c.o
  667. [ 13%] Building C object strings/CMakeFiles/strings.dir/ctype-mb.c.o
  668. [ 13%] Building C object strings/CMakeFiles/strings.dir/ctype-simple.c.o
  669. [ 13%] Building C object strings/CMakeFiles/strings.dir/ctype-sjis.c.o
  670. [ 13%] Building C object strings/CMakeFiles/strings.dir/ctype-tis620.c.o
  671. [ 14%] Building C object strings/CMakeFiles/strings.dir/ctype-uca.c.o
  672. [ 14%] Building C object strings/CMakeFiles/strings.dir/ctype-ucs2.c.o
  673. [ 14%] Building C object strings/CMakeFiles/strings.dir/ctype-ujis.c.o
  674. [ 14%] Building C object strings/CMakeFiles/strings.dir/ctype-utf8.c.o
  675. [ 15%] Building C object strings/CMakeFiles/strings.dir/ctype-win1250ch.c.o
  676. [ 15%] Building C object strings/CMakeFiles/strings.dir/ctype.c.o
  677. [ 15%] Building C object strings/CMakeFiles/strings.dir/decimal.c.o
  678. [ 15%] Building C object strings/CMakeFiles/strings.dir/dtoa.c.o
  679. [ 16%] Building C object strings/CMakeFiles/strings.dir/int2str.c.o
  680. [ 16%] Building C object strings/CMakeFiles/strings.dir/is_prefix.c.o
  681. [ 16%] Building C object strings/CMakeFiles/strings.dir/llstr.c.o
  682. [ 17%] Building C object strings/CMakeFiles/strings.dir/longlong2str.c.o
  683. [ 17%] Building C object strings/CMakeFiles/strings.dir/my_strtoll10.c.o
  684. [ 17%] Building C object strings/CMakeFiles/strings.dir/my_vsnprintf.c.o
  685. [ 17%] Building C object strings/CMakeFiles/strings.dir/str2int.c.o
  686. [ 18%] Building C object strings/CMakeFiles/strings.dir/str_alloc.c.o
  687. [ 18%] Building C object strings/CMakeFiles/strings.dir/strcend.c.o
  688. [ 18%] Building C object strings/CMakeFiles/strings.dir/strend.c.o
  689. [ 18%] Building C object strings/CMakeFiles/strings.dir/strfill.c.o
  690. [ 19%] Building C object strings/CMakeFiles/strings.dir/strmake.c.o
  691. [ 19%] Building C object strings/CMakeFiles/strings.dir/my_stpmov.c.o
  692. [ 19%] Building C object strings/CMakeFiles/strings.dir/my_stpnmov.c.o
  693. [ 19%] Building C object strings/CMakeFiles/strings.dir/strxmov.c.o
  694. [ 20%] Building C object strings/CMakeFiles/strings.dir/strxnmov.c.o
  695. [ 20%] Building C object strings/CMakeFiles/strings.dir/xml.c.o
  696. [ 20%] Building C object strings/CMakeFiles/strings.dir/my_strchr.c.o
  697. [ 20%] Building C object strings/CMakeFiles/strings.dir/strcont.c.o
  698. [ 21%] Building C object strings/CMakeFiles/strings.dir/strappend.c.o
  699. Linking C static library ../archive_output_directory/libstrings.a
  700. [ 21%] Built target strings
  701. Scanning dependencies of target mysys
  702. [ 21%] Building C object mysys/CMakeFiles/mysys.dir/array.c.o
  703. [ 21%] Building C object mysys/CMakeFiles/mysys.dir/charset-def.c.o
  704. [ 22%] Building C object mysys/CMakeFiles/mysys.dir/charset.c.o
  705. [ 22%] Building C object mysys/CMakeFiles/mysys.dir/checksum.c.o
  706. [ 22%] Building C object mysys/CMakeFiles/mysys.dir/errors.c.o
  707. [ 22%] Building C object mysys/CMakeFiles/mysys.dir/hash.c.o
  708. [ 23%] Building C object mysys/CMakeFiles/mysys.dir/list.c.o
  709. [ 23%] Building C object mysys/CMakeFiles/mysys.dir/mf_cache.c.o
  710. [ 23%] Building C object mysys/CMakeFiles/mysys.dir/mf_dirname.c.o
  711. [ 25%] Building C object mysys/CMakeFiles/mysys.dir/mf_fn_ext.c.o
  712. [ 25%] Building C object mysys/CMakeFiles/mysys.dir/mf_format.c.o
  713. [ 25%] Building C object mysys/CMakeFiles/mysys.dir/mf_getdate.c.o
  714. [ 25%] Building C object mysys/CMakeFiles/mysys.dir/mf_iocache.c.o
  715. [ 26%] Building C object mysys/CMakeFiles/mysys.dir/mf_iocache2.c.o
  716. /home/slava/1/work/mysys/mf_iocache2.c: In function ‘my_b_fill’:
  717. /home/slava/1/work/mysys/mf_iocache2.c:215:5: warning: implicit declaration of function ‘mysql_file_seek’ [-Wimplicit-function-declaration]
  718.      if (mysql_file_seek(info->file, pos_in_file, MY_SEEK_SET,MYF(0)) ==
  719.      ^
  720. /home/slava/1/work/mysys/mf_iocache2.c:215:70: warning: comparison between signed and unsigned integer expressions [-Wsign-compare]
  721.      if (mysql_file_seek(info->file, pos_in_file, MY_SEEK_SET,MYF(0)) ==
  722.                                                                       ^
  723. /home/slava/1/work/mysys/mf_iocache2.c:235:3: warning: implicit declaration of function ‘mysql_file_read’ [-Wimplicit-function-declaration]
  724.    if ((length= mysql_file_read(info->file, info->buffer, max_length,
  725.    ^
  726. /home/slava/1/work/mysys/mf_iocache2.c: In function ‘my_b_pread’:
  727. /home/slava/1/work/mysys/mf_iocache2.c:256:3: warning: implicit declaration of function ‘mysql_file_pread’ [-Wimplicit-function-declaration]
  728.    if (mysql_file_pread(info->file, Buffer, Count, pos,
  729.    ^
  730. [ 26%] Building C object mysys/CMakeFiles/mysys.dir/mf_keycache.c.o
  731. [ 26%] Building C object mysys/CMakeFiles/mysys.dir/mf_keycaches.c.o
  732. [ 26%] Building C object mysys/CMakeFiles/mysys.dir/mf_loadpath.c.o
  733. [ 27%] Building C object mysys/CMakeFiles/mysys.dir/mf_pack.c.o
  734. [ 27%] Building C object mysys/CMakeFiles/mysys.dir/mf_path.c.o
  735. [ 27%] Building C object mysys/CMakeFiles/mysys.dir/mf_qsort.c.o
  736. [ 27%] Building C object mysys/CMakeFiles/mysys.dir/mf_qsort2.c.o
  737. [ 28%] Building C object mysys/CMakeFiles/mysys.dir/mf_radix.c.o
  738. [ 28%] Building C object mysys/CMakeFiles/mysys.dir/mf_same.c.o
  739. [ 28%] Building C object mysys/CMakeFiles/mysys.dir/mf_soundex.c.o
  740. [ 28%] Building C object mysys/CMakeFiles/mysys.dir/mf_arr_appstr.c.o
  741. [ 29%] Building C object mysys/CMakeFiles/mysys.dir/mf_tempfile.c.o
  742. [ 29%] Building C object mysys/CMakeFiles/mysys.dir/mf_unixpath.c.o
  743. [ 29%] Building C object mysys/CMakeFiles/mysys.dir/mf_wcomp.c.o
  744. [ 30%] Building C object mysys/CMakeFiles/mysys.dir/mulalloc.c.o
  745. [ 30%] Building C object mysys/CMakeFiles/mysys.dir/my_access.c.o
  746. [ 30%] Building C object mysys/CMakeFiles/mysys.dir/my_alloc.c.o
  747. [ 30%] Building C object mysys/CMakeFiles/mysys.dir/my_bit.c.o
  748. [ 31%] Building C object mysys/CMakeFiles/mysys.dir/my_bitmap.c.o
  749. [ 31%] Building C object mysys/CMakeFiles/mysys.dir/my_chsize.c.o
  750. [ 31%] Building C object mysys/CMakeFiles/mysys.dir/my_compress.c.o
  751. [ 31%] Building C object mysys/CMakeFiles/mysys.dir/my_copy.c.o
  752. [ 32%] Building C object mysys/CMakeFiles/mysys.dir/my_create.c.o
  753. [ 32%] Building C object mysys/CMakeFiles/mysys.dir/my_delete.c.o
  754. [ 32%] Building C object mysys/CMakeFiles/mysys.dir/my_div.c.o
  755. [ 32%] Building C object mysys/CMakeFiles/mysys.dir/my_error.c.o
  756. [ 33%] Building C object mysys/CMakeFiles/mysys.dir/my_file.c.o
  757. [ 33%] Building C object mysys/CMakeFiles/mysys.dir/my_fopen.c.o
  758. [ 33%] Building C object mysys/CMakeFiles/mysys.dir/my_fstream.c.o
  759. [ 33%] Building C object mysys/CMakeFiles/mysys.dir/my_gethwaddr.c.o
  760. [ 34%] Building C object mysys/CMakeFiles/mysys.dir/my_getsystime.c.o
  761. [ 34%] Building C object mysys/CMakeFiles/mysys.dir/my_getwd.c.o
  762. [ 34%] Building C object mysys/CMakeFiles/mysys.dir/my_compare.c.o
  763. [ 35%] Building C object mysys/CMakeFiles/mysys.dir/my_init.c.o
  764. [ 35%] Building C object mysys/CMakeFiles/mysys.dir/my_lib.c.o
  765. [ 35%] Building C object mysys/CMakeFiles/mysys.dir/my_lock.c.o
  766. [ 35%] Building C object mysys/CMakeFiles/mysys.dir/my_malloc.c.o
  767. [ 36%] Building C object mysys/CMakeFiles/mysys.dir/my_mess.c.o
  768. [ 36%] Building C object mysys/CMakeFiles/mysys.dir/my_mkdir.c.o
  769. [ 36%] Building C object mysys/CMakeFiles/mysys.dir/my_mmap.c.o
  770. [ 36%] Building C object mysys/CMakeFiles/mysys.dir/my_once.c.o
  771. [ 37%] Building C object mysys/CMakeFiles/mysys.dir/my_open.c.o
  772. [ 37%] Building C object mysys/CMakeFiles/mysys.dir/my_pread.c.o
  773. [ 37%] Building C object mysys/CMakeFiles/mysys.dir/my_read.c.o
  774. [ 37%] Building C object mysys/CMakeFiles/mysys.dir/my_redel.c.o
  775. [ 38%] Building C object mysys/CMakeFiles/mysys.dir/my_rename.c.o
  776. [ 38%] Building C object mysys/CMakeFiles/mysys.dir/my_seek.c.o
  777. [ 38%] Building C object mysys/CMakeFiles/mysys.dir/my_static.c.o
  778. [ 38%] Building C object mysys/CMakeFiles/mysys.dir/my_symlink.c.o
  779. [ 39%] Building C object mysys/CMakeFiles/mysys.dir/my_symlink2.c.o
  780. [ 39%] Building C object mysys/CMakeFiles/mysys.dir/my_sync.c.o
  781. [ 39%] Building C object mysys/CMakeFiles/mysys.dir/my_thr_init.c.o
  782. [ 40%] Building C object mysys/CMakeFiles/mysys.dir/my_write.c.o
  783. [ 40%] Building C object mysys/CMakeFiles/mysys.dir/ptr_cmp.c.o
  784. [ 40%] Building C object mysys/CMakeFiles/mysys.dir/queues.c.o
  785. [ 40%] Building C object mysys/CMakeFiles/mysys.dir/sql_chars.c.o
  786. [ 41%] Building C object mysys/CMakeFiles/mysys.dir/stacktrace.c.o
  787. [ 41%] Building C object mysys/CMakeFiles/mysys.dir/string.c.o
  788. [ 41%] Building C object mysys/CMakeFiles/mysys.dir/thr_cond.c.o
  789. [ 41%] Building C object mysys/CMakeFiles/mysys.dir/thr_lock.c.o
  790. [ 42%] Building C object mysys/CMakeFiles/mysys.dir/thr_mutex.c.o
  791. [ 42%] Building C object mysys/CMakeFiles/mysys.dir/thr_rwlock.c.o
  792. [ 42%] Building C object mysys/CMakeFiles/mysys.dir/tree.c.o
  793. [ 42%] Building C object mysys/CMakeFiles/mysys.dir/typelib.c.o
  794. [ 43%] Building C object mysys/CMakeFiles/mysys.dir/base64.c.o
  795. [ 43%] Building C object mysys/CMakeFiles/mysys.dir/my_memmem.c.o
  796. [ 43%] Building C object mysys/CMakeFiles/mysys.dir/lf_alloc-pin.c.o
  797. [ 43%] Building C object mysys/CMakeFiles/mysys.dir/lf_dynarray.c.o
  798. [ 44%] Building C object mysys/CMakeFiles/mysys.dir/lf_hash.c.o
  799. [ 44%] Building C object mysys/CMakeFiles/mysys.dir/my_rdtsc.c.o
  800. [ 44%] Building C object mysys/CMakeFiles/mysys.dir/psi_noop.c.o
  801. [ 45%] Building C object mysys/CMakeFiles/mysys.dir/my_syslog.c.o
  802. [ 45%] Building C object mysys/CMakeFiles/mysys.dir/my_chmod.c.o
  803. [ 45%] Building C object mysys/CMakeFiles/mysys.dir/my_thread.c.o
  804. [ 45%] Building C object mysys/CMakeFiles/mysys.dir/system_key.c.o
  805. [ 46%] Building C object mysys/CMakeFiles/mysys.dir/posix_timers.c.o
  806. [ 46%] Building C object mysys/CMakeFiles/mysys.dir/my_largepage.c.o
  807. Linking C static library ../archive_output_directory/libmysys.a
  808. [ 46%] Built target mysys
  809. Scanning dependencies of target dbug
  810. [ 46%] Building C object dbug/CMakeFiles/dbug.dir/dbug.c.o
  811. Linking C static library ../archive_output_directory/libdbug.a
  812. [ 46%] Built target dbug
  813. Scanning dependencies of target vio
  814. [ 46%] Building C object vio/CMakeFiles/vio.dir/vio.c.o
  815. [ 46%] Building C object vio/CMakeFiles/vio.dir/viosocket.c.o
  816. [ 47%] Building C object vio/CMakeFiles/vio.dir/viossl.c.o
  817. [ 47%] Building C object vio/CMakeFiles/vio.dir/viosslfactories.c.o
  818. Linking C static library ../archive_output_directory/libvio.a
  819. [ 47%] Built target vio
  820. Scanning dependencies of target regex
  821. [ 47%] Building C object regex/CMakeFiles/regex.dir/regcomp.c.o
  822. [ 48%] Building C object regex/CMakeFiles/regex.dir/regerror.c.o
  823. [ 48%] Building C object regex/CMakeFiles/regex.dir/regexec.c.o
  824. [ 48%] Building C object regex/CMakeFiles/regex.dir/regfree.c.o
  825. [ 48%] Building C object regex/CMakeFiles/regex.dir/reginit.c.o
  826. Linking C static library ../archive_output_directory/libregex.a
  827. [ 48%] Built target regex
  828. Scanning dependencies of target base64_test
  829. [ 48%] Building C object mysys/CMakeFiles/base64_test.dir/base64.c.o
  830. Linking C executable base64_test
  831. [ 48%] Built target base64_test
  832. Scanning dependencies of target queues
  833. [ 48%] Building C object mysys/CMakeFiles/queues.dir/queues.c.o
  834. Linking C executable queues
  835. [ 48%] Built target queues
  836. Scanning dependencies of target thr_lock
  837. [ 48%] Building C object mysys/CMakeFiles/thr_lock.dir/thr_lock.c.o
  838. Linking C executable thr_lock
  839. [ 48%] Built target thr_lock
  840. Scanning dependencies of target mysys_ssl
  841. [ 48%] Building CXX object mysys_ssl/CMakeFiles/mysys_ssl.dir/crypt_genhash_impl.cc.o
  842. [ 48%] Building CXX object mysys_ssl/CMakeFiles/mysys_ssl.dir/mf_tempdir.cc.o
  843. [ 50%] Building CXX object mysys_ssl/CMakeFiles/mysys_ssl.dir/my_default.cc.o
  844. [ 50%] Building CXX object mysys_ssl/CMakeFiles/mysys_ssl.dir/my_getopt.cc.o
  845. [ 50%] Building CXX object mysys_ssl/CMakeFiles/mysys_ssl.dir/my_aes.cc.o
  846. [ 50%] Building CXX object mysys_ssl/CMakeFiles/mysys_ssl.dir/my_sha1.cc.o
  847. [ 51%] Building CXX object mysys_ssl/CMakeFiles/mysys_ssl.dir/my_sha2.cc.o
  848. [ 51%] Building CXX object mysys_ssl/CMakeFiles/mysys_ssl.dir/my_md5.cc.o
  849. [ 51%] Building CXX object mysys_ssl/CMakeFiles/mysys_ssl.dir/my_rnd.cc.o
  850. [ 51%] Building CXX object mysys_ssl/CMakeFiles/mysys_ssl.dir/my_murmur3.cc.o
  851. [ 52%] Building CXX object mysys_ssl/CMakeFiles/mysys_ssl.dir/my_crypt.cc.o
  852. [ 52%] Building CXX object mysys_ssl/CMakeFiles/mysys_ssl.dir/my_aes_yassl.cc.o
  853. Linking CXX static library ../archive_output_directory/libmysys_ssl.a
  854. [ 52%] Built target mysys_ssl
  855. Scanning dependencies of target comp_err
  856. [ 52%] Building C object extra/CMakeFiles/comp_err.dir/comp_err.c.o
  857. Linking CXX executable comp_err
  858. [ 52%] Built target comp_err
  859. Scanning dependencies of target GenError
  860. [ 52%] Generating ../include/mysqld_error.h, ../sql/share/english/errmsg.sys
  861. [ 52%] Built target GenError
  862. Scanning dependencies of target clientlib
  863. [ 52%] Building C object libmysql/CMakeFiles/clientlib.dir/libmysql.c.o
  864. [ 53%] Building C object libmysql/CMakeFiles/clientlib.dir/errmsg.c.o
  865. [ 53%] Building C object libmysql/CMakeFiles/clientlib.dir/__/sql-common/client.c.o
  866. [ 53%] Building C object libmysql/CMakeFiles/clientlib.dir/__/sql-common/my_time.c.o
  867. [ 53%] Building C object libmysql/CMakeFiles/clientlib.dir/__/sql-common/client_plugin.c.o
  868. [ 54%] Building CXX object libmysql/CMakeFiles/clientlib.dir/__/sql-common/client_authentication.cc.o
  869. [ 54%] Building C object libmysql/CMakeFiles/clientlib.dir/__/sql-common/get_password.c.o
  870. [ 54%] Building CXX object libmysql/CMakeFiles/clientlib.dir/__/sql/net_serv.cc.o
  871. [ 55%] Building C object libmysql/CMakeFiles/clientlib.dir/__/sql-common/pack.c.o
  872. [ 55%] Building C object libmysql/CMakeFiles/clientlib.dir/__/sql/auth/password.c.o
  873. [ 55%] Building C object libmysql/CMakeFiles/clientlib.dir/mysql_trace.c.o
  874. Linking CXX static library ../archive_output_directory/libclientlib.a
  875. [ 55%] Built target clientlib
  876. Scanning dependencies of target libmysql
  877. [ 55%] Building CXX object libmysql/CMakeFiles/libmysql.dir/libmysql_dummy.cc.o
  878. Linking CXX shared library libperconaserverclient.so
  879. [ 55%] Built target libmysql
  880. Scanning dependencies of target libmysql_api_test
  881. [ 55%] Building C object libmysql/CMakeFiles/libmysql_api_test.dir/api_test.c.o
  882. Linking CXX executable libmysql_api_test
  883. [ 55%] Built target libmysql_api_test
  884. [ 55%] Generating ../archive_output_directory/perconaserverclient_depends.c
  885. Scanning dependencies of target perconaserverclient
  886. [ 56%] Building C object libmysql/CMakeFiles/perconaserverclient.dir/__/archive_output_directory/perconaserverclient_depends.c.o
  887. Linking C static library ../archive_output_directory/libperconaserverclient.a
  888. Merging library perconaserverclient
  889. /usr/bin/ar: creating /home/slava/1/work/archive_output_directory/libperconaserverclient.a
  890. [ 56%] Built target perconaserverclient
  891. Scanning dependencies of target authentication_ldap_sasl_client
  892. [ 57%] Building CXX object libmysql/authentication_ldap/CMakeFiles/authentication_ldap_sasl_client.dir/auth_ldap_sasl_client.cc.o
  893. [ 57%] Building CXX object libmysql/authentication_ldap/CMakeFiles/authentication_ldap_sasl_client.dir/log_client.cc.o
  894. Linking CXX shared module authentication_ldap_sasl_client.so
  895. [ 57%] Built target authentication_ldap_sasl_client
  896. Scanning dependencies of target binlogevents_static
  897. [ 57%] Building CXX object libbinlogevents/src/CMakeFiles/binlogevents_static.dir/statement_events.cpp.o
  898. [ 58%] Building CXX object libbinlogevents/src/CMakeFiles/binlogevents_static.dir/control_events.cpp.o
  899. [ 58%] Building CXX object libbinlogevents/src/CMakeFiles/binlogevents_static.dir/load_data_events.cpp.o
  900. [ 58%] Building CXX object libbinlogevents/src/CMakeFiles/binlogevents_static.dir/rows_event.cpp.o
  901. [ 58%] Building CXX object libbinlogevents/src/CMakeFiles/binlogevents_static.dir/binlog_event.cpp.o
  902. [ 59%] Building CXX object libbinlogevents/src/CMakeFiles/binlogevents_static.dir/binary_log_funcs.cpp.o
  903. [ 59%] Building CXX object libbinlogevents/src/CMakeFiles/binlogevents_static.dir/uuid.cpp.o
  904. Linking CXX static library ../lib/libbinlogevents.a
  905. [ 59%] Built target binlogevents_static
  906. Scanning dependencies of target binlogstandalone_shared
  907. [ 59%] Building CXX object libbinlogstandalone/src/CMakeFiles/binlogstandalone_shared.dir/__/__/libbinlogevents/src/load_data_events.cpp.o
  908. [ 59%] Building CXX object libbinlogstandalone/src/CMakeFiles/binlogstandalone_shared.dir/__/__/libbinlogevents/src/rows_event.cpp.o
  909. [ 60%] Building CXX object libbinlogstandalone/src/CMakeFiles/binlogstandalone_shared.dir/__/__/libbinlogevents/src/binlog_event.cpp.o
  910. [ 60%] Building CXX object libbinlogstandalone/src/CMakeFiles/binlogstandalone_shared.dir/__/__/libbinlogevents/src/control_events.cpp.o
  911. [ 60%] Building CXX object libbinlogstandalone/src/CMakeFiles/binlogstandalone_shared.dir/__/__/libbinlogevents/src/statement_events.cpp.o
  912. [ 61%] Building CXX object libbinlogstandalone/src/CMakeFiles/binlogstandalone_shared.dir/__/__/libbinlogevents/src/uuid.cpp.o
  913. Linking CXX shared library ../lib/libbinlogstandalone.so
  914. [ 61%] Built target binlogstandalone_shared
  915. Scanning dependencies of target binlogstandalone_static
  916. [ 61%] Building CXX object libbinlogstandalone/src/CMakeFiles/binlogstandalone_static.dir/__/__/libbinlogevents/src/load_data_events.cpp.o
  917. [ 61%] Building CXX object libbinlogstandalone/src/CMakeFiles/binlogstandalone_static.dir/__/__/libbinlogevents/src/rows_event.cpp.o
  918. [ 61%] Building CXX object libbinlogstandalone/src/CMakeFiles/binlogstandalone_static.dir/__/__/libbinlogevents/src/binlog_event.cpp.o
  919. [ 62%] Building CXX object libbinlogstandalone/src/CMakeFiles/binlogstandalone_static.dir/__/__/libbinlogevents/src/control_events.cpp.o
  920. [ 62%] Building CXX object libbinlogstandalone/src/CMakeFiles/binlogstandalone_static.dir/__/__/libbinlogevents/src/statement_events.cpp.o
  921. [ 62%] Building CXX object libbinlogstandalone/src/CMakeFiles/binlogstandalone_static.dir/__/__/libbinlogevents/src/uuid.cpp.o
  922. Linking CXX static library ../lib/libbinlogstandalone.a
  923. [ 62%] Built target binlogstandalone_static
  924. Scanning dependencies of target lz4_lib
  925. [ 62%] Building C object extra/CMakeFiles/lz4_lib.dir/lz4/lz4.c.o
  926. [ 62%] Building C object extra/CMakeFiles/lz4_lib.dir/lz4/lz4frame.c.o
  927. [ 62%] Building C object extra/CMakeFiles/lz4_lib.dir/lz4/lz4hc.c.o
  928. [ 63%] Building C object extra/CMakeFiles/lz4_lib.dir/lz4/xxhash.c.o
  929. Linking C static library ../archive_output_directory/liblz4_lib.a
  930. [ 63%] Built target lz4_lib
  931. Scanning dependencies of target lz4_decompress
  932. [ 64%] Building CXX object extra/CMakeFiles/lz4_decompress.dir/lz4_decompress.cc.o
  933. Linking CXX executable lz4_decompress
  934. [ 64%] Built target lz4_decompress
  935. Scanning dependencies of target my_print_defaults
  936. [ 64%] Building C object extra/CMakeFiles/my_print_defaults.dir/my_print_defaults.c.o
  937. Linking CXX executable my_print_defaults
  938. [ 64%] Built target my_print_defaults
  939. Scanning dependencies of target perror
  940. [ 64%] Building C object extra/CMakeFiles/perror.dir/perror.c.o
  941. Linking CXX executable perror
  942. [ 64%] Built target perror
  943. Scanning dependencies of target replace
  944. [ 65%] Building C object extra/CMakeFiles/replace.dir/replace.c.o
  945. Linking C executable replace
  946. [ 65%] Built target replace
  947. Scanning dependencies of target resolve_stack_dump
  948. [ 65%] Building CXX object extra/CMakeFiles/resolve_stack_dump.dir/resolve_stack_dump.cc.o
  949. Linking CXX executable resolve_stack_dump
  950. [ 65%] Built target resolve_stack_dump
  951. Scanning dependencies of target resolveip
  952. [ 65%] Building C object extra/CMakeFiles/resolveip.dir/resolveip.c.o
  953. Linking CXX executable resolveip
  954. [ 65%] Built target resolveip
  955. Scanning dependencies of target zlib_decompress
  956. [ 66%] Building CXX object extra/CMakeFiles/zlib_decompress.dir/zlib_decompress.cc.o
  957. Linking CXX executable zlib_decompress
  958. [ 66%] Built target zlib_decompress
  959. Scanning dependencies of target mysql
  960. [ 66%] Building CXX object client/CMakeFiles/mysql.dir/completion_hash.cc.o
  961. [ 66%] Building CXX object client/CMakeFiles/mysql.dir/mysql.cc.o
  962. [ 67%] Building CXX object client/CMakeFiles/mysql.dir/readline.cc.o
  963. [ 67%] Building CXX object client/CMakeFiles/mysql.dir/__/sql-common/sql_string.cc.o
  964. Linking CXX executable mysql
  965. [ 67%] Built target mysql
  966. Scanning dependencies of target mysql_config_editor
  967. [ 67%] Building CXX object client/CMakeFiles/mysql_config_editor.dir/mysql_config_editor.cc.o
  968. Linking CXX executable mysql_config_editor
  969. [ 67%] Built target mysql_config_editor
  970. Scanning dependencies of target mysql_plugin
  971. [ 67%] Building C object client/CMakeFiles/mysql_plugin.dir/mysql_plugin.c.o
  972. Linking CXX executable mysql_plugin
  973. [ 67%] Built target mysql_plugin
  974. Scanning dependencies of target mysql_secure_installation
  975. [ 68%] Building CXX object client/CMakeFiles/mysql_secure_installation.dir/mysql_secure_installation.cc.o
  976. Linking CXX executable mysql_secure_installation
  977. [ 68%] Built target mysql_secure_installation
  978. Scanning dependencies of target mysql_ssl_rsa_setup
  979. [ 68%] Building CXX object client/CMakeFiles/mysql_ssl_rsa_setup.dir/mysql_ssl_rsa_setup.cc.o
  980. [ 68%] Building CXX object client/CMakeFiles/mysql_ssl_rsa_setup.dir/path.cc.o
  981. [ 69%] Building CXX object client/CMakeFiles/mysql_ssl_rsa_setup.dir/logger.cc.o
  982. Linking CXX executable mysql_ssl_rsa_setup
  983. [ 69%] Built target mysql_ssl_rsa_setup
  984. Scanning dependencies of target mysqladmin
  985. [ 69%] Building CXX object client/CMakeFiles/mysqladmin.dir/mysqladmin.cc.o
  986. Linking CXX executable mysqladmin
  987. [ 69%] Built target mysqladmin
  988. Scanning dependencies of target mysqlbinlog
  989. [ 69%] Building CXX object client/CMakeFiles/mysqlbinlog.dir/mysqlbinlog.cc.o
  990. Linking CXX executable mysqlbinlog
  991. ../archive_output_directory/libperconaserverclient.a(mf_iocache2.c.o): In function `my_b_fill':
  992. /home/slava/1/work/mysys/mf_iocache2.c:235: undefined reference to `mysql_file_read'
  993. /home/slava/1/work/mysys/mf_iocache2.c:215: undefined reference to `mysql_file_seek'
  994. ../archive_output_directory/libperconaserverclient.a(mf_iocache2.c.o): In function `my_b_pread':
  995. /home/slava/1/work/mysys/mf_iocache2.c:256: undefined reference to `mysql_file_pread'
  996. ../archive_output_directory/libperconaserverclient.a(mf_iocache2.c.o): In function `my_b_filelength':
  997. /home/slava/1/work/mysys/mf_iocache2.c:313: undefined reference to `mysql_file_seek'
  998. collect2: error: ld returned 1 exit status
  999. make[2]: *** [client/mysqlbinlog] Error 1
  1000. make[1]: *** [client/CMakeFiles/mysqlbinlog.dir/all] Error 2
  1001. make: *** [all] Error 2
RAW Paste Data
We use cookies for various purposes including analytics. By continuing to use Pastebin, you agree to our use of cookies as described in the Cookies Policy. OK, I Understand
 
Top