Guest User

Untitled

a guest
Dec 17th, 2013
214
Never
Not a member of Pastebin yet? Sign Up, it unlocks many cool features!
  1. First try ------------------------------------------------------------------
  2.  
  3. :AtcRecordPlayDomain:test
  4. Unexpected exception thrown.
  5. org.gradle.messaging.remote.internal.MessageIOException: Could not read message from '/0:0:0:0:0:0:0:1:53248'.
  6. at org.gradle.messaging.remote.internal.inet.SocketConnection.receive(SocketConnection.java:88)
  7. at org.gradle.messaging.remote.internal.hub.MessageHub$ConnectionReceive.run(MessageHub.java:230)
  8. at org.gradle.internal.concurrent.DefaultExecutorFactory$StoppableExecutorImpl$1.run(DefaultExecutorFactory.java:66)
  9. at java.util.concurrent.ThreadPoolExecutor.runWorker(ThreadPoolExecutor.java:1145)
  10. at java.util.concurrent.ThreadPoolExecutor$Worker.run(ThreadPoolExecutor.java:615)
  11. at java.lang.Thread.run(Thread.java:744)
  12. Caused by: com.esotericsoftware.kryo.KryoException: Buffer underflow.
  13. at com.esotericsoftware.kryo.io.Input.require(Input.java:162)
  14. at com.esotericsoftware.kryo.io.Input.readByte(Input.java:255)
  15. at org.gradle.messaging.remote.internal.hub.InterHubMessageSerializer$MessageReader.read(InterHubMessageSerializer.java:64)
  16. at org.gradle.messaging.remote.internal.hub.InterHubMessageSerializer$MessageReader.read(InterHubMessageSerializer.java:53)
  17. at org.gradle.messaging.remote.internal.inet.SocketConnection.receive(SocketConnection.java:83)
  18. ... 5 more
  19. :AtcRecordPlayDomain:test FAILED
  20.  
  21. Second try ------------------------------------------------------------------
  22. Note: Recompile with -Xlint:unchecked for details.
  23. 4 warnings
  24. :AtcRecordPlayDomain:processTestResources UP-TO-DATE
  25. :AtcRecordPlayDomain:testClasses
  26. :AtcRecordPlayDomain:test
  27. Unexpected exception thrown.
  28. org.gradle.messaging.remote.internal.MessageIOException: Could not read message from '/0:0:0:0:0:0:0:1:40193'.
  29. at org.gradle.messaging.remote.internal.inet.SocketConnection.receive(SocketConnection.java:88)
  30. at org.gradle.messaging.remote.internal.hub.MessageHub$ConnectionReceive.run(MessageHub.java:230)
  31. at org.gradle.internal.concurrent.DefaultExecutorFactory$StoppableExecutorImpl$1.run(DefaultExecutorFactory.java:66)
  32. at java.util.concurrent.ThreadPoolExecutor.runWorker(ThreadPoolExecutor.java:1145)
  33. at java.util.concurrent.ThreadPoolExecutor$Worker.run(ThreadPoolExecutor.java:615)
  34. at java.lang.Thread.run(Thread.java:744)
  35. Caused by: com.esotericsoftware.kryo.KryoException: Buffer underflow.
  36. at com.esotericsoftware.kryo.io.Input.require(Input.java:162)
  37. at com.esotericsoftware.kryo.io.Input.readByte(Input.java:255)
  38. at org.gradle.messaging.remote.internal.hub.InterHubMessageSerializer$MessageReader.read(InterHubMessageSerializer.java:64)
  39. at org.gradle.messaging.remote.internal.hub.InterHubMessageSerializer$MessageReader.read(InterHubMessageSerializer.java:53)
  40. at org.gradle.messaging.remote.internal.inet.SocketConnection.receive(SocketConnection.java:83)
  41. ... 5 more
  42. :AtcRecordPlayDomain:test FAILED
  43.  
  44. FAILURE: Build failed with an exception.
RAW Paste Data