SHARE
TWEET

Untitled

a guest Oct 12th, 2017 45 Never
Not a member of Pastebin yet? Sign Up, it unlocks many cool features!
  1. Command exited with non-zero status 1
  2. 31509.46user 54716.60system 27:35.83elapsed 5207%CPU (0avgtext+0avgdata 76920maxresident)k
  3. 595112inputs+5638176outputs (5886major+1437024184minor)pagefaults 0swaps
  4. boards.cfg is up to date. Nothing to do.
  5. Summary of 2 commits for 1153 boards (64 threads, 1 job per thread)
  6. 01: Merge git://git.denx.de/u-boot-i2c
  7.    aarch64:  +   nanopi_neo2 bananapi_m64
  8.    sandbox:  +   sandbox
  9. +(sandbox)   return (addr == FDT_ADDR_T_NONE) ? NULL : (void *)addr;
  10. +(sandbox)                                             ^
  11. +(nanopi_neo2,bananapi_m64) WARNING: BL31 file bl31.bin NOT found, resulting binary is non-functional
  12. +(nanopi_neo2,bananapi_m64) Please read the section on ARM Trusted Firmware (ATF) in board/sunxi/README.sunxi64
  13. w+(sandbox) ../drivers/core/read.c: In function ?dev_read_addr_ptr?:
  14. w+(sandbox) ../drivers/core/read.c:64:44: warning: cast to pointer from integer of different size [-Wint-to-pointer-cast]
  15. 03: DM: Rework CONFIG_BLK/DM_MMC/DM_USB
  16.    aarch64:  +   ls1046aqds_nand ls2080ardb_SECURE_BOOT ls1046aqds ls1046ardb_qspi ls1012ardb_qspi_SECURE_BOOT ls2080ardb ls1043aqds_nor_ddr3 nanopi_neo2 ls1046aqds_sdcard_ifc ls1043aqds_qspi
  17.        arm:  +   vining_2000 alt colibri_imx6_nospl clearfog gwventana_gw5904 Lamobo_R1 Mele_A1000 sniper nanopi_neo inet86dz q8_a33_tablet_800x480 Mele_A1000G_quad ls1021atwr_nor_SECURE_BOOT orangepi_plus omap3_beagle Merrii_A80_Optimus A33-OLinuXino mx6sxsabresd_spl mx6ul_14x14_evk mk802_a10s ls1021aqds_nor_lpuart orangepi_zero pcm051_rev3 Linksprite_pcDuino Empire_electronix_m712 Auxtek-T003 parrot_r16 ls1021aqds_nand mk802 Linksprite_pcDuino3_Nano ls1021atwr_nor gose A10-OLinuXino-Lime Hyundai_A7HD Hummingbird_A31 MSI_Primo73 ls1021aqds_ddr4_nor_lpuart ethernut5 A20-OLinuXino_MICRO ot1200_spl q8_a23_tablet_800x480 A20-OLinuXino-Lime ls1021atwr_nor_lpuart silk warp7 colibri_imx6 inet_q972 devkit3250 xpress_spl Cubieboard4 ls1021aqds_sdcard_qspi ls1021aqds_ddr4_nor Wobo_i5 LicheePi_Zero pcm051_rev1 Cubieboard dserve_dsrv9703c h8_homlet_v2 orangepi_pc riotboard porter ls1021aqds_nor A20-OLinuXino-Lime2
  18.    powerpc:  +   BSC9132QDS_SDCARD_DDRCLK100_SECURE P1010RDB-PB_SPIFLASH_SECBOOT controlcenterd_36BIT_SDCARD BSC9132QDS_SDCARD_DDRCLK133_SECURE BSC9132QDS_NAND_DDRCLK133_SECURE P1010RDB-PA_36BIT_SPIFLASH_SECBOOT P2041RDB_SECURE_BOOT P5020DS_NAND_SECURE_BOOT BSC9132QDS_NOR_DDRCLK100_SECURE T1042RDB_SECURE_BOOT T4240QDS_SECURE_BOOT T2080RDB_SECURE_BOOT B4860QDS_SECURE_BOOT T1024QDS_DDR4_SECURE_BOOT BSC9132QDS_SPIFLASH_DDRCLK133_SECURE P5020DS_SECURE_BOOT T1040RDB_SECURE_BOOT
  19. -(sandbox)   return (addr == FDT_ADDR_T_NONE) ? NULL : (void *)addr;
  20. -(sandbox)                                             ^
  21. -(nanopi_neo2,bananapi_m64) WARNING: BL31 file bl31.bin NOT found, resulting binary is non-functional
  22. -(nanopi_neo2,bananapi_m64) Please read the section on ARM Trusted Firmware (ATF) in board/sunxi/README.sunxi64
  23. +(dserve_dsrv9703c,clearfog,Linksprite_pcDuino,Cubieboard,Lamobo_R1,Mele_A1000,nanopi_neo,inet86dz,q8_a33_tablet_800x480,Mele_A1000G_quad,orangepi_plus,Merrii_A80_Optimus,A33-OLinuXino,mk802_a10s,inet_q972,Wobo_i5,orangepi_zero,h8_homlet_v2,Empire_electronix_m712,parrot_r16,orangepi_pc,mk802,Linksprite_pcDuino3_Nano,A10-OLinuXino-Lime,Cubieboard4,Auxtek-T003,Hyundai_A7HD,Hummingbird_A31,MSI_Primo73,A20-OLinuXino-Lime2,LicheePi_Zero,A20-OLinuXino_MICRO,q8_a23_tablet_800x480,nanopi_neo2,A20-OLinuXino-Lime) ../env/mmc.c: In function ?init_mmc_for_env?:
  24. +(dserve_dsrv9703c,clearfog,Linksprite_pcDuino,Cubieboard,Lamobo_R1,Mele_A1000,nanopi_neo,inet86dz,q8_a33_tablet_800x480,Mele_A1000G_quad,orangepi_plus,Merrii_A80_Optimus,A33-OLinuXino,mk802_a10s,inet_q972,Wobo_i5,orangepi_zero,h8_homlet_v2,Empire_electronix_m712,parrot_r16,orangepi_pc,mk802,Linksprite_pcDuino3_Nano,A10-OLinuXino-Lime,Cubieboard4,Auxtek-T003,Hyundai_A7HD,Hummingbird_A31,MSI_Primo73,A20-OLinuXino-Lime2,LicheePi_Zero,A20-OLinuXino_MICRO,q8_a23_tablet_800x480,nanopi_neo2,A20-OLinuXino-Lime) ../env/mmc.c:110:29: error: ?struct mmc? has no member named ?dev?
  25. +(dserve_dsrv9703c,clearfog,Linksprite_pcDuino,Cubieboard,Lamobo_R1,Mele_A1000,nanopi_neo,inet86dz,q8_a33_tablet_800x480,Mele_A1000G_quad,orangepi_plus,Merrii_A80_Optimus,A33-OLinuXino,mk802_a10s,inet_q972,Wobo_i5,orangepi_zero,h8_homlet_v2,Empire_electronix_m712,parrot_r16,orangepi_pc,mk802,Linksprite_pcDuino3_Nano,A10-OLinuXino-Lime,Cubieboard4,Auxtek-T003,Hyundai_A7HD,Hummingbird_A31,MSI_Primo73,A20-OLinuXino-Lime2,LicheePi_Zero,A20-OLinuXino_MICRO,q8_a23_tablet_800x480,nanopi_neo2,A20-OLinuXino-Lime)   if (blk_get_from_parent(mmc->dev, &dev))
  26. +(dserve_dsrv9703c,clearfog,Linksprite_pcDuino,Cubieboard,Lamobo_R1,Mele_A1000,nanopi_neo,inet86dz,q8_a33_tablet_800x480,Mele_A1000G_quad,orangepi_plus,Merrii_A80_Optimus,A33-OLinuXino,mk802_a10s,inet_q972,Wobo_i5,orangepi_zero,h8_homlet_v2,Empire_electronix_m712,parrot_r16,orangepi_pc,mk802,Linksprite_pcDuino3_Nano,A10-OLinuXino-Lime,Cubieboard4,Auxtek-T003,Hyundai_A7HD,Hummingbird_A31,MSI_Primo73,A20-OLinuXino-Lime2,LicheePi_Zero,A20-OLinuXino_MICRO,q8_a23_tablet_800x480,nanopi_neo2,A20-OLinuXino-Lime)                              ^~
  27. +(dserve_dsrv9703c,clearfog,Linksprite_pcDuino,Cubieboard,Lamobo_R1,Mele_A1000,nanopi_neo,inet86dz,q8_a33_tablet_800x480,Mele_A1000G_quad,orangepi_plus,Merrii_A80_Optimus,A33-OLinuXino,mk802_a10s,inet_q972,Wobo_i5,orangepi_zero,h8_homlet_v2,Empire_electronix_m712,parrot_r16,orangepi_pc,mk802,Linksprite_pcDuino3_Nano,A10-OLinuXino-Lime,Cubieboard4,Auxtek-T003,Hyundai_A7HD,Hummingbird_A31,MSI_Primo73,A20-OLinuXino-Lime2,LicheePi_Zero,A20-OLinuXino_MICRO,q8_a23_tablet_800x480,nanopi_neo2,A20-OLinuXino-Lime) make[2]: *** [env/mmc.o] Error 1
  28. +(dserve_dsrv9703c,clearfog,Linksprite_pcDuino,Cubieboard,Lamobo_R1,Mele_A1000,nanopi_neo,inet86dz,q8_a33_tablet_800x480,Mele_A1000G_quad,orangepi_plus,Merrii_A80_Optimus,A33-OLinuXino,mk802_a10s,inet_q972,Wobo_i5,orangepi_zero,h8_homlet_v2,Empire_electronix_m712,parrot_r16,orangepi_pc,mk802,Linksprite_pcDuino3_Nano,A10-OLinuXino-Lime,Cubieboard4,Auxtek-T003,Hyundai_A7HD,Hummingbird_A31,MSI_Primo73,A20-OLinuXino-Lime2,LicheePi_Zero,A20-OLinuXino_MICRO,q8_a23_tablet_800x480,nanopi_neo2,A20-OLinuXino-Lime) make[1]: *** [env] Error 2
  29. +(dserve_dsrv9703c,vining_2000,alt,colibri_imx6_nospl,clearfog,gwventana_gw5904,Linksprite_pcDuino,Cubieboard,Lamobo_R1,Mele_A1000,sniper,ls1043aqds_qspi,nanopi_neo,T2080RDB_SECURE_BOOT,inet86dz,colibri_imx6,q8_a33_tablet_800x480,Mele_A1000G_quad,porter,BSC9132QDS_SDCARD_DDRCLK100_SECURE,ls1021atwr_nor_SECURE_BOOT,orangepi_plus,ls1046aqds_nand,omap3_beagle,Merrii_A80_Optimus,A33-OLinuXino,ls2080ardb_SECURE_BOOT,mx6sxsabresd_spl,mx6ul_14x14_evk,ls1021aqds_sdcard_qspi,mk802_a10s,inet_q972,Wobo_i5,ls1046aqds,ls1046ardb_qspi,ls1021aqds_nor_lpuart,devkit3250,ls1021aqds_ddr4_nor,orangepi_zero,h8_homlet_v2,pcm051_rev3,pcm051_rev1,xpress_spl,P1010RDB-PB_SPIFLASH_SECBOOT,T1040RDB_SECURE_BOOT,Empire_electronix_m712,parrot_r16,orangepi_pc,ls1021aqds_nand,mk802,Linksprite_pcDuino3_Nano,ls1021atwr_nor,gose,A10-OLinuXino-Lime,Cubieboard4,ls1012ardb_qspi_SECURE_BOOT,Auxtek-T003,T1024QDS_DDR4_SECURE_BOOT,BSC9132QDS_NOR_DDRCLK100_SECURE,controlcenterd_36BIT_SDCARD,Hyundai_A7HD,Hummingbird_A31,BSC9132QDS_SDCARD_DDRCLK133_SECURE,BSC9132QDS_SPIFLASH_DDRCLK133_SECURE,ls2080ardb,MSI_Primo73,A20-OLinuXino-Lime2,riotboard,T1042RDB_SECURE_BOOT,LicheePi_Zero,ls1043aqds_nor_ddr3,B4860QDS_SECURE_BOOT,ls1021aqds_ddr4_nor_lpuart,P5020DS_SECURE_BOOT,ethernut5,BSC9132QDS_NAND_DDRCLK133_SECURE,P1010RDB-PA_36BIT_SPIFLASH_SECBOOT,T4240QDS_SECURE_BOOT,A20-OLinuXino_MICRO,ls1021aqds_nor,ot1200_spl,P2041RDB_SECURE_BOOT,q8_a23_tablet_800x480,P5020DS_NAND_SECURE_BOOT,nanopi_neo2,A20-OLinuXino-Lime,warp7,ls1046aqds_sdcard_ifc,ls1021atwr_nor_lpuart,silk) make: *** [sub-make] Error 2
  30. +(vining_2000,colibri_imx6_nospl,ls1043aqds_qspi,colibri_imx6,ls1021atwr_nor_SECURE_BOOT,ls1046aqds_nand,ls2080ardb_SECURE_BOOT,mx6sxsabresd_spl,mx6ul_14x14_evk,ls1021aqds_sdcard_qspi,ls1046aqds,ls1046ardb_qspi,ls1021aqds_nor_lpuart,ls1021aqds_ddr4_nor,xpress_spl,ls1021aqds_nand,ls1021atwr_nor,ls1012ardb_qspi_SECURE_BOOT,ls2080ardb,riotboard,ls1043aqds_nor_ddr3,ls1021aqds_ddr4_nor_lpuart,ls1021aqds_nor,warp7,ls1021atwr_nor_lpuart) ../drivers/mmc/fsl_esdhc.c: In function ?fsl_esdhc_initialize?:
  31. +(vining_2000,colibri_imx6_nospl,ls1043aqds_qspi,colibri_imx6,ls1021atwr_nor_SECURE_BOOT,ls1046aqds_nand,ls2080ardb_SECURE_BOOT,mx6sxsabresd_spl,mx6ul_14x14_evk,ls1021aqds_sdcard_qspi,ls1046aqds,ls1046ardb_qspi,ls1021aqds_nor_lpuart,ls1021aqds_ddr4_nor,xpress_spl,ls1021aqds_nand,ls1021atwr_nor,ls1012ardb_qspi_SECURE_BOOT,ls2080ardb,riotboard,ls1043aqds_nor_ddr3,ls1021aqds_ddr4_nor_lpuart,ls1021aqds_nor,warp7,ls1021atwr_nor_lpuart) ../drivers/mmc/fsl_esdhc.c:924:6: error: ?struct fsl_esdhc_priv? has no member named ?mmc?
  32. +(vining_2000,colibri_imx6_nospl,ls1043aqds_qspi,colibri_imx6,ls1021atwr_nor_SECURE_BOOT,ls1046aqds_nand,ls2080ardb_SECURE_BOOT,mx6sxsabresd_spl,mx6ul_14x14_evk,ls1021aqds_sdcard_qspi,ls1046aqds,ls1046ardb_qspi,ls1021aqds_nor_lpuart,ls1021aqds_ddr4_nor,xpress_spl,ls1021aqds_nand,ls1021atwr_nor,ls1012ardb_qspi_SECURE_BOOT,BSC9132QDS_NOR_DDRCLK100_SECURE,BSC9132QDS_SPIFLASH_DDRCLK133_SECURE,ls2080ardb,riotboard,ls1043aqds_nor_ddr3,ls1021aqds_ddr4_nor_lpuart,BSC9132QDS_NAND_DDRCLK133_SECURE,ls1021aqds_nor,warp7,ls1021atwr_nor_lpuart)   priv->mmc = mmc;
  33. +(vining_2000,colibri_imx6_nospl,ls1043aqds_qspi,colibri_imx6,ls1021atwr_nor_SECURE_BOOT,ls1046aqds_nand,ls2080ardb_SECURE_BOOT,mx6sxsabresd_spl,mx6ul_14x14_evk,ls1021aqds_sdcard_qspi,ls1046aqds,ls1046ardb_qspi,ls1021aqds_nor_lpuart,ls1021aqds_ddr4_nor,xpress_spl,ls1021aqds_nand,ls1021atwr_nor,ls1012ardb_qspi_SECURE_BOOT,ls2080ardb,riotboard,ls1043aqds_nor_ddr3,ls1021aqds_ddr4_nor_lpuart,ls1021aqds_nor,warp7,ls1021atwr_nor_lpuart)       ^~
  34. +(vining_2000,colibri_imx6_nospl,ls1043aqds_qspi,colibri_imx6,ls1021atwr_nor_SECURE_BOOT,ls1046aqds_nand,ls2080ardb_SECURE_BOOT,mx6sxsabresd_spl,mx6ul_14x14_evk,ls1021aqds_sdcard_qspi,ls1046aqds,ls1046ardb_qspi,ls1021aqds_nor_lpuart,ls1021aqds_ddr4_nor,xpress_spl,ls1021aqds_nand,ls1021atwr_nor,ls1012ardb_qspi_SECURE_BOOT,BSC9132QDS_NOR_DDRCLK100_SECURE,BSC9132QDS_SPIFLASH_DDRCLK133_SECURE,ls2080ardb,riotboard,ls1043aqds_nor_ddr3,ls1021aqds_ddr4_nor_lpuart,BSC9132QDS_NAND_DDRCLK133_SECURE,ls1021aqds_nor,warp7,ls1021atwr_nor_lpuart) make[3]: *** [drivers/mmc/fsl_esdhc.o] Error 1
  35. +(vining_2000,colibri_imx6_nospl,ls1043aqds_qspi,colibri_imx6,ls1021atwr_nor_SECURE_BOOT,ls1046aqds_nand,ls2080ardb_SECURE_BOOT,mx6sxsabresd_spl,mx6ul_14x14_evk,ls1021aqds_sdcard_qspi,ls1046aqds,ls1046ardb_qspi,ls1021aqds_nor_lpuart,ls1021aqds_ddr4_nor,xpress_spl,ls1021aqds_nand,ls1021atwr_nor,ls1012ardb_qspi_SECURE_BOOT,BSC9132QDS_NOR_DDRCLK100_SECURE,BSC9132QDS_SPIFLASH_DDRCLK133_SECURE,ls2080ardb,riotboard,ls1043aqds_nor_ddr3,ls1021aqds_ddr4_nor_lpuart,BSC9132QDS_NAND_DDRCLK133_SECURE,ls1021aqds_nor,warp7,ls1021atwr_nor_lpuart) make[2]: *** [drivers/mmc] Error 2
  36. +(vining_2000,colibri_imx6_nospl,gwventana_gw5904,ls1043aqds_qspi,T2080RDB_SECURE_BOOT,colibri_imx6,ls1021atwr_nor_SECURE_BOOT,ls1046aqds_nand,ls2080ardb_SECURE_BOOT,mx6sxsabresd_spl,mx6ul_14x14_evk,ls1021aqds_sdcard_qspi,ls1046aqds,ls1046ardb_qspi,ls1021aqds_nor_lpuart,ls1021aqds_ddr4_nor,xpress_spl,P1010RDB-PB_SPIFLASH_SECBOOT,T1040RDB_SECURE_BOOT,ls1021aqds_nand,ls1021atwr_nor,ls1012ardb_qspi_SECURE_BOOT,T1024QDS_DDR4_SECURE_BOOT,BSC9132QDS_NOR_DDRCLK100_SECURE,BSC9132QDS_SPIFLASH_DDRCLK133_SECURE,ls2080ardb,riotboard,T1042RDB_SECURE_BOOT,ls1043aqds_nor_ddr3,ls1021aqds_ddr4_nor_lpuart,P5020DS_SECURE_BOOT,BSC9132QDS_NAND_DDRCLK133_SECURE,P1010RDB-PA_36BIT_SPIFLASH_SECBOOT,T4240QDS_SECURE_BOOT,ls1021aqds_nor,ot1200_spl,P2041RDB_SECURE_BOOT,P5020DS_NAND_SECURE_BOOT,warp7,ls1021atwr_nor_lpuart) make[1]: *** [drivers] Error 2
  37. +(alt,sniper,porter,omap3_beagle,pcm051_rev3,pcm051_rev1,gose,ethernut5,silk) cmd/built-in.o: In function `do_mmcops':
  38. +(alt,sniper,porter,omap3_beagle,pcm051_rev3,pcm051_rev1,gose,ethernut5,silk) build/../cmd/mmc.c:826: undefined reference to `get_mmc_num'
  39. +(alt,sniper,porter,omap3_beagle,pcm051_rev3,pcm051_rev1,gose,ethernut5,silk) cmd/built-in.o: In function `init_mmc_device':
  40. +(alt,sniper,porter,omap3_beagle,pcm051_rev3,pcm051_rev1,gose,ethernut5,silk) build/../cmd/mmc.c:88: undefined reference to `find_mmc_device'
  41. +(alt,sniper,porter,omap3_beagle,pcm051_rev3,pcm051_rev1,gose,ethernut5,silk) cmd/built-in.o: In function `do_mmc_list':
  42. +(alt,sniper,porter,omap3_beagle,pcm051_rev3,pcm051_rev1,gose,ethernut5,silk) build/../cmd/mmc.c:432: undefined reference to `print_mmc_devices'
  43. +(alt,sniper,porter,omap3_beagle,pcm051_rev3,pcm051_rev1,gose,ethernut5,silk) cmd/built-in.o: In function `do_mmc_dev':
  44. +(alt,sniper,porter,omap3_beagle,pcm051_rev3,pcm051_rev1,gose,ethernut5,silk) build/../cmd/mmc.c:425: undefined reference to `mmc_get_blk_desc'
  45. +(alt,sniper,porter,omap3_beagle,pcm051_rev3,pcm051_rev1,gose,ethernut5,silk) cmd/built-in.o: In function `do_mmc_erase':
  46. +(alt,sniper,porter,omap3_beagle,pcm051_rev3,pcm051_rev1,gose,ethernut5,silk) build/../cmd/mmc.c:353: undefined reference to `mmc_get_blk_desc'
  47. +(alt,sniper,porter,omap3_beagle,pcm051_rev3,pcm051_rev1,gose,ethernut5,silk) cmd/built-in.o: In function `do_mmc_write':
  48. +(alt,sniper,porter,omap3_beagle,pcm051_rev3,pcm051_rev1,gose,ethernut5,silk) build/../cmd/mmc.c:325: undefined reference to `mmc_get_blk_desc'
  49. +(alt,sniper,porter,omap3_beagle,pcm051_rev3,pcm051_rev1,gose,ethernut5,silk) cmd/built-in.o: In function `do_mmc_read':
  50. +(alt,sniper,porter,omap3_beagle,pcm051_rev3,pcm051_rev1,gose,ethernut5,silk) build/../cmd/mmc.c:295: undefined reference to `mmc_get_blk_desc'
  51. +(alt,sniper,porter,omap3_beagle,pcm051_rev3,pcm051_rev1,gose,ethernut5,silk) cmd/built-in.o: In function `do_mmcinfo':
  52. +(alt,sniper,porter,omap3_beagle,pcm051_rev3,pcm051_rev1,gose,ethernut5,silk) build/../cmd/mmc.c:105: undefined reference to `get_mmc_num'
  53. +(alt,sniper,porter,omap3_beagle,pcm051_rev3,pcm051_rev1,gose,ethernut5,silk) cmd/built-in.o: In function `do_mmc_setdsr':
  54. +(alt,sniper,porter,omap3_beagle,pcm051_rev3,pcm051_rev1,gose,ethernut5,silk) build/../cmd/mmc.c:743: undefined reference to `find_mmc_device'
  55. +(alt,porter,omap3_beagle,devkit3250,pcm051_rev3,pcm051_rev1,gose,B4860QDS_SECURE_BOOT,silk) common/built-in.o:(.u_boot_list_2_uclass_2_usb_hub+0x8): undefined reference to `dm_scan_fdt_dev'
  56. +(alt,sniper,porter,omap3_beagle,pcm051_rev3,pcm051_rev1,gose,ethernut5,silk) drivers/built-in.o: In function `mmc_set_capacity':
  57. +(alt,sniper,porter,omap3_beagle,pcm051_rev3,pcm051_rev1,gose,ethernut5,silk) build/../drivers/mmc/mmc.c:623: undefined reference to `mmc_get_blk_desc'
  58. +(alt,sniper,porter,omap3_beagle,pcm051_rev3,pcm051_rev1,gose,ethernut5,silk) drivers/built-in.o: In function `mmc_startup':
  59. +(alt,sniper,porter,omap3_beagle,pcm051_rev3,pcm051_rev1,gose,ethernut5,silk) build/../drivers/mmc/mmc.c:1413: undefined reference to `mmc_get_blk_desc'
  60. +(alt,sniper,porter,omap3_beagle,pcm051_rev3,pcm051_rev1,gose,ethernut5,silk) build/../drivers/mmc/mmc.c:1557: undefined reference to `mmc_get_blk_desc'
  61. +(alt,sniper,porter,omap3_beagle,pcm051_rev3,pcm051_rev1,gose,ethernut5,silk) drivers/built-in.o: In function `mmc_start_init':
  62. +(alt,sniper,porter,omap3_beagle,pcm051_rev3,pcm051_rev1,gose,ethernut5,silk) build/../drivers/mmc/mmc.c:1695: undefined reference to `mmc_get_blk_desc'
  63. +(alt,sniper,porter,omap3_beagle,pcm051_rev3,pcm051_rev1,gose,ethernut5,silk) drivers/built-in.o: In function `mmc_initialize':
  64. +(alt,sniper,porter,omap3_beagle,pcm051_rev3,pcm051_rev1,gose,ethernut5,silk) build/../drivers/mmc/mmc.c:1848: undefined reference to `print_mmc_devices'
  65. +(alt,sniper,porter,omap3_beagle,pcm051_rev3,pcm051_rev1,gose,ethernut5,silk) build/../drivers/mmc/mmc.c:1851: undefined reference to `mmc_do_preinit'
  66. +(alt,silk) drivers/built-in.o: In function `mmcif_mmc_init':
  67. +(alt,silk) build/../drivers/mmc/sh_mmcif.c:601: undefined reference to `mmc_create'
  68. +(alt,porter,omap3_beagle,devkit3250,pcm051_rev3,pcm051_rev1,gose,B4860QDS_SECURE_BOOT,silk) drivers/usb/host/built-in.o: In function `dev_read_u32_default':
  69. +(alt,porter,omap3_beagle,devkit3250,pcm051_rev3,pcm051_rev1,gose,B4860QDS_SECURE_BOOT,silk) build/../include/dm/read.h:418: undefined reference to `ofnode_read_u32_default'
  70. +(alt,porter,omap3_beagle,devkit3250,pcm051_rev3,pcm051_rev1,gose,B4860QDS_SECURE_BOOT,silk) drivers/usb/host/built-in.o:(.u_boot_list_2_uclass_2_usb+0x8): undefined reference to `dm_scan_fdt_dev'
  71. +(alt,sniper,porter,omap3_beagle,devkit3250,pcm051_rev3,pcm051_rev1,gose,ethernut5,silk) arm-linux-gnueabihf-ld.bfd: BFD (Linaro_Binutils-2017.02) 2.27.0.20161019 assertion fail /home/tcwg-buildslave/workspace/tcwg-make-release/label/docker-trusty-amd64-tcwg-build/target/arm-linux-gnueabihf/snapshots/binutils-gdb.git~linaro_binutils-2_27-branch/bfd/elf32-arm.c:8784
  72. +(alt,sniper,porter,omap3_beagle,devkit3250,pcm051_rev3,pcm051_rev1,gose,B4860QDS_SECURE_BOOT,ethernut5,silk) make[1]: *** [u-boot] Error 1
  73. +(colibri_imx6_nospl,gwventana_gw5904,colibri_imx6)   if (stdio_deregister_dev(sdev, true)) {
  74. +(colibri_imx6_nospl,gwventana_gw5904,colibri_imx6)       ^~~~~~~~~~~~~~~~~~~~
  75. +(clearfog)   return add_sdhci(host, 0, min_clk);
  76. +(clearfog)          ^~~~~~~~~
  77. +(gwventana_gw5904,ot1200_spl) ../drivers/ata/dwc_ahsata.c: In function ?ahci_init_one?:
  78. +(gwventana_gw5904,ot1200_spl) ../drivers/ata/dwc_ahsata.c:876:21: error: ?struct blk_desc? has no member named ?priv?
  79. +(gwventana_gw5904,ot1200_spl)   sata_dev_desc[pdev].priv = uc_priv;
  80. +(gwventana_gw5904,ot1200_spl)                      ^
  81. +(gwventana_gw5904,ot1200_spl) ../drivers/ata/dwc_ahsata.c: In function ?init_sata?:
  82. +(gwventana_gw5904,ot1200_spl) ../drivers/ata/dwc_ahsata.c:899:30: error: ?struct blk_desc? has no member named ?priv?
  83. +(gwventana_gw5904,ot1200_spl)   uc_priv = sata_dev_desc[dev].priv;
  84. +(gwventana_gw5904,ot1200_spl)                               ^
  85. +(gwventana_gw5904,ot1200_spl) ../drivers/ata/dwc_ahsata.c: In function ?reset_sata?:
  86. +(gwventana_gw5904,ot1200_spl) ../drivers/ata/dwc_ahsata.c:914:30: error: ?struct blk_desc? has no member named ?priv?
  87. +(gwventana_gw5904,ot1200_spl) ../drivers/ata/dwc_ahsata.c: In function ?sata_port_status?:
  88. +(gwventana_gw5904,ot1200_spl) ../drivers/ata/dwc_ahsata.c:935:24: error: ?struct blk_desc? has no member named ?priv?
  89. +(gwventana_gw5904,ot1200_spl)   if (sata_dev_desc[dev].priv == NULL)
  90. +(gwventana_gw5904,ot1200_spl)                         ^
  91. +(gwventana_gw5904,ot1200_spl) ../drivers/ata/dwc_ahsata.c:938:30: error: ?struct blk_desc? has no member named ?priv?
  92. +(gwventana_gw5904,ot1200_spl) ../drivers/ata/dwc_ahsata.c: In function ?sata_read?:
  93. +(gwventana_gw5904,ot1200_spl) ../drivers/ata/dwc_ahsata.c:949:51: error: ?struct blk_desc? has no member named ?priv?
  94. +(gwventana_gw5904,ot1200_spl)   struct ahci_uc_priv *uc_priv = sata_dev_desc[dev].priv;
  95. +(gwventana_gw5904,ot1200_spl)                                                    ^
  96. +(gwventana_gw5904,ot1200_spl) ../drivers/ata/dwc_ahsata.c: In function ?sata_write?:
  97. +(gwventana_gw5904,ot1200_spl) ../drivers/ata/dwc_ahsata.c:957:51: error: ?struct blk_desc? has no member named ?priv?
  98. +(gwventana_gw5904,ot1200_spl) ../drivers/ata/dwc_ahsata.c: In function ?scan_sata?:
  99. +(gwventana_gw5904,ot1200_spl) ../drivers/ata/dwc_ahsata.c:965:51: error: ?struct blk_desc? has no member named ?priv?
  100. +(gwventana_gw5904,ot1200_spl) make[3]: *** [drivers/ata/dwc_ahsata.o] Error 1
  101. +(gwventana_gw5904,T2080RDB_SECURE_BOOT,P1010RDB-PB_SPIFLASH_SECBOOT,T1040RDB_SECURE_BOOT,T1024QDS_DDR4_SECURE_BOOT,T1042RDB_SECURE_BOOT,P5020DS_SECURE_BOOT,P1010RDB-PA_36BIT_SPIFLASH_SECBOOT,T4240QDS_SECURE_BOOT,ot1200_spl,P2041RDB_SECURE_BOOT,P5020DS_NAND_SECURE_BOOT) make[2]: *** [drivers/ata] Error 2
  102. +(sniper) common/built-in.o: In function `fb_mmc_erase':
  103. +(sniper) build/../common/fb_mmc.c:360: undefined reference to `find_mmc_device'
  104. +(sniper,omap3_beagle,pcm051_rev3,pcm051_rev1) drivers/built-in.o: In function `omap_mmc_init':
  105. +(sniper,omap3_beagle,pcm051_rev3,pcm051_rev1) build/../drivers/mmc/omap_hsmmc.c:793: undefined reference to `mmc_create'
  106. +(T2080RDB_SECURE_BOOT,P1010RDB-PB_SPIFLASH_SECBOOT,T1040RDB_SECURE_BOOT,T1024QDS_DDR4_SECURE_BOOT,T1042RDB_SECURE_BOOT,P5020DS_SECURE_BOOT,P1010RDB-PA_36BIT_SPIFLASH_SECBOOT,T4240QDS_SECURE_BOOT,P2041RDB_SECURE_BOOT,P5020DS_NAND_SECURE_BOOT) ../drivers/ata/fsl_sata.c: In function 'init_sata':
  107. +(T2080RDB_SECURE_BOOT,P1010RDB-PB_SPIFLASH_SECBOOT,T1040RDB_SECURE_BOOT,T1024QDS_DDR4_SECURE_BOOT,T1042RDB_SECURE_BOOT,P5020DS_SECURE_BOOT,P1010RDB-PA_36BIT_SPIFLASH_SECBOOT,T4240QDS_SECURE_BOOT,P2041RDB_SECURE_BOOT,P5020DS_NAND_SECURE_BOOT) ../drivers/ata/fsl_sata.c:115:20: error: 'struct blk_desc' has no member named 'priv'
  108. +(T2080RDB_SECURE_BOOT,P1010RDB-PB_SPIFLASH_SECBOOT,T1040RDB_SECURE_BOOT,T1024QDS_DDR4_SECURE_BOOT,T1042RDB_SECURE_BOOT,P5020DS_SECURE_BOOT,P1010RDB-PA_36BIT_SPIFLASH_SECBOOT,T4240QDS_SECURE_BOOT,P2041RDB_SECURE_BOOT,P5020DS_NAND_SECURE_BOOT)   sata_dev_desc[dev].priv = (void *)sata;
  109. +(T2080RDB_SECURE_BOOT,P1010RDB-PB_SPIFLASH_SECBOOT,T1040RDB_SECURE_BOOT,T1024QDS_DDR4_SECURE_BOOT,T1042RDB_SECURE_BOOT,P5020DS_SECURE_BOOT,P1010RDB-PA_36BIT_SPIFLASH_SECBOOT,T4240QDS_SECURE_BOOT,P2041RDB_SECURE_BOOT,P5020DS_NAND_SECURE_BOOT)                     ^
  110. +(T2080RDB_SECURE_BOOT,P1010RDB-PB_SPIFLASH_SECBOOT,T1040RDB_SECURE_BOOT,T1024QDS_DDR4_SECURE_BOOT,T1042RDB_SECURE_BOOT,P5020DS_SECURE_BOOT,P1010RDB-PA_36BIT_SPIFLASH_SECBOOT,T4240QDS_SECURE_BOOT,P2041RDB_SECURE_BOOT,P5020DS_NAND_SECURE_BOOT) ../drivers/ata/fsl_sata.c: In function 'fsl_sata_identify':
  111. +(T2080RDB_SECURE_BOOT,P1010RDB-PB_SPIFLASH_SECBOOT,T1040RDB_SECURE_BOOT,T1024QDS_DDR4_SECURE_BOOT,T1042RDB_SECURE_BOOT,P5020DS_SECURE_BOOT,P1010RDB-PA_36BIT_SPIFLASH_SECBOOT,T4240QDS_SECURE_BOOT,P2041RDB_SECURE_BOOT,P5020DS_NAND_SECURE_BOOT) ../drivers/ata/fsl_sata.c:485:53: error: 'struct blk_desc' has no member named 'priv'
  112. +(T2080RDB_SECURE_BOOT,P1010RDB-PB_SPIFLASH_SECBOOT,T1040RDB_SECURE_BOOT,T1024QDS_DDR4_SECURE_BOOT,T1042RDB_SECURE_BOOT,P5020DS_SECURE_BOOT,P1010RDB-PA_36BIT_SPIFLASH_SECBOOT,T4240QDS_SECURE_BOOT,P2041RDB_SECURE_BOOT,P5020DS_NAND_SECURE_BOOT)   fsl_sata_t *sata = (fsl_sata_t *)sata_dev_desc[dev].priv;
  113. +(T2080RDB_SECURE_BOOT,P1010RDB-PB_SPIFLASH_SECBOOT,T1040RDB_SECURE_BOOT,T1024QDS_DDR4_SECURE_BOOT,T1042RDB_SECURE_BOOT,P5020DS_SECURE_BOOT,P1010RDB-PA_36BIT_SPIFLASH_SECBOOT,T4240QDS_SECURE_BOOT,P2041RDB_SECURE_BOOT,P5020DS_NAND_SECURE_BOOT)                                                      ^
  114. +(T2080RDB_SECURE_BOOT,P1010RDB-PB_SPIFLASH_SECBOOT,T1040RDB_SECURE_BOOT,T1024QDS_DDR4_SECURE_BOOT,T1042RDB_SECURE_BOOT,P5020DS_SECURE_BOOT,P1010RDB-PA_36BIT_SPIFLASH_SECBOOT,T4240QDS_SECURE_BOOT,P2041RDB_SECURE_BOOT,P5020DS_NAND_SECURE_BOOT) ../drivers/ata/fsl_sata.c: In function 'fsl_sata_xfer_mode':
  115. +(T2080RDB_SECURE_BOOT,P1010RDB-PB_SPIFLASH_SECBOOT,T1040RDB_SECURE_BOOT,T1024QDS_DDR4_SECURE_BOOT,T1042RDB_SECURE_BOOT,P5020DS_SECURE_BOOT,P1010RDB-PA_36BIT_SPIFLASH_SECBOOT,T4240QDS_SECURE_BOOT,P2041RDB_SECURE_BOOT,P5020DS_NAND_SECURE_BOOT) ../drivers/ata/fsl_sata.c:500:53: error: 'struct blk_desc' has no member named 'priv'
  116. +(T2080RDB_SECURE_BOOT,P1010RDB-PB_SPIFLASH_SECBOOT,T1040RDB_SECURE_BOOT,T1024QDS_DDR4_SECURE_BOOT,T1042RDB_SECURE_BOOT,P5020DS_SECURE_BOOT,P1010RDB-PA_36BIT_SPIFLASH_SECBOOT,T4240QDS_SECURE_BOOT,P2041RDB_SECURE_BOOT,P5020DS_NAND_SECURE_BOOT) ../drivers/ata/fsl_sata.c: In function 'fsl_sata_set_features':
  117. +(T2080RDB_SECURE_BOOT,P1010RDB-PB_SPIFLASH_SECBOOT,T1040RDB_SECURE_BOOT,T1024QDS_DDR4_SECURE_BOOT,T1042RDB_SECURE_BOOT,P5020DS_SECURE_BOOT,P1010RDB-PA_36BIT_SPIFLASH_SECBOOT,T4240QDS_SECURE_BOOT,P2041RDB_SECURE_BOOT,P5020DS_NAND_SECURE_BOOT) ../drivers/ata/fsl_sata.c:510:53: error: 'struct blk_desc' has no member named 'priv'
  118. +(T2080RDB_SECURE_BOOT,P1010RDB-PB_SPIFLASH_SECBOOT,T1040RDB_SECURE_BOOT,T1024QDS_DDR4_SECURE_BOOT,T1042RDB_SECURE_BOOT,P5020DS_SECURE_BOOT,P1010RDB-PA_36BIT_SPIFLASH_SECBOOT,T4240QDS_SECURE_BOOT,P2041RDB_SECURE_BOOT,P5020DS_NAND_SECURE_BOOT) ../drivers/ata/fsl_sata.c: In function 'fsl_sata_rw_cmd':
  119. +(T2080RDB_SECURE_BOOT,P1010RDB-PB_SPIFLASH_SECBOOT,T1040RDB_SECURE_BOOT,T1024QDS_DDR4_SECURE_BOOT,T1042RDB_SECURE_BOOT,P5020DS_SECURE_BOOT,P1010RDB-PA_36BIT_SPIFLASH_SECBOOT,T4240QDS_SECURE_BOOT,P2041RDB_SECURE_BOOT,P5020DS_NAND_SECURE_BOOT) ../drivers/ata/fsl_sata.c:539:53: error: 'struct blk_desc' has no member named 'priv'
  120. +(T2080RDB_SECURE_BOOT,P1010RDB-PB_SPIFLASH_SECBOOT,T1040RDB_SECURE_BOOT,T1024QDS_DDR4_SECURE_BOOT,T1042RDB_SECURE_BOOT,P5020DS_SECURE_BOOT,P1010RDB-PA_36BIT_SPIFLASH_SECBOOT,T4240QDS_SECURE_BOOT,P2041RDB_SECURE_BOOT,P5020DS_NAND_SECURE_BOOT) ../drivers/ata/fsl_sata.c: In function 'fsl_sata_flush_cache':
  121. +(T2080RDB_SECURE_BOOT,P1010RDB-PB_SPIFLASH_SECBOOT,T1040RDB_SECURE_BOOT,T1024QDS_DDR4_SECURE_BOOT,T1042RDB_SECURE_BOOT,P5020DS_SECURE_BOOT,P1010RDB-PA_36BIT_SPIFLASH_SECBOOT,T4240QDS_SECURE_BOOT,P2041RDB_SECURE_BOOT,P5020DS_NAND_SECURE_BOOT) ../drivers/ata/fsl_sata.c:564:53: error: 'struct blk_desc' has no member named 'priv'
  122. +(T2080RDB_SECURE_BOOT,P1010RDB-PB_SPIFLASH_SECBOOT,T1040RDB_SECURE_BOOT,T1024QDS_DDR4_SECURE_BOOT,T1042RDB_SECURE_BOOT,P5020DS_SECURE_BOOT,P1010RDB-PA_36BIT_SPIFLASH_SECBOOT,T4240QDS_SECURE_BOOT,P2041RDB_SECURE_BOOT,P5020DS_NAND_SECURE_BOOT) ../drivers/ata/fsl_sata.c: In function 'fsl_sata_rw_cmd_ext':
  123. +(T2080RDB_SECURE_BOOT,P1010RDB-PB_SPIFLASH_SECBOOT,T1040RDB_SECURE_BOOT,T1024QDS_DDR4_SECURE_BOOT,T1042RDB_SECURE_BOOT,P5020DS_SECURE_BOOT,P1010RDB-PA_36BIT_SPIFLASH_SECBOOT,T4240QDS_SECURE_BOOT,P2041RDB_SECURE_BOOT,P5020DS_NAND_SECURE_BOOT) ../drivers/ata/fsl_sata.c:578:53: error: 'struct blk_desc' has no member named 'priv'
  124. +(T2080RDB_SECURE_BOOT,P1010RDB-PB_SPIFLASH_SECBOOT,T1040RDB_SECURE_BOOT,T1024QDS_DDR4_SECURE_BOOT,T1042RDB_SECURE_BOOT,P5020DS_SECURE_BOOT,P1010RDB-PA_36BIT_SPIFLASH_SECBOOT,T4240QDS_SECURE_BOOT,P2041RDB_SECURE_BOOT,P5020DS_NAND_SECURE_BOOT) ../drivers/ata/fsl_sata.c: In function 'fsl_sata_rw_ncq_cmd':
  125. +(T2080RDB_SECURE_BOOT,P1010RDB-PB_SPIFLASH_SECBOOT,T1040RDB_SECURE_BOOT,T1024QDS_DDR4_SECURE_BOOT,T1042RDB_SECURE_BOOT,P5020DS_SECURE_BOOT,P1010RDB-PA_36BIT_SPIFLASH_SECBOOT,T4240QDS_SECURE_BOOT,P2041RDB_SECURE_BOOT,P5020DS_NAND_SECURE_BOOT) ../drivers/ata/fsl_sata.c:609:53: error: 'struct blk_desc' has no member named 'priv'
  126. +(T2080RDB_SECURE_BOOT,P1010RDB-PB_SPIFLASH_SECBOOT,T1040RDB_SECURE_BOOT,T1024QDS_DDR4_SECURE_BOOT,T1042RDB_SECURE_BOOT,P5020DS_SECURE_BOOT,P1010RDB-PA_36BIT_SPIFLASH_SECBOOT,T4240QDS_SECURE_BOOT,P2041RDB_SECURE_BOOT,P5020DS_NAND_SECURE_BOOT) ../drivers/ata/fsl_sata.c: In function 'fsl_sata_flush_cache_ext':
  127. +(T2080RDB_SECURE_BOOT,P1010RDB-PB_SPIFLASH_SECBOOT,T1040RDB_SECURE_BOOT,T1024QDS_DDR4_SECURE_BOOT,T1042RDB_SECURE_BOOT,P5020DS_SECURE_BOOT,P1010RDB-PA_36BIT_SPIFLASH_SECBOOT,T4240QDS_SECURE_BOOT,P2041RDB_SECURE_BOOT,P5020DS_NAND_SECURE_BOOT) ../drivers/ata/fsl_sata.c:652:53: error: 'struct blk_desc' has no member named 'priv'
  128. +(T2080RDB_SECURE_BOOT,P1010RDB-PB_SPIFLASH_SECBOOT,T1040RDB_SECURE_BOOT,T1024QDS_DDR4_SECURE_BOOT,T1042RDB_SECURE_BOOT,P5020DS_SECURE_BOOT,P1010RDB-PA_36BIT_SPIFLASH_SECBOOT,T4240QDS_SECURE_BOOT,P2041RDB_SECURE_BOOT,P5020DS_NAND_SECURE_BOOT) ../drivers/ata/fsl_sata.c: In function 'fsl_sata_init_wcache':
  129. +(T2080RDB_SECURE_BOOT,P1010RDB-PB_SPIFLASH_SECBOOT,T1040RDB_SECURE_BOOT,T1024QDS_DDR4_SECURE_BOOT,T1042RDB_SECURE_BOOT,P5020DS_SECURE_BOOT,P1010RDB-PA_36BIT_SPIFLASH_SECBOOT,T4240QDS_SECURE_BOOT,P2041RDB_SECURE_BOOT,P5020DS_NAND_SECURE_BOOT) ../drivers/ata/fsl_sata.c:666:53: error: 'struct blk_desc' has no member named 'priv'
  130. +(T2080RDB_SECURE_BOOT,P1010RDB-PB_SPIFLASH_SECBOOT,T1040RDB_SECURE_BOOT,T1024QDS_DDR4_SECURE_BOOT,T1042RDB_SECURE_BOOT,P5020DS_SECURE_BOOT,P1010RDB-PA_36BIT_SPIFLASH_SECBOOT,T4240QDS_SECURE_BOOT,P2041RDB_SECURE_BOOT,P5020DS_NAND_SECURE_BOOT) ../drivers/ata/fsl_sata.c: In function 'fsl_sata_get_wcache':
  131. +(T2080RDB_SECURE_BOOT,P1010RDB-PB_SPIFLASH_SECBOOT,T1040RDB_SECURE_BOOT,T1024QDS_DDR4_SECURE_BOOT,T1042RDB_SECURE_BOOT,P5020DS_SECURE_BOOT,P1010RDB-PA_36BIT_SPIFLASH_SECBOOT,T4240QDS_SECURE_BOOT,P2041RDB_SECURE_BOOT,P5020DS_NAND_SECURE_BOOT) ../drivers/ata/fsl_sata.c:678:53: error: 'struct blk_desc' has no member named 'priv'
  132. +(T2080RDB_SECURE_BOOT,P1010RDB-PB_SPIFLASH_SECBOOT,T1040RDB_SECURE_BOOT,T1024QDS_DDR4_SECURE_BOOT,T1042RDB_SECURE_BOOT,P5020DS_SECURE_BOOT,P1010RDB-PA_36BIT_SPIFLASH_SECBOOT,T4240QDS_SECURE_BOOT,P2041RDB_SECURE_BOOT,P5020DS_NAND_SECURE_BOOT) ../drivers/ata/fsl_sata.c: In function 'fsl_sata_get_flush':
  133. +(T2080RDB_SECURE_BOOT,P1010RDB-PB_SPIFLASH_SECBOOT,T1040RDB_SECURE_BOOT,T1024QDS_DDR4_SECURE_BOOT,T1042RDB_SECURE_BOOT,P5020DS_SECURE_BOOT,P1010RDB-PA_36BIT_SPIFLASH_SECBOOT,T4240QDS_SECURE_BOOT,P2041RDB_SECURE_BOOT,P5020DS_NAND_SECURE_BOOT) ../drivers/ata/fsl_sata.c:684:53: error: 'struct blk_desc' has no member named 'priv'
  134. +(T2080RDB_SECURE_BOOT,P1010RDB-PB_SPIFLASH_SECBOOT,T1040RDB_SECURE_BOOT,T1024QDS_DDR4_SECURE_BOOT,T1042RDB_SECURE_BOOT,P5020DS_SECURE_BOOT,P1010RDB-PA_36BIT_SPIFLASH_SECBOOT,T4240QDS_SECURE_BOOT,P2041RDB_SECURE_BOOT,P5020DS_NAND_SECURE_BOOT) ../drivers/ata/fsl_sata.c: In function 'fsl_sata_get_flush_ext':
  135. +(T2080RDB_SECURE_BOOT,P1010RDB-PB_SPIFLASH_SECBOOT,T1040RDB_SECURE_BOOT,T1024QDS_DDR4_SECURE_BOOT,T1042RDB_SECURE_BOOT,P5020DS_SECURE_BOOT,P1010RDB-PA_36BIT_SPIFLASH_SECBOOT,T4240QDS_SECURE_BOOT,P2041RDB_SECURE_BOOT,P5020DS_NAND_SECURE_BOOT) ../drivers/ata/fsl_sata.c:690:53: error: 'struct blk_desc' has no member named 'priv'
  136. +(T2080RDB_SECURE_BOOT,P1010RDB-PB_SPIFLASH_SECBOOT,T1040RDB_SECURE_BOOT,T1024QDS_DDR4_SECURE_BOOT,T1042RDB_SECURE_BOOT,P5020DS_SECURE_BOOT,P1010RDB-PA_36BIT_SPIFLASH_SECBOOT,T4240QDS_SECURE_BOOT,P2041RDB_SECURE_BOOT,P5020DS_NAND_SECURE_BOOT) ../drivers/ata/fsl_sata.c: In function 'sata_read':
  137. +(T2080RDB_SECURE_BOOT,P1010RDB-PB_SPIFLASH_SECBOOT,T1040RDB_SECURE_BOOT,T1024QDS_DDR4_SECURE_BOOT,T1042RDB_SECURE_BOOT,P5020DS_SECURE_BOOT,P1010RDB-PA_36BIT_SPIFLASH_SECBOOT,T4240QDS_SECURE_BOOT,P2041RDB_SECURE_BOOT,P5020DS_NAND_SECURE_BOOT) ../drivers/ata/fsl_sata.c:764:53: error: 'struct blk_desc' has no member named 'priv'
  138. +(T2080RDB_SECURE_BOOT,P1010RDB-PB_SPIFLASH_SECBOOT,T1040RDB_SECURE_BOOT,T1024QDS_DDR4_SECURE_BOOT,T1042RDB_SECURE_BOOT,P5020DS_SECURE_BOOT,P1010RDB-PA_36BIT_SPIFLASH_SECBOOT,T4240QDS_SECURE_BOOT,P2041RDB_SECURE_BOOT,P5020DS_NAND_SECURE_BOOT) ../drivers/ata/fsl_sata.c: In function 'sata_write':
  139. +(T2080RDB_SECURE_BOOT,P1010RDB-PB_SPIFLASH_SECBOOT,T1040RDB_SECURE_BOOT,T1024QDS_DDR4_SECURE_BOOT,T1042RDB_SECURE_BOOT,P5020DS_SECURE_BOOT,P1010RDB-PA_36BIT_SPIFLASH_SECBOOT,T4240QDS_SECURE_BOOT,P2041RDB_SECURE_BOOT,P5020DS_NAND_SECURE_BOOT) ../drivers/ata/fsl_sata.c:776:53: error: 'struct blk_desc' has no member named 'priv'
  140. +(T2080RDB_SECURE_BOOT,P1010RDB-PB_SPIFLASH_SECBOOT,T1040RDB_SECURE_BOOT,T1024QDS_DDR4_SECURE_BOOT,T1042RDB_SECURE_BOOT,P5020DS_SECURE_BOOT,P1010RDB-PA_36BIT_SPIFLASH_SECBOOT,T4240QDS_SECURE_BOOT,P2041RDB_SECURE_BOOT,P5020DS_NAND_SECURE_BOOT) ../drivers/ata/fsl_sata.c: In function 'scan_sata':
  141. +(T2080RDB_SECURE_BOOT,P1010RDB-PB_SPIFLASH_SECBOOT,T1040RDB_SECURE_BOOT,T1024QDS_DDR4_SECURE_BOOT,T1042RDB_SECURE_BOOT,P5020DS_SECURE_BOOT,P1010RDB-PA_36BIT_SPIFLASH_SECBOOT,T4240QDS_SECURE_BOOT,P2041RDB_SECURE_BOOT,P5020DS_NAND_SECURE_BOOT) ../drivers/ata/fsl_sata.c:792:53: error: 'struct blk_desc' has no member named 'priv'
  142. +(T2080RDB_SECURE_BOOT,P1010RDB-PB_SPIFLASH_SECBOOT,T1040RDB_SECURE_BOOT,T1024QDS_DDR4_SECURE_BOOT,T1042RDB_SECURE_BOOT,P5020DS_SECURE_BOOT,P1010RDB-PA_36BIT_SPIFLASH_SECBOOT,T4240QDS_SECURE_BOOT,P2041RDB_SECURE_BOOT,P5020DS_NAND_SECURE_BOOT) make[3]: *** [drivers/ata/fsl_sata.o] Error 1
  143. +(BSC9132QDS_SDCARD_DDRCLK100_SECURE,BSC9132QDS_SDCARD_DDRCLK133_SECURE) ../board/freescale/common/sdhc_boot.c: In function 'mmc_get_env_addr':
  144. +(BSC9132QDS_SDCARD_DDRCLK100_SECURE,BSC9132QDS_SDCARD_DDRCLK133_SECURE) ../board/freescale/common/sdhc_boot.c:32:9: error: 'struct mmc' has no member named 'block_dev'
  145. +(BSC9132QDS_SDCARD_DDRCLK100_SECURE,controlcenterd_36BIT_SDCARD,BSC9132QDS_SDCARD_DDRCLK133_SECURE)   n = mmc->block_dev.block_read(&mmc->block_dev, 0, 1, tmp_buf);
  146. +(BSC9132QDS_SDCARD_DDRCLK100_SECURE,controlcenterd_36BIT_SDCARD,BSC9132QDS_SDCARD_DDRCLK133_SECURE,B4860QDS_SECURE_BOOT)          ^
  147. +(BSC9132QDS_SDCARD_DDRCLK100_SECURE,BSC9132QDS_SDCARD_DDRCLK133_SECURE) ../board/freescale/common/sdhc_boot.c:32:36: error: 'struct mmc' has no member named 'block_dev'
  148. +(BSC9132QDS_SDCARD_DDRCLK100_SECURE,controlcenterd_36BIT_SDCARD,BSC9132QDS_SDCARD_DDRCLK133_SECURE)                                     ^
  149. +(BSC9132QDS_SDCARD_DDRCLK100_SECURE,BSC9132QDS_SDCARD_DDRCLK133_SECURE) make[2]: *** [board/freescale/common/sdhc_boot.o] Error 1
  150. +(BSC9132QDS_SDCARD_DDRCLK100_SECURE,BSC9132QDS_SDCARD_DDRCLK133_SECURE) make[1]: *** [board/freescale/common] Error 2
  151. +(BSC9132QDS_NOR_DDRCLK100_SECURE,BSC9132QDS_SPIFLASH_DDRCLK133_SECURE,BSC9132QDS_NAND_DDRCLK133_SECURE) ../drivers/mmc/fsl_esdhc.c: In function 'fsl_esdhc_initialize':
  152. +(BSC9132QDS_NOR_DDRCLK100_SECURE,BSC9132QDS_SPIFLASH_DDRCLK133_SECURE,BSC9132QDS_NAND_DDRCLK133_SECURE) ../drivers/mmc/fsl_esdhc.c:924:6: error: 'struct fsl_esdhc_priv' has no member named 'mmc'
  153. +(BSC9132QDS_NOR_DDRCLK100_SECURE,BSC9132QDS_SPIFLASH_DDRCLK133_SECURE,BSC9132QDS_NAND_DDRCLK133_SECURE)       ^
  154. +(controlcenterd_36BIT_SDCARD) ../board/gdsys/p1022/sdhc_boot.c: In function 'mmc_get_env_addr':
  155. +(controlcenterd_36BIT_SDCARD) ../board/gdsys/p1022/sdhc_boot.c:46:9: error: 'struct mmc' has no member named 'block_dev'
  156. +(controlcenterd_36BIT_SDCARD) ../board/gdsys/p1022/sdhc_boot.c:46:36: error: 'struct mmc' has no member named 'block_dev'
  157. +(controlcenterd_36BIT_SDCARD) make[2]: *** [board/gdsys/p1022/sdhc_boot.o] Error 1
  158. +(controlcenterd_36BIT_SDCARD) make[1]: *** [board/gdsys/p1022] Error 2
  159. +(B4860QDS_SECURE_BOOT)   ehci = (struct usb_ehci *)priv->hcd_base;
  160. +(ethernut5) drivers/built-in.o: In function `atmel_mci_init':
  161. +(ethernut5) build/../drivers/mmc/gen_atmel_mci.c:511: undefined reference to `mmc_create'
  162. +(ls1046aqds_sdcard_ifc) ../arch/arm/cpu/armv8/fsl-layerscape/ppa.c: In function ?ppa_init?:
  163. +(ls1046aqds_sdcard_ifc) ../arch/arm/cpu/armv8/fsl-layerscape/ppa.c:102:11: error: ?struct mmc? has no member named ?block_dev?
  164. +(ls1046aqds_sdcard_ifc)   ret = mmc->block_dev.block_read(&mmc->block_dev, blk, cnt, fitp);
  165. +(ls1046aqds_sdcard_ifc)            ^~
  166. +(ls1046aqds_sdcard_ifc) ../arch/arm/cpu/armv8/fsl-layerscape/ppa.c:102:38: error: ?struct mmc? has no member named ?block_dev?
  167. +(ls1046aqds_sdcard_ifc)                                       ^~
  168. +(ls1046aqds_sdcard_ifc) ../arch/arm/cpu/armv8/fsl-layerscape/ppa.c:152:11: error: ?struct mmc? has no member named ?block_dev?
  169. +(ls1046aqds_sdcard_ifc)   ret = mmc->block_dev.block_read(&mmc->block_dev,
  170. +(ls1046aqds_sdcard_ifc) ../arch/arm/cpu/armv8/fsl-layerscape/ppa.c:152:38: error: ?struct mmc? has no member named ?block_dev?
  171. +(ls1046aqds_sdcard_ifc) make[3]: *** [arch/arm/cpu/armv8/fsl-layerscape/ppa.o] Error 1
  172. +(ls1046aqds_sdcard_ifc) make[2]: *** [arch/arm/cpu/armv8/fsl-layerscape] Error 2
  173. +(ls1046aqds_sdcard_ifc) make[1]: *** [arch/arm/cpu/armv8] Error 2
  174. w-(sandbox) ../drivers/core/read.c: In function ?dev_read_addr_ptr?:
  175. w-(sandbox) ../drivers/core/read.c:64:44: warning: cast to pointer from integer of different size [-Wint-to-pointer-cast]
  176. w+(colibri_imx6_nospl,gwventana_gw5904,colibri_imx6) ../common/usb_kbd.c: In function ?usb_kbd_remove?:
  177. w+(colibri_imx6_nospl,gwventana_gw5904,colibri_imx6) ../common/usb_kbd.c:625:6: warning: implicit declaration of function ?stdio_deregister_dev? [-Wimplicit-function-declaration]
  178. w+(clearfog) ../drivers/mmc/mv_sdhci.c: In function ?mv_sdh_init?:
  179. w+(clearfog) ../drivers/mmc/mv_sdhci.c:92:9: warning: implicit declaration of function ?add_sdhci? [-Wimplicit-function-declaration]
  180. w+(B4860QDS_SECURE_BOOT) ../drivers/usb/host/ehci-fsl.c: In function 'ehci_fsl_init_after_reset':
  181. w+(B4860QDS_SECURE_BOOT) ../drivers/usb/host/ehci-fsl.c:80:9: warning: cast to pointer from integer of different size [-Wint-to-pointer-cast]
  182. w+(B4860QDS_SECURE_BOOT) ../drivers/usb/host/ehci-fsl.c: In function 'ehci_fsl_probe':
  183. w+(B4860QDS_SECURE_BOOT) ../drivers/usb/host/ehci-fsl.c:106:9: warning: cast to pointer from integer of different size [-Wint-to-pointer-cast]
  184.    aarch64: (for 13/96 boards) all +632.8 bss -265.8 data +43.7 rodata +71.2 text +783.7
  185.             ls1012aqds_qspi: all +5365 bss -1792 data +360 rodata +601 text +6196
  186.             ls1012afrdm_qspi: all +2861 bss -1664 data +208 rodata +325 text +3992
  187.       mips: (for 15/42 boards) all -0.7 bss -89.3 data +14.3 rodata +10.1 text +64.3
  188.             tplink_wdr4300 : all -10 bss -1340 data +214 rodata +152 text +964
  189.        arm: (for 97/629 boards) all -10107.0 bss -10538.1 data +66.4 rodata +7.7 spl/u-boot-spl:all +10.8 spl/u-boot-spl:data +2.3 spl/u-boot-spl:rodata -1.5 spl/u-boot-spl:text +10.0 text +357.0
  190.             mx7ulp_evk_plugin: all +6003 bss -32 data +112 rodata +483 text +5440
  191.             mx7ulp_evk     : all +6003 bss -32 data +112 rodata +483 text +5440
  192.             mx6ull_14x14_evk: all +5726 bss -8 data +112 rodata +414 text +5208
  193.             mx6sllevk      : all +4536 bss -1288 data +156 rodata +404 text +5264
  194.             mx7dsabresd    : all +4469 bss -1344 data +156 rodata +409 text +5248
  195.             mx7dsabresd_secure: all +4469 bss -1344 data +156 rodata +409 text +5248
  196.             imx6ul_isiot_nand: all +3726 bss -8 data +112 rodata +414 text +3208
  197.             am335x_hs_evm  : all -449 bss -1312 data +156 rodata +139 spl/u-boot-spl:all +460 spl/u-boot-spl:data +112 spl/u-boot-spl:rodata -216 spl/u-boot-spl:text +564 text +568
  198.             Nintendo_NES_Classic_Edition: all -460 bss -1384 data +116 rodata +112 text +696
  199.             mx6sxsabreauto : all -70723 bss -81088 data +772 rodata +713 text +8880
  200.             am57xx_hs_evm  : all -77891 bss -81512 data +676 rodata +377 spl/u-boot-spl:all +586 spl/u-boot-spl:data +112 spl/u-boot-spl:rodata +66 spl/u-boot-spl:text +408 text +2568
  201.             at91sam9261ek_dataflash_cs3: all -123428 bss -121888 data +544 rodata -516 text -1568
  202.             at91sam9261ek_dataflash_cs0: all -123428 bss -121888 data +544 rodata -516 text -1568
  203.             at91sam9xeek_dataflash_cs1: all -123780 bss -121808 data +544 rodata -516 text -2000
  204.             at91sam9260ek_dataflash_cs0: all -123780 bss -121808 data +544 rodata -516 text -2000
  205.             at91sam9260ek_dataflash_cs1: all -123780 bss -121808 data +544 rodata -516 text -2000
  206.             at91sam9g20ek_nandflash: all -123780 bss -121808 data +544 rodata -516 text -2000
  207.             at91sam9260ek_nandflash: all -123812 bss -121840 data +544 rodata -516 text -2000
RAW Paste Data
Top