SHARE
TWEET

Untitled

a guest Jan 8th, 2013 15 Never
Not a member of Pastebin yet? Sign Up, it unlocks many cool features!
  1. No handlers could be found for logger "yt"
  2. Getting current revision.
  3. quicksuite
  4.  
  5. Selecting with:
  6.      quicksuite = True
  7.  
  8. Toro-2-ShockTubeAMR
  9. Toro-6-ShockTube
  10. Toro-3-ShockTubeAMR
  11. BrioWu-MHD-1D
  12. OneZoneFreefallTest
  13. ShockPool2D
  14. WavePool
  15. Toro-3-ShockTube
  16. Toro-5-ShockTubeAMR
  17. AMRZeldovichPancake
  18. AdiabaticExpansion
  19. HDMHD2DCheckOddEvenCouplingOfRiemannSolver
  20. MHDZeldovichPancake
  21. FreeExpansion
  22. Toro-4-ShockTubeAMR
  23. PressurelessCollapse
  24. GravityTestSphere
  25. NohProblem2D
  26. FreeExpansionAMR
  27. MHD2DRotorTest
  28. AMRShockPool2D
  29. SedovBlast-MHD-2D-Gardiner
  30. InteractingBlastWaves
  31. Toro-2-ShockTube
  32. Toro-1-ShockTubeAMR
  33. PhotonShadowing
  34. PhotonTest
  35. ExtremeAdvectionTest
  36. Toro-5-ShockTube
  37. TestOrbit
  38. Toro-1-ShockTube
  39. Toro-7-ShockTube
  40. SodShockTube
  41. ZeldovichPancake
  42. Toro-4-ShockTube
  43. GravityTest
  44. Total: 36
  45.  
  46. Relative error tolerance in comparison set to 3 (i.e. 1e-3).
  47. Not including bitwise tests.
  48.  
  49. Preparing all tests.
  50. Preparing test: OneZoneFreefallTest.
  51. OneZoneFreefallTest already exists. Skipping directory.
  52. Preparing test: AMRZeldovichPancake.
  53. AMRZeldovichPancake already exists. Skipping directory.
  54. Preparing test: AdiabaticExpansion.
  55. AdiabaticExpansion already exists. Skipping directory.
  56. Preparing test: MHDZeldovichPancake.
  57. MHDZeldovichPancake already exists. Skipping directory.
  58. Preparing test: ZeldovichPancake.
  59. ZeldovichPancake already exists. Skipping directory.
  60. Preparing test: GravityTest.
  61. GravityTest already exists. Skipping directory.
  62. Preparing test: GravityTestSphere.
  63. GravityTestSphere already exists. Skipping directory.
  64. Preparing test: TestOrbit.
  65. TestOrbit already exists. Skipping directory.
  66. Preparing test: FreeExpansion.
  67. FreeExpansion already exists. Skipping directory.
  68. Preparing test: InteractingBlastWaves.
  69. InteractingBlastWaves already exists. Skipping directory.
  70. Preparing test: PressurelessCollapse.
  71. PressurelessCollapse already exists. Skipping directory.
  72. Preparing test: SodShockTube.
  73. SodShockTube already exists. Skipping directory.
  74. Preparing test: Toro-1-ShockTube.
  75. Toro-1-ShockTube already exists. Skipping directory.
  76. Preparing test: Toro-1-ShockTubeAMR.
  77. Toro-1-ShockTubeAMR already exists. Skipping directory.
  78. Preparing test: Toro-2-ShockTube.
  79. Toro-2-ShockTube already exists. Skipping directory.
  80. Preparing test: Toro-2-ShockTubeAMR.
  81. Toro-2-ShockTubeAMR already exists. Skipping directory.
  82. Preparing test: Toro-3-ShockTube.
  83. Toro-3-ShockTube already exists. Skipping directory.
  84. Preparing test: Toro-3-ShockTubeAMR.
  85. Toro-3-ShockTubeAMR already exists. Skipping directory.
  86. Preparing test: Toro-4-ShockTube.
  87. Toro-4-ShockTube already exists. Skipping directory.
  88. Preparing test: Toro-4-ShockTubeAMR.
  89. Toro-4-ShockTubeAMR already exists. Skipping directory.
  90. Preparing test: Toro-5-ShockTube.
  91. Toro-5-ShockTube already exists. Skipping directory.
  92. Preparing test: Toro-5-ShockTubeAMR.
  93. Toro-5-ShockTubeAMR already exists. Skipping directory.
  94. Preparing test: Toro-6-ShockTube.
  95. Toro-6-ShockTube already exists. Skipping directory.
  96. Preparing test: Toro-7-ShockTube.
  97. Toro-7-ShockTube already exists. Skipping directory.
  98. Preparing test: WavePool.
  99. WavePool already exists. Skipping directory.
  100. Preparing test: AMRShockPool2D.
  101. AMRShockPool2D already exists. Skipping directory.
  102. Preparing test: FreeExpansionAMR.
  103. FreeExpansionAMR already exists. Skipping directory.
  104. Preparing test: HDMHD2DCheckOddEvenCouplingOfRiemannSolver.
  105. HDMHD2DCheckOddEvenCouplingOfRiemannSolver already exists. Skipping directory.
  106. Preparing test: NohProblem2D.
  107. NohProblem2D already exists. Skipping directory.
  108. Preparing test: ShockPool2D.
  109. ShockPool2D already exists. Skipping directory.
  110. Preparing test: ExtremeAdvectionTest.
  111. ExtremeAdvectionTest already exists. Skipping directory.
  112. Preparing test: BrioWu-MHD-1D.
  113. BrioWu-MHD-1D already exists. Skipping directory.
  114. Preparing test: MHD2DRotorTest.
  115. MHD2DRotorTest already exists. Skipping directory.
  116. Preparing test: SedovBlast-MHD-2D-Gardiner.
  117. SedovBlast-MHD-2D-Gardiner already exists. Skipping directory.
  118. Preparing test: PhotonShadowing.
  119. PhotonShadowing already exists. Skipping directory.
  120. Preparing test: PhotonTest.
  121. PhotonTest already exists. Skipping directory.
  122. Running all simulations.
  123. Running simulation: 1 of 36.
  124. Running test simulation: Cooling/OneZoneFreefallTest.
  125. OneZoneFreefallTest run already completed, continuing...
  126. Running simulation: 2 of 36.
  127. Running test simulation: Cosmology/AMRZeldovichPancake.
  128. AMRZeldovichPancake run already completed, continuing...
  129. Running simulation: 3 of 36.
  130. Running test simulation: Cosmology/AdiabaticExpansion.
  131. AdiabaticExpansion run already completed, continuing...
  132. Running simulation: 4 of 36.
  133. Running test simulation: Cosmology/MHDZeldovichPancake.
  134. MHDZeldovichPancake run already completed, continuing...
  135. Running simulation: 5 of 36.
  136. Running test simulation: Cosmology/ZeldovichPancake.
  137. ZeldovichPancake run already completed, continuing...
  138. Running simulation: 6 of 36.
  139. Running test simulation: GravitySolver/GravityTest.
  140. GravityTest run already completed, continuing...
  141. Running simulation: 7 of 36.
  142. Running test simulation: GravitySolver/GravityTestSphere.
  143. GravityTestSphere run already completed, continuing...
  144. Running simulation: 8 of 36.
  145. Running test simulation: GravitySolver/TestOrbit.
  146. TestOrbit run already completed, continuing...
  147. Running simulation: 9 of 36.
  148. Running test simulation: Hydro/Hydro-1D/FreeExpansion.
  149. FreeExpansion run already completed, continuing...
  150. Running simulation: 10 of 36.
  151. Running test simulation: Hydro/Hydro-1D/InteractingBlastWaves.
  152. InteractingBlastWaves run already completed, continuing...
  153. Running simulation: 11 of 36.
  154. Running test simulation: Hydro/Hydro-1D/PressurelessCollapse.
  155. PressurelessCollapse run already completed, continuing...
  156. Running simulation: 12 of 36.
  157. Running test simulation: Hydro/Hydro-1D/SodShockTube.
  158. SodShockTube run already completed, continuing...
  159. Running simulation: 13 of 36.
  160. Running test simulation: Hydro/Hydro-1D/Toro-1-ShockTube.
  161. Toro-1-ShockTube run already completed, continuing...
  162. Running simulation: 14 of 36.
  163. Running test simulation: Hydro/Hydro-1D/Toro-1-ShockTubeAMR.
  164. Toro-1-ShockTubeAMR run already completed, continuing...
  165. Running simulation: 15 of 36.
  166. Running test simulation: Hydro/Hydro-1D/Toro-2-ShockTube.
  167. Toro-2-ShockTube run already completed, continuing...
  168. Running simulation: 16 of 36.
  169. Running test simulation: Hydro/Hydro-1D/Toro-2-ShockTubeAMR.
  170. Toro-2-ShockTubeAMR run already completed, continuing...
  171. Running simulation: 17 of 36.
  172. Running test simulation: Hydro/Hydro-1D/Toro-3-ShockTube.
  173. Toro-3-ShockTube run already completed, continuing...
  174. Running simulation: 18 of 36.
  175. Running test simulation: Hydro/Hydro-1D/Toro-3-ShockTubeAMR.
  176. Toro-3-ShockTubeAMR run already completed, continuing...
  177. Running simulation: 19 of 36.
  178. Running test simulation: Hydro/Hydro-1D/Toro-4-ShockTube.
  179. Toro-4-ShockTube run already completed, continuing...
  180. Running simulation: 20 of 36.
  181. Running test simulation: Hydro/Hydro-1D/Toro-4-ShockTubeAMR.
  182. Toro-4-ShockTubeAMR run already completed, continuing...
  183. Running simulation: 21 of 36.
  184. Running test simulation: Hydro/Hydro-1D/Toro-5-ShockTube.
  185. Toro-5-ShockTube run already completed, continuing...
  186. Running simulation: 22 of 36.
  187. Running test simulation: Hydro/Hydro-1D/Toro-5-ShockTubeAMR.
  188. Toro-5-ShockTubeAMR run already completed, continuing...
  189. Running simulation: 23 of 36.
  190. Running test simulation: Hydro/Hydro-1D/Toro-6-ShockTube.
  191. Toro-6-ShockTube run already completed, continuing...
  192. Running simulation: 24 of 36.
  193. Running test simulation: Hydro/Hydro-1D/Toro-7-ShockTube.
  194. Toro-7-ShockTube run already completed, continuing...
  195. Running simulation: 25 of 36.
  196. Running test simulation: Hydro/Hydro-1D/WavePool.
  197. WavePool run already completed, continuing...
  198. Running simulation: 26 of 36.
  199. Running test simulation: Hydro/Hydro-2D/AMRShockPool2D.
  200. AMRShockPool2D run already completed, continuing...
  201. Running simulation: 27 of 36.
  202. Running test simulation: Hydro/Hydro-2D/FreeExpansionAMR.
  203. FreeExpansionAMR run already completed, continuing...
  204. Running simulation: 28 of 36.
  205. Running test simulation: Hydro/Hydro-2D/HDMHD2DCheckOddEvenCouplingOfRiemannSolver.
  206. HDMHD2DCheckOddEvenCouplingOfRiemannSolver run already completed, continuing...
  207. Running simulation: 29 of 36.
  208. Running test simulation: Hydro/Hydro-2D/NohProblem2D.
  209. NohProblem2D run already completed, continuing...
  210. Running simulation: 30 of 36.
  211. Running test simulation: Hydro/Hydro-2D/ShockPool2D.
  212. ShockPool2D run already completed, continuing...
  213. Running simulation: 31 of 36.
  214. Running test simulation: Hydro/Hydro-3D/ExtremeAdvectionTest.
  215. ExtremeAdvectionTest run already completed, continuing...
  216. Running simulation: 32 of 36.
  217. Running test simulation: MHD/1D/BrioWu-MHD-1D.
  218. BrioWu-MHD-1D run already completed, continuing...
  219. Running simulation: 33 of 36.
  220. Running test simulation: MHD/2D/MHD2DRotorTest.
  221. MHD2DRotorTest run already completed, continuing...
  222. Running simulation: 34 of 36.
  223. Running test simulation: MHD/2D/SedovBlast-MHD-2D-Gardiner.
  224. SedovBlast-MHD-2D-Gardiner run already completed, continuing...
  225. Running simulation: 35 of 36.
  226. Running test simulation: RadiationTransport/PhotonShadowing.
  227. PhotonShadowing run already completed, continuing...
  228. Running simulation: 36 of 36.
  229. Running test simulation: RadiationTransport/PhotonTest.
  230. PhotonTest run already completed, continuing...
  231. Running all tests.
  232. Running test: 1 of 36.
  233. .........................
  234. ----------------------------------------------------------------------
  235. Ran 25 tests in 1.997s
  236.  
  237. OK
  238. Running test: 2 of 36.
  239. .........
  240. ----------------------------------------------------------------------
  241. Ran 9 tests in 1.350s
  242.  
  243. OK
  244. Running test: 3 of 36.
  245. .FEEEEEEEEEEEEEEEEEEEEEEEEEEEE
  246. ======================================================================
  247. ERROR: ProjectionValues_data0016_all_Density_0_None
  248. ----------------------------------------------------------------------
  249. Traceback (most recent call last):
  250.   File "/usr/local/lib/python2.7/dist-packages/nose-1.2.1-py2.7.egg/nose/case.py", line 197, in runTest
  251.     self.test(*self.arg)
  252.   File "/home/mqk/local/yt/yt/utilities/answer_testing/framework.py", line 279, in __call__
  253.     dd = self.reference_storage.get(self.storage_name)
  254.   File "/home/mqk/local/yt/yt/utilities/answer_testing/framework.py", line 170, in get
  255.     raise YTNoOldAnswer(url)
  256. YTNoOldAnswer: There is no old answer available.
  257. http://yt-answer-tests.s3-website-us-east-1.amazonaws.com/enzogold2.2_AdiabaticExpansion.enzo_data0016
  258.  
  259. ======================================================================
  260. ERROR: ProjectionValues_data0016_all_Density_0_Density
  261. ----------------------------------------------------------------------
  262. Traceback (most recent call last):
  263.   File "/usr/local/lib/python2.7/dist-packages/nose-1.2.1-py2.7.egg/nose/case.py", line 197, in runTest
  264.     self.test(*self.arg)
  265.   File "/home/mqk/local/yt/yt/utilities/answer_testing/framework.py", line 279, in __call__
  266.     dd = self.reference_storage.get(self.storage_name)
  267.   File "/home/mqk/local/yt/yt/utilities/answer_testing/framework.py", line 170, in get
  268.     raise YTNoOldAnswer(url)
  269. YTNoOldAnswer: There is no old answer available.
  270. http://yt-answer-tests.s3-website-us-east-1.amazonaws.com/enzogold2.2_AdiabaticExpansion.enzo_data0016
  271.  
  272. ======================================================================
  273. ERROR: ProjectionValues_data0016_all_Density_1_None
  274. ----------------------------------------------------------------------
  275. Traceback (most recent call last):
  276.   File "/usr/local/lib/python2.7/dist-packages/nose-1.2.1-py2.7.egg/nose/case.py", line 197, in runTest
  277.     self.test(*self.arg)
  278.   File "/home/mqk/local/yt/yt/utilities/answer_testing/framework.py", line 279, in __call__
  279.     dd = self.reference_storage.get(self.storage_name)
  280.   File "/home/mqk/local/yt/yt/utilities/answer_testing/framework.py", line 170, in get
  281.     raise YTNoOldAnswer(url)
  282. YTNoOldAnswer: There is no old answer available.
  283. http://yt-answer-tests.s3-website-us-east-1.amazonaws.com/enzogold2.2_AdiabaticExpansion.enzo_data0016
  284.  
  285. ======================================================================
  286. ERROR: ProjectionValues_data0016_all_Density_1_Density
  287. ----------------------------------------------------------------------
  288. Traceback (most recent call last):
  289.   File "/usr/local/lib/python2.7/dist-packages/nose-1.2.1-py2.7.egg/nose/case.py", line 197, in runTest
  290.     self.test(*self.arg)
  291.   File "/home/mqk/local/yt/yt/utilities/answer_testing/framework.py", line 279, in __call__
  292.     dd = self.reference_storage.get(self.storage_name)
  293.   File "/home/mqk/local/yt/yt/utilities/answer_testing/framework.py", line 170, in get
  294.     raise YTNoOldAnswer(url)
  295. YTNoOldAnswer: There is no old answer available.
  296. http://yt-answer-tests.s3-website-us-east-1.amazonaws.com/enzogold2.2_AdiabaticExpansion.enzo_data0016
  297.  
  298. ======================================================================
  299. ERROR: ProjectionValues_data0016_all_Density_2_None
  300. ----------------------------------------------------------------------
  301. Traceback (most recent call last):
  302.   File "/usr/local/lib/python2.7/dist-packages/nose-1.2.1-py2.7.egg/nose/case.py", line 197, in runTest
  303.     self.test(*self.arg)
  304.   File "/home/mqk/local/yt/yt/utilities/answer_testing/framework.py", line 279, in __call__
  305.     dd = self.reference_storage.get(self.storage_name)
  306.   File "/home/mqk/local/yt/yt/utilities/answer_testing/framework.py", line 170, in get
  307.     raise YTNoOldAnswer(url)
  308. YTNoOldAnswer: There is no old answer available.
  309. http://yt-answer-tests.s3-website-us-east-1.amazonaws.com/enzogold2.2_AdiabaticExpansion.enzo_data0016
  310.  
  311. ======================================================================
  312. ERROR: ProjectionValues_data0016_all_Density_2_Density
  313. ----------------------------------------------------------------------
  314. Traceback (most recent call last):
  315.   File "/usr/local/lib/python2.7/dist-packages/nose-1.2.1-py2.7.egg/nose/case.py", line 197, in runTest
  316.     self.test(*self.arg)
  317.   File "/home/mqk/local/yt/yt/utilities/answer_testing/framework.py", line 279, in __call__
  318.     dd = self.reference_storage.get(self.storage_name)
  319.   File "/home/mqk/local/yt/yt/utilities/answer_testing/framework.py", line 170, in get
  320.     raise YTNoOldAnswer(url)
  321. YTNoOldAnswer: There is no old answer available.
  322. http://yt-answer-tests.s3-website-us-east-1.amazonaws.com/enzogold2.2_AdiabaticExpansion.enzo_data0016
  323.  
  324. ======================================================================
  325. ERROR: FieldValues_data0016_all_Density
  326. ----------------------------------------------------------------------
  327. Traceback (most recent call last):
  328.   File "/usr/local/lib/python2.7/dist-packages/nose-1.2.1-py2.7.egg/nose/case.py", line 197, in runTest
  329.     self.test(*self.arg)
  330.   File "/home/mqk/local/yt/yt/utilities/answer_testing/framework.py", line 279, in __call__
  331.     dd = self.reference_storage.get(self.storage_name)
  332.   File "/home/mqk/local/yt/yt/utilities/answer_testing/framework.py", line 170, in get
  333.     raise YTNoOldAnswer(url)
  334. YTNoOldAnswer: There is no old answer available.
  335. http://yt-answer-tests.s3-website-us-east-1.amazonaws.com/enzogold2.2_AdiabaticExpansion.enzo_data0016
  336.  
  337. ======================================================================
  338. ERROR: ProjectionValues_data0016_all_x-velocity_0_None
  339. ----------------------------------------------------------------------
  340. Traceback (most recent call last):
  341.   File "/usr/local/lib/python2.7/dist-packages/nose-1.2.1-py2.7.egg/nose/case.py", line 197, in runTest
  342.     self.test(*self.arg)
  343.   File "/home/mqk/local/yt/yt/utilities/answer_testing/framework.py", line 279, in __call__
  344.     dd = self.reference_storage.get(self.storage_name)
  345.   File "/home/mqk/local/yt/yt/utilities/answer_testing/framework.py", line 170, in get
  346.     raise YTNoOldAnswer(url)
  347. YTNoOldAnswer: There is no old answer available.
  348. http://yt-answer-tests.s3-website-us-east-1.amazonaws.com/enzogold2.2_AdiabaticExpansion.enzo_data0016
  349.  
  350. ======================================================================
  351. ERROR: ProjectionValues_data0016_all_x-velocity_0_Density
  352. ----------------------------------------------------------------------
  353. Traceback (most recent call last):
  354.   File "/usr/local/lib/python2.7/dist-packages/nose-1.2.1-py2.7.egg/nose/case.py", line 197, in runTest
  355.     self.test(*self.arg)
  356.   File "/home/mqk/local/yt/yt/utilities/answer_testing/framework.py", line 279, in __call__
  357.     dd = self.reference_storage.get(self.storage_name)
  358.   File "/home/mqk/local/yt/yt/utilities/answer_testing/framework.py", line 170, in get
  359.     raise YTNoOldAnswer(url)
  360. YTNoOldAnswer: There is no old answer available.
  361. http://yt-answer-tests.s3-website-us-east-1.amazonaws.com/enzogold2.2_AdiabaticExpansion.enzo_data0016
  362.  
  363. ======================================================================
  364. ERROR: ProjectionValues_data0016_all_x-velocity_1_None
  365. ----------------------------------------------------------------------
  366. Traceback (most recent call last):
  367.   File "/usr/local/lib/python2.7/dist-packages/nose-1.2.1-py2.7.egg/nose/case.py", line 197, in runTest
  368.     self.test(*self.arg)
  369.   File "/home/mqk/local/yt/yt/utilities/answer_testing/framework.py", line 279, in __call__
  370.     dd = self.reference_storage.get(self.storage_name)
  371.   File "/home/mqk/local/yt/yt/utilities/answer_testing/framework.py", line 170, in get
  372.     raise YTNoOldAnswer(url)
  373. YTNoOldAnswer: There is no old answer available.
  374. http://yt-answer-tests.s3-website-us-east-1.amazonaws.com/enzogold2.2_AdiabaticExpansion.enzo_data0016
  375.  
  376. ======================================================================
  377. ERROR: ProjectionValues_data0016_all_x-velocity_1_Density
  378. ----------------------------------------------------------------------
  379. Traceback (most recent call last):
  380.   File "/usr/local/lib/python2.7/dist-packages/nose-1.2.1-py2.7.egg/nose/case.py", line 197, in runTest
  381.     self.test(*self.arg)
  382.   File "/home/mqk/local/yt/yt/utilities/answer_testing/framework.py", line 279, in __call__
  383.     dd = self.reference_storage.get(self.storage_name)
  384.   File "/home/mqk/local/yt/yt/utilities/answer_testing/framework.py", line 170, in get
  385.     raise YTNoOldAnswer(url)
  386. YTNoOldAnswer: There is no old answer available.
  387. http://yt-answer-tests.s3-website-us-east-1.amazonaws.com/enzogold2.2_AdiabaticExpansion.enzo_data0016
  388.  
  389. ======================================================================
  390. ERROR: ProjectionValues_data0016_all_x-velocity_2_None
  391. ----------------------------------------------------------------------
  392. Traceback (most recent call last):
  393.   File "/usr/local/lib/python2.7/dist-packages/nose-1.2.1-py2.7.egg/nose/case.py", line 197, in runTest
  394.     self.test(*self.arg)
  395.   File "/home/mqk/local/yt/yt/utilities/answer_testing/framework.py", line 279, in __call__
  396.     dd = self.reference_storage.get(self.storage_name)
  397.   File "/home/mqk/local/yt/yt/utilities/answer_testing/framework.py", line 170, in get
  398.     raise YTNoOldAnswer(url)
  399. YTNoOldAnswer: There is no old answer available.
  400. http://yt-answer-tests.s3-website-us-east-1.amazonaws.com/enzogold2.2_AdiabaticExpansion.enzo_data0016
  401.  
  402. ======================================================================
  403. ERROR: ProjectionValues_data0016_all_x-velocity_2_Density
  404. ----------------------------------------------------------------------
  405. Traceback (most recent call last):
  406.   File "/usr/local/lib/python2.7/dist-packages/nose-1.2.1-py2.7.egg/nose/case.py", line 197, in runTest
  407.     self.test(*self.arg)
  408.   File "/home/mqk/local/yt/yt/utilities/answer_testing/framework.py", line 279, in __call__
  409.     dd = self.reference_storage.get(self.storage_name)
  410.   File "/home/mqk/local/yt/yt/utilities/answer_testing/framework.py", line 170, in get
  411.     raise YTNoOldAnswer(url)
  412. YTNoOldAnswer: There is no old answer available.
  413. http://yt-answer-tests.s3-website-us-east-1.amazonaws.com/enzogold2.2_AdiabaticExpansion.enzo_data0016
  414.  
  415. ======================================================================
  416. ERROR: FieldValues_data0016_all_x-velocity
  417. ----------------------------------------------------------------------
  418. Traceback (most recent call last):
  419.   File "/usr/local/lib/python2.7/dist-packages/nose-1.2.1-py2.7.egg/nose/case.py", line 197, in runTest
  420.     self.test(*self.arg)
  421.   File "/home/mqk/local/yt/yt/utilities/answer_testing/framework.py", line 279, in __call__
  422.     dd = self.reference_storage.get(self.storage_name)
  423.   File "/home/mqk/local/yt/yt/utilities/answer_testing/framework.py", line 170, in get
  424.     raise YTNoOldAnswer(url)
  425. YTNoOldAnswer: There is no old answer available.
  426. http://yt-answer-tests.s3-website-us-east-1.amazonaws.com/enzogold2.2_AdiabaticExpansion.enzo_data0016
  427.  
  428. ======================================================================
  429. ERROR: ProjectionValues_data0016_all_y-velocity_0_None
  430. ----------------------------------------------------------------------
  431. Traceback (most recent call last):
  432.   File "/usr/local/lib/python2.7/dist-packages/nose-1.2.1-py2.7.egg/nose/case.py", line 197, in runTest
  433.     self.test(*self.arg)
  434.   File "/home/mqk/local/yt/yt/utilities/answer_testing/framework.py", line 279, in __call__
  435.     dd = self.reference_storage.get(self.storage_name)
  436.   File "/home/mqk/local/yt/yt/utilities/answer_testing/framework.py", line 170, in get
  437.     raise YTNoOldAnswer(url)
  438. YTNoOldAnswer: There is no old answer available.
  439. http://yt-answer-tests.s3-website-us-east-1.amazonaws.com/enzogold2.2_AdiabaticExpansion.enzo_data0016
  440.  
  441. ======================================================================
  442. ERROR: ProjectionValues_data0016_all_y-velocity_0_Density
  443. ----------------------------------------------------------------------
  444. Traceback (most recent call last):
  445.   File "/usr/local/lib/python2.7/dist-packages/nose-1.2.1-py2.7.egg/nose/case.py", line 197, in runTest
  446.     self.test(*self.arg)
  447.   File "/home/mqk/local/yt/yt/utilities/answer_testing/framework.py", line 279, in __call__
  448.     dd = self.reference_storage.get(self.storage_name)
  449.   File "/home/mqk/local/yt/yt/utilities/answer_testing/framework.py", line 170, in get
  450.     raise YTNoOldAnswer(url)
  451. YTNoOldAnswer: There is no old answer available.
  452. http://yt-answer-tests.s3-website-us-east-1.amazonaws.com/enzogold2.2_AdiabaticExpansion.enzo_data0016
  453.  
  454. ======================================================================
  455. ERROR: ProjectionValues_data0016_all_y-velocity_1_None
  456. ----------------------------------------------------------------------
  457. Traceback (most recent call last):
  458.   File "/usr/local/lib/python2.7/dist-packages/nose-1.2.1-py2.7.egg/nose/case.py", line 197, in runTest
  459.     self.test(*self.arg)
  460.   File "/home/mqk/local/yt/yt/utilities/answer_testing/framework.py", line 279, in __call__
  461.     dd = self.reference_storage.get(self.storage_name)
  462.   File "/home/mqk/local/yt/yt/utilities/answer_testing/framework.py", line 170, in get
  463.     raise YTNoOldAnswer(url)
  464. YTNoOldAnswer: There is no old answer available.
  465. http://yt-answer-tests.s3-website-us-east-1.amazonaws.com/enzogold2.2_AdiabaticExpansion.enzo_data0016
  466.  
  467. ======================================================================
  468. ERROR: ProjectionValues_data0016_all_y-velocity_1_Density
  469. ----------------------------------------------------------------------
  470. Traceback (most recent call last):
  471.   File "/usr/local/lib/python2.7/dist-packages/nose-1.2.1-py2.7.egg/nose/case.py", line 197, in runTest
  472.     self.test(*self.arg)
  473.   File "/home/mqk/local/yt/yt/utilities/answer_testing/framework.py", line 279, in __call__
  474.     dd = self.reference_storage.get(self.storage_name)
  475.   File "/home/mqk/local/yt/yt/utilities/answer_testing/framework.py", line 170, in get
  476.     raise YTNoOldAnswer(url)
  477. YTNoOldAnswer: There is no old answer available.
  478. http://yt-answer-tests.s3-website-us-east-1.amazonaws.com/enzogold2.2_AdiabaticExpansion.enzo_data0016
  479.  
  480. ======================================================================
  481. ERROR: ProjectionValues_data0016_all_y-velocity_2_None
  482. ----------------------------------------------------------------------
  483. Traceback (most recent call last):
  484.   File "/usr/local/lib/python2.7/dist-packages/nose-1.2.1-py2.7.egg/nose/case.py", line 197, in runTest
  485.     self.test(*self.arg)
  486.   File "/home/mqk/local/yt/yt/utilities/answer_testing/framework.py", line 279, in __call__
  487.     dd = self.reference_storage.get(self.storage_name)
  488.   File "/home/mqk/local/yt/yt/utilities/answer_testing/framework.py", line 170, in get
  489.     raise YTNoOldAnswer(url)
  490. YTNoOldAnswer: There is no old answer available.
  491. http://yt-answer-tests.s3-website-us-east-1.amazonaws.com/enzogold2.2_AdiabaticExpansion.enzo_data0016
  492.  
  493. ======================================================================
  494. ERROR: ProjectionValues_data0016_all_y-velocity_2_Density
  495. ----------------------------------------------------------------------
  496. Traceback (most recent call last):
  497.   File "/usr/local/lib/python2.7/dist-packages/nose-1.2.1-py2.7.egg/nose/case.py", line 197, in runTest
  498.     self.test(*self.arg)
  499.   File "/home/mqk/local/yt/yt/utilities/answer_testing/framework.py", line 279, in __call__
  500.     dd = self.reference_storage.get(self.storage_name)
  501.   File "/home/mqk/local/yt/yt/utilities/answer_testing/framework.py", line 170, in get
  502.     raise YTNoOldAnswer(url)
  503. YTNoOldAnswer: There is no old answer available.
  504. http://yt-answer-tests.s3-website-us-east-1.amazonaws.com/enzogold2.2_AdiabaticExpansion.enzo_data0016
  505.  
  506. ======================================================================
  507. ERROR: FieldValues_data0016_all_y-velocity
  508. ----------------------------------------------------------------------
  509. Traceback (most recent call last):
  510.   File "/usr/local/lib/python2.7/dist-packages/nose-1.2.1-py2.7.egg/nose/case.py", line 197, in runTest
  511.     self.test(*self.arg)
  512.   File "/home/mqk/local/yt/yt/utilities/answer_testing/framework.py", line 279, in __call__
  513.     dd = self.reference_storage.get(self.storage_name)
  514.   File "/home/mqk/local/yt/yt/utilities/answer_testing/framework.py", line 170, in get
  515.     raise YTNoOldAnswer(url)
  516. YTNoOldAnswer: There is no old answer available.
  517. http://yt-answer-tests.s3-website-us-east-1.amazonaws.com/enzogold2.2_AdiabaticExpansion.enzo_data0016
  518.  
  519. ======================================================================
  520. ERROR: ProjectionValues_data0016_all_z-velocity_0_None
  521. ----------------------------------------------------------------------
  522. Traceback (most recent call last):
  523.   File "/usr/local/lib/python2.7/dist-packages/nose-1.2.1-py2.7.egg/nose/case.py", line 197, in runTest
  524.     self.test(*self.arg)
  525.   File "/home/mqk/local/yt/yt/utilities/answer_testing/framework.py", line 279, in __call__
  526.     dd = self.reference_storage.get(self.storage_name)
  527.   File "/home/mqk/local/yt/yt/utilities/answer_testing/framework.py", line 170, in get
  528.     raise YTNoOldAnswer(url)
  529. YTNoOldAnswer: There is no old answer available.
  530. http://yt-answer-tests.s3-website-us-east-1.amazonaws.com/enzogold2.2_AdiabaticExpansion.enzo_data0016
  531.  
  532. ======================================================================
  533. ERROR: ProjectionValues_data0016_all_z-velocity_0_Density
  534. ----------------------------------------------------------------------
  535. Traceback (most recent call last):
  536.   File "/usr/local/lib/python2.7/dist-packages/nose-1.2.1-py2.7.egg/nose/case.py", line 197, in runTest
  537.     self.test(*self.arg)
  538.   File "/home/mqk/local/yt/yt/utilities/answer_testing/framework.py", line 279, in __call__
  539.     dd = self.reference_storage.get(self.storage_name)
  540.   File "/home/mqk/local/yt/yt/utilities/answer_testing/framework.py", line 170, in get
  541.     raise YTNoOldAnswer(url)
  542. YTNoOldAnswer: There is no old answer available.
  543. http://yt-answer-tests.s3-website-us-east-1.amazonaws.com/enzogold2.2_AdiabaticExpansion.enzo_data0016
  544.  
  545. ======================================================================
  546. ERROR: ProjectionValues_data0016_all_z-velocity_1_None
  547. ----------------------------------------------------------------------
  548. Traceback (most recent call last):
  549.   File "/usr/local/lib/python2.7/dist-packages/nose-1.2.1-py2.7.egg/nose/case.py", line 197, in runTest
  550.     self.test(*self.arg)
  551.   File "/home/mqk/local/yt/yt/utilities/answer_testing/framework.py", line 279, in __call__
  552.     dd = self.reference_storage.get(self.storage_name)
  553.   File "/home/mqk/local/yt/yt/utilities/answer_testing/framework.py", line 170, in get
  554.     raise YTNoOldAnswer(url)
  555. YTNoOldAnswer: There is no old answer available.
  556. http://yt-answer-tests.s3-website-us-east-1.amazonaws.com/enzogold2.2_AdiabaticExpansion.enzo_data0016
  557.  
  558. ======================================================================
  559. ERROR: ProjectionValues_data0016_all_z-velocity_1_Density
  560. ----------------------------------------------------------------------
  561. Traceback (most recent call last):
  562.   File "/usr/local/lib/python2.7/dist-packages/nose-1.2.1-py2.7.egg/nose/case.py", line 197, in runTest
  563.     self.test(*self.arg)
  564.   File "/home/mqk/local/yt/yt/utilities/answer_testing/framework.py", line 279, in __call__
  565.     dd = self.reference_storage.get(self.storage_name)
  566.   File "/home/mqk/local/yt/yt/utilities/answer_testing/framework.py", line 170, in get
  567.     raise YTNoOldAnswer(url)
  568. YTNoOldAnswer: There is no old answer available.
  569. http://yt-answer-tests.s3-website-us-east-1.amazonaws.com/enzogold2.2_AdiabaticExpansion.enzo_data0016
  570.  
  571. ======================================================================
  572. ERROR: ProjectionValues_data0016_all_z-velocity_2_None
  573. ----------------------------------------------------------------------
  574. Traceback (most recent call last):
  575.   File "/usr/local/lib/python2.7/dist-packages/nose-1.2.1-py2.7.egg/nose/case.py", line 197, in runTest
  576.     self.test(*self.arg)
  577.   File "/home/mqk/local/yt/yt/utilities/answer_testing/framework.py", line 279, in __call__
  578.     dd = self.reference_storage.get(self.storage_name)
  579.   File "/home/mqk/local/yt/yt/utilities/answer_testing/framework.py", line 170, in get
  580.     raise YTNoOldAnswer(url)
  581. YTNoOldAnswer: There is no old answer available.
  582. http://yt-answer-tests.s3-website-us-east-1.amazonaws.com/enzogold2.2_AdiabaticExpansion.enzo_data0016
  583.  
  584. ======================================================================
  585. ERROR: ProjectionValues_data0016_all_z-velocity_2_Density
  586. ----------------------------------------------------------------------
  587. Traceback (most recent call last):
  588.   File "/usr/local/lib/python2.7/dist-packages/nose-1.2.1-py2.7.egg/nose/case.py", line 197, in runTest
  589.     self.test(*self.arg)
  590.   File "/home/mqk/local/yt/yt/utilities/answer_testing/framework.py", line 279, in __call__
  591.     dd = self.reference_storage.get(self.storage_name)
  592.   File "/home/mqk/local/yt/yt/utilities/answer_testing/framework.py", line 170, in get
  593.     raise YTNoOldAnswer(url)
  594. YTNoOldAnswer: There is no old answer available.
  595. http://yt-answer-tests.s3-website-us-east-1.amazonaws.com/enzogold2.2_AdiabaticExpansion.enzo_data0016
  596.  
  597. ======================================================================
  598. ERROR: FieldValues_data0016_all_z-velocity
  599. ----------------------------------------------------------------------
  600. Traceback (most recent call last):
  601.   File "/usr/local/lib/python2.7/dist-packages/nose-1.2.1-py2.7.egg/nose/case.py", line 197, in runTest
  602.     self.test(*self.arg)
  603.   File "/home/mqk/local/yt/yt/utilities/answer_testing/framework.py", line 279, in __call__
  604.     dd = self.reference_storage.get(self.storage_name)
  605.   File "/home/mqk/local/yt/yt/utilities/answer_testing/framework.py", line 170, in get
  606.     raise YTNoOldAnswer(url)
  607. YTNoOldAnswer: There is no old answer available.
  608. http://yt-answer-tests.s3-website-us-east-1.amazonaws.com/enzogold2.2_AdiabaticExpansion.enzo_data0016
  609.  
  610. ======================================================================
  611. FAIL: VerifySimulationSame_AdiabaticExpansion.enzo_all
  612. ----------------------------------------------------------------------
  613. Traceback (most recent call last):
  614.   File "/usr/local/lib/python2.7/dist-packages/nose-1.2.1-py2.7.egg/nose/case.py", line 197, in runTest
  615.     self.test(*self.arg)
  616.   File "/home/mqk/local/yt/yt/utilities/answer_testing/framework.py", line 283, in __call__
  617.     self.compare(nv, ov)
  618.   File "/home/mqk/local/yt/yt/utilities/answer_testing/framework.py", line 503, in compare
  619.     verbose=True)
  620.   File "/usr/lib/python2.7/dist-packages/numpy/testing/utils.py", line 313, in assert_equal
  621.     raise AssertionError(msg)
  622. AssertionError:
  623. Items are not equal: Number of outputs not equal.
  624.  ACTUAL: 17
  625.  DESIRED: 16
  626.  
  627. ----------------------------------------------------------------------
  628. Ran 30 tests in 7.901s
  629.  
  630. FAILED (errors=28, failures=1)
  631. Running test: 4 of 36.
  632. .FEEEEEEEEEEEEEEEEEEEEEEEEEEEE
  633. ======================================================================
  634. ERROR: ProjectionValues_data0020_all_Density_0_None
  635. ----------------------------------------------------------------------
  636. Traceback (most recent call last):
  637.   File "/usr/local/lib/python2.7/dist-packages/nose-1.2.1-py2.7.egg/nose/case.py", line 197, in runTest
  638.     self.test(*self.arg)
  639.   File "/home/mqk/local/yt/yt/utilities/answer_testing/framework.py", line 279, in __call__
  640.     dd = self.reference_storage.get(self.storage_name)
  641.   File "/home/mqk/local/yt/yt/utilities/answer_testing/framework.py", line 170, in get
  642.     raise YTNoOldAnswer(url)
  643. YTNoOldAnswer: There is no old answer available.
  644. http://yt-answer-tests.s3-website-us-east-1.amazonaws.com/enzogold2.2_MHDZeldovichPancake.enzo_data0020
  645.  
  646. ======================================================================
  647. ERROR: ProjectionValues_data0020_all_Density_0_Density
  648. ----------------------------------------------------------------------
  649. Traceback (most recent call last):
  650.   File "/usr/local/lib/python2.7/dist-packages/nose-1.2.1-py2.7.egg/nose/case.py", line 197, in runTest
  651.     self.test(*self.arg)
  652.   File "/home/mqk/local/yt/yt/utilities/answer_testing/framework.py", line 279, in __call__
  653.     dd = self.reference_storage.get(self.storage_name)
  654.   File "/home/mqk/local/yt/yt/utilities/answer_testing/framework.py", line 170, in get
  655.     raise YTNoOldAnswer(url)
  656. YTNoOldAnswer: There is no old answer available.
  657. http://yt-answer-tests.s3-website-us-east-1.amazonaws.com/enzogold2.2_MHDZeldovichPancake.enzo_data0020
  658.  
  659. ======================================================================
  660. ERROR: ProjectionValues_data0020_all_Density_1_None
  661. ----------------------------------------------------------------------
  662. Traceback (most recent call last):
  663.   File "/usr/local/lib/python2.7/dist-packages/nose-1.2.1-py2.7.egg/nose/case.py", line 197, in runTest
  664.     self.test(*self.arg)
  665.   File "/home/mqk/local/yt/yt/utilities/answer_testing/framework.py", line 279, in __call__
  666.     dd = self.reference_storage.get(self.storage_name)
  667.   File "/home/mqk/local/yt/yt/utilities/answer_testing/framework.py", line 170, in get
  668.     raise YTNoOldAnswer(url)
  669. YTNoOldAnswer: There is no old answer available.
  670. http://yt-answer-tests.s3-website-us-east-1.amazonaws.com/enzogold2.2_MHDZeldovichPancake.enzo_data0020
  671.  
  672. ======================================================================
  673. ERROR: ProjectionValues_data0020_all_Density_1_Density
  674. ----------------------------------------------------------------------
  675. Traceback (most recent call last):
  676.   File "/usr/local/lib/python2.7/dist-packages/nose-1.2.1-py2.7.egg/nose/case.py", line 197, in runTest
  677.     self.test(*self.arg)
  678.   File "/home/mqk/local/yt/yt/utilities/answer_testing/framework.py", line 279, in __call__
  679.     dd = self.reference_storage.get(self.storage_name)
  680.   File "/home/mqk/local/yt/yt/utilities/answer_testing/framework.py", line 170, in get
  681.     raise YTNoOldAnswer(url)
  682. YTNoOldAnswer: There is no old answer available.
  683. http://yt-answer-tests.s3-website-us-east-1.amazonaws.com/enzogold2.2_MHDZeldovichPancake.enzo_data0020
  684.  
  685. ======================================================================
  686. ERROR: ProjectionValues_data0020_all_Density_2_None
  687. ----------------------------------------------------------------------
  688. Traceback (most recent call last):
  689.   File "/usr/local/lib/python2.7/dist-packages/nose-1.2.1-py2.7.egg/nose/case.py", line 197, in runTest
  690.     self.test(*self.arg)
  691.   File "/home/mqk/local/yt/yt/utilities/answer_testing/framework.py", line 279, in __call__
  692.     dd = self.reference_storage.get(self.storage_name)
  693.   File "/home/mqk/local/yt/yt/utilities/answer_testing/framework.py", line 170, in get
  694.     raise YTNoOldAnswer(url)
  695. YTNoOldAnswer: There is no old answer available.
  696. http://yt-answer-tests.s3-website-us-east-1.amazonaws.com/enzogold2.2_MHDZeldovichPancake.enzo_data0020
  697.  
  698. ======================================================================
  699. ERROR: ProjectionValues_data0020_all_Density_2_Density
  700. ----------------------------------------------------------------------
  701. Traceback (most recent call last):
  702.   File "/usr/local/lib/python2.7/dist-packages/nose-1.2.1-py2.7.egg/nose/case.py", line 197, in runTest
  703.     self.test(*self.arg)
  704.   File "/home/mqk/local/yt/yt/utilities/answer_testing/framework.py", line 279, in __call__
  705.     dd = self.reference_storage.get(self.storage_name)
  706.   File "/home/mqk/local/yt/yt/utilities/answer_testing/framework.py", line 170, in get
  707.     raise YTNoOldAnswer(url)
  708. YTNoOldAnswer: There is no old answer available.
  709. http://yt-answer-tests.s3-website-us-east-1.amazonaws.com/enzogold2.2_MHDZeldovichPancake.enzo_data0020
  710.  
  711. ======================================================================
  712. ERROR: FieldValues_data0020_all_Density
  713. ----------------------------------------------------------------------
  714. Traceback (most recent call last):
  715.   File "/usr/local/lib/python2.7/dist-packages/nose-1.2.1-py2.7.egg/nose/case.py", line 197, in runTest
  716.     self.test(*self.arg)
  717.   File "/home/mqk/local/yt/yt/utilities/answer_testing/framework.py", line 279, in __call__
  718.     dd = self.reference_storage.get(self.storage_name)
  719.   File "/home/mqk/local/yt/yt/utilities/answer_testing/framework.py", line 170, in get
  720.     raise YTNoOldAnswer(url)
  721. YTNoOldAnswer: There is no old answer available.
  722. http://yt-answer-tests.s3-website-us-east-1.amazonaws.com/enzogold2.2_MHDZeldovichPancake.enzo_data0020
  723.  
  724. ======================================================================
  725. ERROR: ProjectionValues_data0020_all_x-velocity_0_None
  726. ----------------------------------------------------------------------
  727. Traceback (most recent call last):
  728.   File "/usr/local/lib/python2.7/dist-packages/nose-1.2.1-py2.7.egg/nose/case.py", line 197, in runTest
  729.     self.test(*self.arg)
  730.   File "/home/mqk/local/yt/yt/utilities/answer_testing/framework.py", line 279, in __call__
  731.     dd = self.reference_storage.get(self.storage_name)
  732.   File "/home/mqk/local/yt/yt/utilities/answer_testing/framework.py", line 170, in get
  733.     raise YTNoOldAnswer(url)
  734. YTNoOldAnswer: There is no old answer available.
  735. http://yt-answer-tests.s3-website-us-east-1.amazonaws.com/enzogold2.2_MHDZeldovichPancake.enzo_data0020
  736.  
  737. ======================================================================
  738. ERROR: ProjectionValues_data0020_all_x-velocity_0_Density
  739. ----------------------------------------------------------------------
  740. Traceback (most recent call last):
  741.   File "/usr/local/lib/python2.7/dist-packages/nose-1.2.1-py2.7.egg/nose/case.py", line 197, in runTest
  742.     self.test(*self.arg)
  743.   File "/home/mqk/local/yt/yt/utilities/answer_testing/framework.py", line 279, in __call__
  744.     dd = self.reference_storage.get(self.storage_name)
  745.   File "/home/mqk/local/yt/yt/utilities/answer_testing/framework.py", line 170, in get
  746.     raise YTNoOldAnswer(url)
  747. YTNoOldAnswer: There is no old answer available.
  748. http://yt-answer-tests.s3-website-us-east-1.amazonaws.com/enzogold2.2_MHDZeldovichPancake.enzo_data0020
  749.  
  750. ======================================================================
  751. ERROR: ProjectionValues_data0020_all_x-velocity_1_None
  752. ----------------------------------------------------------------------
  753. Traceback (most recent call last):
  754.   File "/usr/local/lib/python2.7/dist-packages/nose-1.2.1-py2.7.egg/nose/case.py", line 197, in runTest
  755.     self.test(*self.arg)
  756.   File "/home/mqk/local/yt/yt/utilities/answer_testing/framework.py", line 279, in __call__
  757.     dd = self.reference_storage.get(self.storage_name)
  758.   File "/home/mqk/local/yt/yt/utilities/answer_testing/framework.py", line 170, in get
  759.     raise YTNoOldAnswer(url)
  760. YTNoOldAnswer: There is no old answer available.
  761. http://yt-answer-tests.s3-website-us-east-1.amazonaws.com/enzogold2.2_MHDZeldovichPancake.enzo_data0020
  762.  
  763. ======================================================================
  764. ERROR: ProjectionValues_data0020_all_x-velocity_1_Density
  765. ----------------------------------------------------------------------
  766. Traceback (most recent call last):
  767.   File "/usr/local/lib/python2.7/dist-packages/nose-1.2.1-py2.7.egg/nose/case.py", line 197, in runTest
  768.     self.test(*self.arg)
  769.   File "/home/mqk/local/yt/yt/utilities/answer_testing/framework.py", line 279, in __call__
  770.     dd = self.reference_storage.get(self.storage_name)
  771.   File "/home/mqk/local/yt/yt/utilities/answer_testing/framework.py", line 170, in get
  772.     raise YTNoOldAnswer(url)
  773. YTNoOldAnswer: There is no old answer available.
  774. http://yt-answer-tests.s3-website-us-east-1.amazonaws.com/enzogold2.2_MHDZeldovichPancake.enzo_data0020
  775.  
  776. ======================================================================
  777. ERROR: ProjectionValues_data0020_all_x-velocity_2_None
  778. ----------------------------------------------------------------------
  779. Traceback (most recent call last):
  780.   File "/usr/local/lib/python2.7/dist-packages/nose-1.2.1-py2.7.egg/nose/case.py", line 197, in runTest
  781.     self.test(*self.arg)
  782.   File "/home/mqk/local/yt/yt/utilities/answer_testing/framework.py", line 279, in __call__
  783.     dd = self.reference_storage.get(self.storage_name)
  784.   File "/home/mqk/local/yt/yt/utilities/answer_testing/framework.py", line 170, in get
  785.     raise YTNoOldAnswer(url)
  786. YTNoOldAnswer: There is no old answer available.
  787. http://yt-answer-tests.s3-website-us-east-1.amazonaws.com/enzogold2.2_MHDZeldovichPancake.enzo_data0020
  788.  
  789. ======================================================================
  790. ERROR: ProjectionValues_data0020_all_x-velocity_2_Density
  791. ----------------------------------------------------------------------
  792. Traceback (most recent call last):
  793.   File "/usr/local/lib/python2.7/dist-packages/nose-1.2.1-py2.7.egg/nose/case.py", line 197, in runTest
  794.     self.test(*self.arg)
  795.   File "/home/mqk/local/yt/yt/utilities/answer_testing/framework.py", line 279, in __call__
  796.     dd = self.reference_storage.get(self.storage_name)
  797.   File "/home/mqk/local/yt/yt/utilities/answer_testing/framework.py", line 170, in get
  798.     raise YTNoOldAnswer(url)
  799. YTNoOldAnswer: There is no old answer available.
  800. http://yt-answer-tests.s3-website-us-east-1.amazonaws.com/enzogold2.2_MHDZeldovichPancake.enzo_data0020
  801.  
  802. ======================================================================
  803. ERROR: FieldValues_data0020_all_x-velocity
  804. ----------------------------------------------------------------------
  805. Traceback (most recent call last):
  806.   File "/usr/local/lib/python2.7/dist-packages/nose-1.2.1-py2.7.egg/nose/case.py", line 197, in runTest
  807.     self.test(*self.arg)
  808.   File "/home/mqk/local/yt/yt/utilities/answer_testing/framework.py", line 279, in __call__
  809.     dd = self.reference_storage.get(self.storage_name)
  810.   File "/home/mqk/local/yt/yt/utilities/answer_testing/framework.py", line 170, in get
  811.     raise YTNoOldAnswer(url)
  812. YTNoOldAnswer: There is no old answer available.
  813. http://yt-answer-tests.s3-website-us-east-1.amazonaws.com/enzogold2.2_MHDZeldovichPancake.enzo_data0020
  814.  
  815. ======================================================================
  816. ERROR: ProjectionValues_data0020_all_y-velocity_0_None
  817. ----------------------------------------------------------------------
  818. Traceback (most recent call last):
  819.   File "/usr/local/lib/python2.7/dist-packages/nose-1.2.1-py2.7.egg/nose/case.py", line 197, in runTest
  820.     self.test(*self.arg)
  821.   File "/home/mqk/local/yt/yt/utilities/answer_testing/framework.py", line 279, in __call__
  822.     dd = self.reference_storage.get(self.storage_name)
  823.   File "/home/mqk/local/yt/yt/utilities/answer_testing/framework.py", line 170, in get
  824.     raise YTNoOldAnswer(url)
  825. YTNoOldAnswer: There is no old answer available.
  826. http://yt-answer-tests.s3-website-us-east-1.amazonaws.com/enzogold2.2_MHDZeldovichPancake.enzo_data0020
  827.  
  828. ======================================================================
  829. ERROR: ProjectionValues_data0020_all_y-velocity_0_Density
  830. ----------------------------------------------------------------------
  831. Traceback (most recent call last):
  832.   File "/usr/local/lib/python2.7/dist-packages/nose-1.2.1-py2.7.egg/nose/case.py", line 197, in runTest
  833.     self.test(*self.arg)
  834.   File "/home/mqk/local/yt/yt/utilities/answer_testing/framework.py", line 279, in __call__
  835.     dd = self.reference_storage.get(self.storage_name)
  836.   File "/home/mqk/local/yt/yt/utilities/answer_testing/framework.py", line 170, in get
  837.     raise YTNoOldAnswer(url)
  838. YTNoOldAnswer: There is no old answer available.
  839. http://yt-answer-tests.s3-website-us-east-1.amazonaws.com/enzogold2.2_MHDZeldovichPancake.enzo_data0020
  840.  
  841. ======================================================================
  842. ERROR: ProjectionValues_data0020_all_y-velocity_1_None
  843. ----------------------------------------------------------------------
  844. Traceback (most recent call last):
  845.   File "/usr/local/lib/python2.7/dist-packages/nose-1.2.1-py2.7.egg/nose/case.py", line 197, in runTest
  846.     self.test(*self.arg)
  847.   File "/home/mqk/local/yt/yt/utilities/answer_testing/framework.py", line 279, in __call__
  848.     dd = self.reference_storage.get(self.storage_name)
  849.   File "/home/mqk/local/yt/yt/utilities/answer_testing/framework.py", line 170, in get
  850.     raise YTNoOldAnswer(url)
  851. YTNoOldAnswer: There is no old answer available.
  852. http://yt-answer-tests.s3-website-us-east-1.amazonaws.com/enzogold2.2_MHDZeldovichPancake.enzo_data0020
  853.  
  854. ======================================================================
  855. ERROR: ProjectionValues_data0020_all_y-velocity_1_Density
  856. ----------------------------------------------------------------------
  857. Traceback (most recent call last):
  858.   File "/usr/local/lib/python2.7/dist-packages/nose-1.2.1-py2.7.egg/nose/case.py", line 197, in runTest
  859.     self.test(*self.arg)
  860.   File "/home/mqk/local/yt/yt/utilities/answer_testing/framework.py", line 279, in __call__
  861.     dd = self.reference_storage.get(self.storage_name)
  862.   File "/home/mqk/local/yt/yt/utilities/answer_testing/framework.py", line 170, in get
  863.     raise YTNoOldAnswer(url)
  864. YTNoOldAnswer: There is no old answer available.
  865. http://yt-answer-tests.s3-website-us-east-1.amazonaws.com/enzogold2.2_MHDZeldovichPancake.enzo_data0020
  866.  
  867. ======================================================================
  868. ERROR: ProjectionValues_data0020_all_y-velocity_2_None
  869. ----------------------------------------------------------------------
  870. Traceback (most recent call last):
  871.   File "/usr/local/lib/python2.7/dist-packages/nose-1.2.1-py2.7.egg/nose/case.py", line 197, in runTest
  872.     self.test(*self.arg)
  873.   File "/home/mqk/local/yt/yt/utilities/answer_testing/framework.py", line 279, in __call__
  874.     dd = self.reference_storage.get(self.storage_name)
  875.   File "/home/mqk/local/yt/yt/utilities/answer_testing/framework.py", line 170, in get
  876.     raise YTNoOldAnswer(url)
  877. YTNoOldAnswer: There is no old answer available.
  878. http://yt-answer-tests.s3-website-us-east-1.amazonaws.com/enzogold2.2_MHDZeldovichPancake.enzo_data0020
  879.  
  880. ======================================================================
  881. ERROR: ProjectionValues_data0020_all_y-velocity_2_Density
  882. ----------------------------------------------------------------------
  883. Traceback (most recent call last):
  884.   File "/usr/local/lib/python2.7/dist-packages/nose-1.2.1-py2.7.egg/nose/case.py", line 197, in runTest
  885.     self.test(*self.arg)
  886.   File "/home/mqk/local/yt/yt/utilities/answer_testing/framework.py", line 279, in __call__
  887.     dd = self.reference_storage.get(self.storage_name)
  888.   File "/home/mqk/local/yt/yt/utilities/answer_testing/framework.py", line 170, in get
  889.     raise YTNoOldAnswer(url)
  890. YTNoOldAnswer: There is no old answer available.
  891. http://yt-answer-tests.s3-website-us-east-1.amazonaws.com/enzogold2.2_MHDZeldovichPancake.enzo_data0020
  892.  
  893. ======================================================================
  894. ERROR: FieldValues_data0020_all_y-velocity
  895. ----------------------------------------------------------------------
  896. Traceback (most recent call last):
  897.   File "/usr/local/lib/python2.7/dist-packages/nose-1.2.1-py2.7.egg/nose/case.py", line 197, in runTest
  898.     self.test(*self.arg)
  899.   File "/home/mqk/local/yt/yt/utilities/answer_testing/framework.py", line 279, in __call__
  900.     dd = self.reference_storage.get(self.storage_name)
  901.   File "/home/mqk/local/yt/yt/utilities/answer_testing/framework.py", line 170, in get
  902.     raise YTNoOldAnswer(url)
  903. YTNoOldAnswer: There is no old answer available.
  904. http://yt-answer-tests.s3-website-us-east-1.amazonaws.com/enzogold2.2_MHDZeldovichPancake.enzo_data0020
  905.  
  906. ======================================================================
  907. ERROR: ProjectionValues_data0020_all_z-velocity_0_None
  908. ----------------------------------------------------------------------
  909. Traceback (most recent call last):
  910.   File "/usr/local/lib/python2.7/dist-packages/nose-1.2.1-py2.7.egg/nose/case.py", line 197, in runTest
  911.     self.test(*self.arg)
  912.   File "/home/mqk/local/yt/yt/utilities/answer_testing/framework.py", line 279, in __call__
  913.     dd = self.reference_storage.get(self.storage_name)
  914.   File "/home/mqk/local/yt/yt/utilities/answer_testing/framework.py", line 170, in get
  915.     raise YTNoOldAnswer(url)
  916. YTNoOldAnswer: There is no old answer available.
  917. http://yt-answer-tests.s3-website-us-east-1.amazonaws.com/enzogold2.2_MHDZeldovichPancake.enzo_data0020
  918.  
  919. ======================================================================
  920. ERROR: ProjectionValues_data0020_all_z-velocity_0_Density
  921. ----------------------------------------------------------------------
  922. Traceback (most recent call last):
  923.   File "/usr/local/lib/python2.7/dist-packages/nose-1.2.1-py2.7.egg/nose/case.py", line 197, in runTest
  924.     self.test(*self.arg)
  925.   File "/home/mqk/local/yt/yt/utilities/answer_testing/framework.py", line 279, in __call__
  926.     dd = self.reference_storage.get(self.storage_name)
  927.   File "/home/mqk/local/yt/yt/utilities/answer_testing/framework.py", line 170, in get
  928.     raise YTNoOldAnswer(url)
  929. YTNoOldAnswer: There is no old answer available.
  930. http://yt-answer-tests.s3-website-us-east-1.amazonaws.com/enzogold2.2_MHDZeldovichPancake.enzo_data0020
  931.  
  932. ======================================================================
  933. ERROR: ProjectionValues_data0020_all_z-velocity_1_None
  934. ----------------------------------------------------------------------
  935. Traceback (most recent call last):
  936.   File "/usr/local/lib/python2.7/dist-packages/nose-1.2.1-py2.7.egg/nose/case.py", line 197, in runTest
  937.     self.test(*self.arg)
  938.   File "/home/mqk/local/yt/yt/utilities/answer_testing/framework.py", line 279, in __call__
  939.     dd = self.reference_storage.get(self.storage_name)
  940.   File "/home/mqk/local/yt/yt/utilities/answer_testing/framework.py", line 170, in get
  941.     raise YTNoOldAnswer(url)
  942. YTNoOldAnswer: There is no old answer available.
  943. http://yt-answer-tests.s3-website-us-east-1.amazonaws.com/enzogold2.2_MHDZeldovichPancake.enzo_data0020
  944.  
  945. ======================================================================
  946. ERROR: ProjectionValues_data0020_all_z-velocity_1_Density
  947. ----------------------------------------------------------------------
  948. Traceback (most recent call last):
  949.   File "/usr/local/lib/python2.7/dist-packages/nose-1.2.1-py2.7.egg/nose/case.py", line 197, in runTest
  950.     self.test(*self.arg)
  951.   File "/home/mqk/local/yt/yt/utilities/answer_testing/framework.py", line 279, in __call__
  952.     dd = self.reference_storage.get(self.storage_name)
  953.   File "/home/mqk/local/yt/yt/utilities/answer_testing/framework.py", line 170, in get
  954.     raise YTNoOldAnswer(url)
  955. YTNoOldAnswer: There is no old answer available.
  956. http://yt-answer-tests.s3-website-us-east-1.amazonaws.com/enzogold2.2_MHDZeldovichPancake.enzo_data0020
  957.  
  958. ======================================================================
  959. ERROR: ProjectionValues_data0020_all_z-velocity_2_None
  960. ----------------------------------------------------------------------
  961. Traceback (most recent call last):
  962.   File "/usr/local/lib/python2.7/dist-packages/nose-1.2.1-py2.7.egg/nose/case.py", line 197, in runTest
  963.     self.test(*self.arg)
  964.   File "/home/mqk/local/yt/yt/utilities/answer_testing/framework.py", line 279, in __call__
  965.     dd = self.reference_storage.get(self.storage_name)
  966.   File "/home/mqk/local/yt/yt/utilities/answer_testing/framework.py", line 170, in get
  967.     raise YTNoOldAnswer(url)
  968. YTNoOldAnswer: There is no old answer available.
  969. http://yt-answer-tests.s3-website-us-east-1.amazonaws.com/enzogold2.2_MHDZeldovichPancake.enzo_data0020
  970.  
  971. ======================================================================
  972. ERROR: ProjectionValues_data0020_all_z-velocity_2_Density
  973. ----------------------------------------------------------------------
  974. Traceback (most recent call last):
  975.   File "/usr/local/lib/python2.7/dist-packages/nose-1.2.1-py2.7.egg/nose/case.py", line 197, in runTest
  976.     self.test(*self.arg)
  977.   File "/home/mqk/local/yt/yt/utilities/answer_testing/framework.py", line 279, in __call__
  978.     dd = self.reference_storage.get(self.storage_name)
  979.   File "/home/mqk/local/yt/yt/utilities/answer_testing/framework.py", line 170, in get
  980.     raise YTNoOldAnswer(url)
  981. YTNoOldAnswer: There is no old answer available.
  982. http://yt-answer-tests.s3-website-us-east-1.amazonaws.com/enzogold2.2_MHDZeldovichPancake.enzo_data0020
  983.  
  984. ======================================================================
  985. ERROR: FieldValues_data0020_all_z-velocity
  986. ----------------------------------------------------------------------
  987. Traceback (most recent call last):
  988.   File "/usr/local/lib/python2.7/dist-packages/nose-1.2.1-py2.7.egg/nose/case.py", line 197, in runTest
  989.     self.test(*self.arg)
  990.   File "/home/mqk/local/yt/yt/utilities/answer_testing/framework.py", line 279, in __call__
  991.     dd = self.reference_storage.get(self.storage_name)
  992.   File "/home/mqk/local/yt/yt/utilities/answer_testing/framework.py", line 170, in get
  993.     raise YTNoOldAnswer(url)
  994. YTNoOldAnswer: There is no old answer available.
  995. http://yt-answer-tests.s3-website-us-east-1.amazonaws.com/enzogold2.2_MHDZeldovichPancake.enzo_data0020
  996.  
  997. ======================================================================
  998. FAIL: VerifySimulationSame_MHDZeldovichPancake.enzo_all
  999. ----------------------------------------------------------------------
  1000. Traceback (most recent call last):
  1001.   File "/usr/local/lib/python2.7/dist-packages/nose-1.2.1-py2.7.egg/nose/case.py", line 197, in runTest
  1002.     self.test(*self.arg)
  1003.   File "/home/mqk/local/yt/yt/utilities/answer_testing/framework.py", line 283, in __call__
  1004.     self.compare(nv, ov)
  1005.   File "/home/mqk/local/yt/yt/utilities/answer_testing/framework.py", line 503, in compare
  1006.     verbose=True)
  1007.   File "/usr/lib/python2.7/dist-packages/numpy/testing/utils.py", line 313, in assert_equal
  1008.     raise AssertionError(msg)
  1009. AssertionError:
  1010. Items are not equal: Number of outputs not equal.
  1011.  ACTUAL: 21
  1012.  DESIRED: 20
  1013.  
  1014. ----------------------------------------------------------------------
  1015. Ran 30 tests in 6.647s
  1016.  
  1017. FAILED (errors=28, failures=1)
  1018. Running test: 5 of 36.
  1019. .FEEEEEEE
  1020. ======================================================================
  1021. ERROR: ProjectionValues_data0001_all_Density_0_None
  1022. ----------------------------------------------------------------------
  1023. Traceback (most recent call last):
  1024.   File "/usr/local/lib/python2.7/dist-packages/nose-1.2.1-py2.7.egg/nose/case.py", line 197, in runTest
  1025.     self.test(*self.arg)
  1026.   File "/home/mqk/local/yt/yt/utilities/answer_testing/framework.py", line 279, in __call__
  1027.     dd = self.reference_storage.get(self.storage_name)
  1028.   File "/home/mqk/local/yt/yt/utilities/answer_testing/framework.py", line 170, in get
  1029.     raise YTNoOldAnswer(url)
  1030. YTNoOldAnswer: There is no old answer available.
  1031. http://yt-answer-tests.s3-website-us-east-1.amazonaws.com/enzogold2.2_ZeldovichPancake.enzo_data0001
  1032.  
  1033. ======================================================================
  1034. ERROR: ProjectionValues_data0001_all_Density_0_Density
  1035. ----------------------------------------------------------------------
  1036. Traceback (most recent call last):
  1037.   File "/usr/local/lib/python2.7/dist-packages/nose-1.2.1-py2.7.egg/nose/case.py", line 197, in runTest
  1038.     self.test(*self.arg)
  1039.   File "/home/mqk/local/yt/yt/utilities/answer_testing/framework.py", line 279, in __call__
  1040.     dd = self.reference_storage.get(self.storage_name)
  1041.   File "/home/mqk/local/yt/yt/utilities/answer_testing/framework.py", line 170, in get
  1042.     raise YTNoOldAnswer(url)
  1043. YTNoOldAnswer: There is no old answer available.
  1044. http://yt-answer-tests.s3-website-us-east-1.amazonaws.com/enzogold2.2_ZeldovichPancake.enzo_data0001
  1045.  
  1046. ======================================================================
  1047. ERROR: ProjectionValues_data0001_all_Density_1_None
  1048. ----------------------------------------------------------------------
  1049. Traceback (most recent call last):
  1050.   File "/usr/local/lib/python2.7/dist-packages/nose-1.2.1-py2.7.egg/nose/case.py", line 197, in runTest
  1051.     self.test(*self.arg)
  1052.   File "/home/mqk/local/yt/yt/utilities/answer_testing/framework.py", line 279, in __call__
  1053.     dd = self.reference_storage.get(self.storage_name)
  1054.   File "/home/mqk/local/yt/yt/utilities/answer_testing/framework.py", line 170, in get
  1055.     raise YTNoOldAnswer(url)
  1056. YTNoOldAnswer: There is no old answer available.
  1057. http://yt-answer-tests.s3-website-us-east-1.amazonaws.com/enzogold2.2_ZeldovichPancake.enzo_data0001
  1058.  
  1059. ======================================================================
  1060. ERROR: ProjectionValues_data0001_all_Density_1_Density
  1061. ----------------------------------------------------------------------
  1062. Traceback (most recent call last):
  1063.   File "/usr/local/lib/python2.7/dist-packages/nose-1.2.1-py2.7.egg/nose/case.py", line 197, in runTest
  1064.     self.test(*self.arg)
  1065.   File "/home/mqk/local/yt/yt/utilities/answer_testing/framework.py", line 279, in __call__
  1066.     dd = self.reference_storage.get(self.storage_name)
  1067.   File "/home/mqk/local/yt/yt/utilities/answer_testing/framework.py", line 170, in get
  1068.     raise YTNoOldAnswer(url)
  1069. YTNoOldAnswer: There is no old answer available.
  1070. http://yt-answer-tests.s3-website-us-east-1.amazonaws.com/enzogold2.2_ZeldovichPancake.enzo_data0001
  1071.  
  1072. ======================================================================
  1073. ERROR: ProjectionValues_data0001_all_Density_2_None
  1074. ----------------------------------------------------------------------
  1075. Traceback (most recent call last):
  1076.   File "/usr/local/lib/python2.7/dist-packages/nose-1.2.1-py2.7.egg/nose/case.py", line 197, in runTest
  1077.     self.test(*self.arg)
  1078.   File "/home/mqk/local/yt/yt/utilities/answer_testing/framework.py", line 279, in __call__
  1079.     dd = self.reference_storage.get(self.storage_name)
  1080.   File "/home/mqk/local/yt/yt/utilities/answer_testing/framework.py", line 170, in get
  1081.     raise YTNoOldAnswer(url)
  1082. YTNoOldAnswer: There is no old answer available.
  1083. http://yt-answer-tests.s3-website-us-east-1.amazonaws.com/enzogold2.2_ZeldovichPancake.enzo_data0001
  1084.  
  1085. ======================================================================
  1086. ERROR: ProjectionValues_data0001_all_Density_2_Density
  1087. ----------------------------------------------------------------------
  1088. Traceback (most recent call last):
  1089.   File "/usr/local/lib/python2.7/dist-packages/nose-1.2.1-py2.7.egg/nose/case.py", line 197, in runTest
  1090.     self.test(*self.arg)
  1091.   File "/home/mqk/local/yt/yt/utilities/answer_testing/framework.py", line 279, in __call__
  1092.     dd = self.reference_storage.get(self.storage_name)
  1093.   File "/home/mqk/local/yt/yt/utilities/answer_testing/framework.py", line 170, in get
  1094.     raise YTNoOldAnswer(url)
  1095. YTNoOldAnswer: There is no old answer available.
  1096. http://yt-answer-tests.s3-website-us-east-1.amazonaws.com/enzogold2.2_ZeldovichPancake.enzo_data0001
  1097.  
  1098. ======================================================================
  1099. ERROR: FieldValues_data0001_all_Density
  1100. ----------------------------------------------------------------------
  1101. Traceback (most recent call last):
  1102.   File "/usr/local/lib/python2.7/dist-packages/nose-1.2.1-py2.7.egg/nose/case.py", line 197, in runTest
  1103.     self.test(*self.arg)
  1104.   File "/home/mqk/local/yt/yt/utilities/answer_testing/framework.py", line 279, in __call__
  1105.     dd = self.reference_storage.get(self.storage_name)
  1106.   File "/home/mqk/local/yt/yt/utilities/answer_testing/framework.py", line 170, in get
  1107.     raise YTNoOldAnswer(url)
  1108. YTNoOldAnswer: There is no old answer available.
  1109. http://yt-answer-tests.s3-website-us-east-1.amazonaws.com/enzogold2.2_ZeldovichPancake.enzo_data0001
  1110.  
  1111. ======================================================================
  1112. FAIL: VerifySimulationSame_ZeldovichPancake.enzo_all
  1113. ----------------------------------------------------------------------
  1114. Traceback (most recent call last):
  1115.   File "/usr/local/lib/python2.7/dist-packages/nose-1.2.1-py2.7.egg/nose/case.py", line 197, in runTest
  1116.     self.test(*self.arg)
  1117.   File "/home/mqk/local/yt/yt/utilities/answer_testing/framework.py", line 283, in __call__
  1118.     self.compare(nv, ov)
  1119.   File "/home/mqk/local/yt/yt/utilities/answer_testing/framework.py", line 503, in compare
  1120.     verbose=True)
  1121.   File "/usr/lib/python2.7/dist-packages/numpy/testing/utils.py", line 313, in assert_equal
  1122.     raise AssertionError(msg)
  1123. AssertionError:
  1124. Items are not equal: Number of outputs not equal.
  1125.  ACTUAL: 2
  1126.  DESIRED: 1
  1127.  
  1128. ----------------------------------------------------------------------
  1129. Ran 9 tests in 2.428s
  1130.  
  1131. FAILED (errors=7, failures=1)
  1132. Running test: 6 of 36.
  1133. .
  1134. ----------------------------------------------------------------------
  1135. Ran 1 test in 0.274s
  1136.  
  1137. OK
  1138. Running test: 7 of 36.
  1139. ..............................
  1140. ----------------------------------------------------------------------
  1141. Ran 30 tests in 3.935s
  1142.  
  1143. OK
  1144. Running test: 8 of 36.
  1145. ....
  1146. ----------------------------------------------------------------------
  1147. Ran 4 tests in 1.183s
  1148.  
  1149. OK
  1150. Running test: 9 of 36.
  1151. ...............................
  1152. ----------------------------------------------------------------------
  1153. Ran 31 tests in 4.627s
  1154.  
  1155. OK
  1156. Running test: 10 of 36.
  1157. ..............................
  1158. ----------------------------------------------------------------------
  1159. Ran 30 tests in 2.673s
  1160.  
  1161. OK
  1162. Running test: 11 of 36.
  1163. ................
  1164. ----------------------------------------------------------------------
  1165. Ran 16 tests in 1.927s
  1166.  
  1167. OK
  1168. Running test: 12 of 36.
  1169. ..................................
  1170. ----------------------------------------------------------------------
  1171. Ran 34 tests in 2.601s
  1172.  
  1173. OK
  1174. Running test: 13 of 36.
  1175. ......................................
  1176. ----------------------------------------------------------------------
  1177. Ran 38 tests in 2.083s
  1178.  
  1179. OK
  1180. Running test: 14 of 36.
  1181. ......................................
  1182. ----------------------------------------------------------------------
  1183. Ran 38 tests in 2.512s
  1184.  
  1185. OK
  1186. Running test: 15 of 36.
  1187. ..................................
  1188. ----------------------------------------------------------------------
  1189. Ran 34 tests in 2.334s
  1190.  
  1191. OK
  1192. Running test: 16 of 36.
  1193. ......................................
  1194. ----------------------------------------------------------------------
  1195. Ran 38 tests in 2.571s
  1196.  
  1197. OK
  1198. Running test: 17 of 36.
  1199. ......................................
  1200. ----------------------------------------------------------------------
  1201. Ran 38 tests in 2.236s
  1202.  
  1203. OK
  1204. Running test: 18 of 36.
  1205. ......................................
  1206. ----------------------------------------------------------------------
  1207. Ran 38 tests in 5.910s
  1208.  
  1209. OK
  1210. Running test: 19 of 36.
  1211. ......................................
  1212. ----------------------------------------------------------------------
  1213. Ran 38 tests in 3.432s
  1214.  
  1215. OK
  1216. Running test: 20 of 36.
  1217. ......................................
  1218. ----------------------------------------------------------------------
  1219. Ran 38 tests in 2.484s
  1220.  
  1221. OK
  1222. Running test: 21 of 36.
  1223. .................................
  1224. ----------------------------------------------------------------------
  1225. Ran 33 tests in 2.015s
  1226.  
  1227. OK
  1228. Running test: 22 of 36.
  1229. .................................
  1230. ----------------------------------------------------------------------
  1231. Ran 33 tests in 4.981s
  1232.  
  1233. OK
  1234. Running test: 23 of 36.
  1235. ..........
  1236. ----------------------------------------------------------------------
  1237. Ran 10 tests in 1.534s
  1238.  
  1239. OK
  1240. Running test: 24 of 36.
  1241. ......................................
  1242. ----------------------------------------------------------------------
  1243. Ran 38 tests in 2.134s
  1244.  
  1245. OK
  1246. Running test: 25 of 36.
  1247. ................
  1248. ----------------------------------------------------------------------
  1249. Ran 16 tests in 1.913s
  1250.  
  1251. OK
  1252. Running test: 26 of 36.
  1253. .......................
  1254. ----------------------------------------------------------------------
  1255. Ran 23 tests in 4.585s
  1256.  
  1257. OK
  1258. Running test: 27 of 36.
  1259. ...............................
  1260. ----------------------------------------------------------------------
  1261. Ran 31 tests in 17.472s
  1262.  
  1263. OK
  1264. Running test: 28 of 36.
  1265. ..............................
  1266. ----------------------------------------------------------------------
  1267. Ran 30 tests in 11.753s
  1268.  
  1269. OK
  1270. Running test: 29 of 36.
  1271. .........................
  1272. ----------------------------------------------------------------------
  1273. Ran 25 tests in 7.135s
  1274.  
  1275. OK
  1276. Running test: 30 of 36.
  1277. .......................
  1278. ----------------------------------------------------------------------
  1279. Ran 23 tests in 3.944s
  1280.  
  1281. OK
  1282. Running test: 31 of 36.
  1283. .FEEEEEEEEEEEEEEEEEEEEEEEEEEEE
  1284. ======================================================================
  1285. ERROR: ProjectionValues_moving7_0007_all_Density_0_None
  1286. ----------------------------------------------------------------------
  1287. Traceback (most recent call last):
  1288.   File "/usr/local/lib/python2.7/dist-packages/nose-1.2.1-py2.7.egg/nose/case.py", line 197, in runTest
  1289.     self.test(*self.arg)
  1290.   File "/home/mqk/local/yt/yt/utilities/answer_testing/framework.py", line 279, in __call__
  1291.     dd = self.reference_storage.get(self.storage_name)
  1292.   File "/home/mqk/local/yt/yt/utilities/answer_testing/framework.py", line 170, in get
  1293.     raise YTNoOldAnswer(url)
  1294. YTNoOldAnswer: There is no old answer available.
  1295. http://yt-answer-tests.s3-website-us-east-1.amazonaws.com/enzogold2.2_ExtremeAdvectionTest.enzo_moving7_0007
  1296.  
  1297. ======================================================================
  1298. ERROR: ProjectionValues_moving7_0007_all_Density_0_Density
  1299. ----------------------------------------------------------------------
  1300. Traceback (most recent call last):
  1301.   File "/usr/local/lib/python2.7/dist-packages/nose-1.2.1-py2.7.egg/nose/case.py", line 197, in runTest
  1302.     self.test(*self.arg)
  1303.   File "/home/mqk/local/yt/yt/utilities/answer_testing/framework.py", line 279, in __call__
  1304.     dd = self.reference_storage.get(self.storage_name)
  1305.   File "/home/mqk/local/yt/yt/utilities/answer_testing/framework.py", line 170, in get
  1306.     raise YTNoOldAnswer(url)
  1307. YTNoOldAnswer: There is no old answer available.
  1308. http://yt-answer-tests.s3-website-us-east-1.amazonaws.com/enzogold2.2_ExtremeAdvectionTest.enzo_moving7_0007
  1309.  
  1310. ======================================================================
  1311. ERROR: ProjectionValues_moving7_0007_all_Density_1_None
  1312. ----------------------------------------------------------------------
  1313. Traceback (most recent call last):
  1314.   File "/usr/local/lib/python2.7/dist-packages/nose-1.2.1-py2.7.egg/nose/case.py", line 197, in runTest
  1315.     self.test(*self.arg)
  1316.   File "/home/mqk/local/yt/yt/utilities/answer_testing/framework.py", line 279, in __call__
  1317.     dd = self.reference_storage.get(self.storage_name)
  1318.   File "/home/mqk/local/yt/yt/utilities/answer_testing/framework.py", line 170, in get
  1319.     raise YTNoOldAnswer(url)
  1320. YTNoOldAnswer: There is no old answer available.
  1321. http://yt-answer-tests.s3-website-us-east-1.amazonaws.com/enzogold2.2_ExtremeAdvectionTest.enzo_moving7_0007
  1322.  
  1323. ======================================================================
  1324. ERROR: ProjectionValues_moving7_0007_all_Density_1_Density
  1325. ----------------------------------------------------------------------
  1326. Traceback (most recent call last):
  1327.   File "/usr/local/lib/python2.7/dist-packages/nose-1.2.1-py2.7.egg/nose/case.py", line 197, in runTest
  1328.     self.test(*self.arg)
  1329.   File "/home/mqk/local/yt/yt/utilities/answer_testing/framework.py", line 279, in __call__
  1330.     dd = self.reference_storage.get(self.storage_name)
  1331.   File "/home/mqk/local/yt/yt/utilities/answer_testing/framework.py", line 170, in get
  1332.     raise YTNoOldAnswer(url)
  1333. YTNoOldAnswer: There is no old answer available.
  1334. http://yt-answer-tests.s3-website-us-east-1.amazonaws.com/enzogold2.2_ExtremeAdvectionTest.enzo_moving7_0007
  1335.  
  1336. ======================================================================
  1337. ERROR: ProjectionValues_moving7_0007_all_Density_2_None
  1338. ----------------------------------------------------------------------
  1339. Traceback (most recent call last):
  1340.   File "/usr/local/lib/python2.7/dist-packages/nose-1.2.1-py2.7.egg/nose/case.py", line 197, in runTest
  1341.     self.test(*self.arg)
  1342.   File "/home/mqk/local/yt/yt/utilities/answer_testing/framework.py", line 279, in __call__
  1343.     dd = self.reference_storage.get(self.storage_name)
  1344.   File "/home/mqk/local/yt/yt/utilities/answer_testing/framework.py", line 170, in get
  1345.     raise YTNoOldAnswer(url)
  1346. YTNoOldAnswer: There is no old answer available.
  1347. http://yt-answer-tests.s3-website-us-east-1.amazonaws.com/enzogold2.2_ExtremeAdvectionTest.enzo_moving7_0007
  1348.  
  1349. ======================================================================
  1350. ERROR: ProjectionValues_moving7_0007_all_Density_2_Density
  1351. ----------------------------------------------------------------------
  1352. Traceback (most recent call last):
  1353.   File "/usr/local/lib/python2.7/dist-packages/nose-1.2.1-py2.7.egg/nose/case.py", line 197, in runTest
  1354.     self.test(*self.arg)
  1355.   File "/home/mqk/local/yt/yt/utilities/answer_testing/framework.py", line 279, in __call__
  1356.     dd = self.reference_storage.get(self.storage_name)
  1357.   File "/home/mqk/local/yt/yt/utilities/answer_testing/framework.py", line 170, in get
  1358.     raise YTNoOldAnswer(url)
  1359. YTNoOldAnswer: There is no old answer available.
  1360. http://yt-answer-tests.s3-website-us-east-1.amazonaws.com/enzogold2.2_ExtremeAdvectionTest.enzo_moving7_0007
  1361.  
  1362. ======================================================================
  1363. ERROR: FieldValues_moving7_0007_all_Density
  1364. ----------------------------------------------------------------------
  1365. Traceback (most recent call last):
  1366.   File "/usr/local/lib/python2.7/dist-packages/nose-1.2.1-py2.7.egg/nose/case.py", line 197, in runTest
  1367.     self.test(*self.arg)
  1368.   File "/home/mqk/local/yt/yt/utilities/answer_testing/framework.py", line 279, in __call__
  1369.     dd = self.reference_storage.get(self.storage_name)
  1370.   File "/home/mqk/local/yt/yt/utilities/answer_testing/framework.py", line 170, in get
  1371.     raise YTNoOldAnswer(url)
  1372. YTNoOldAnswer: There is no old answer available.
  1373. http://yt-answer-tests.s3-website-us-east-1.amazonaws.com/enzogold2.2_ExtremeAdvectionTest.enzo_moving7_0007
  1374.  
  1375. ======================================================================
  1376. ERROR: ProjectionValues_moving7_0007_all_x-velocity_0_None
  1377. ----------------------------------------------------------------------
  1378. Traceback (most recent call last):
  1379.   File "/usr/local/lib/python2.7/dist-packages/nose-1.2.1-py2.7.egg/nose/case.py", line 197, in runTest
  1380.     self.test(*self.arg)
  1381.   File "/home/mqk/local/yt/yt/utilities/answer_testing/framework.py", line 279, in __call__
  1382.     dd = self.reference_storage.get(self.storage_name)
  1383.   File "/home/mqk/local/yt/yt/utilities/answer_testing/framework.py", line 170, in get
  1384.     raise YTNoOldAnswer(url)
  1385. YTNoOldAnswer: There is no old answer available.
  1386. http://yt-answer-tests.s3-website-us-east-1.amazonaws.com/enzogold2.2_ExtremeAdvectionTest.enzo_moving7_0007
  1387.  
  1388. ======================================================================
  1389. ERROR: ProjectionValues_moving7_0007_all_x-velocity_0_Density
  1390. ----------------------------------------------------------------------
  1391. Traceback (most recent call last):
  1392.   File "/usr/local/lib/python2.7/dist-packages/nose-1.2.1-py2.7.egg/nose/case.py", line 197, in runTest
  1393.     self.test(*self.arg)
  1394.   File "/home/mqk/local/yt/yt/utilities/answer_testing/framework.py", line 279, in __call__
  1395.     dd = self.reference_storage.get(self.storage_name)
  1396.   File "/home/mqk/local/yt/yt/utilities/answer_testing/framework.py", line 170, in get
  1397.     raise YTNoOldAnswer(url)
  1398. YTNoOldAnswer: There is no old answer available.
  1399. http://yt-answer-tests.s3-website-us-east-1.amazonaws.com/enzogold2.2_ExtremeAdvectionTest.enzo_moving7_0007
  1400.  
  1401. ======================================================================
  1402. ERROR: ProjectionValues_moving7_0007_all_x-velocity_1_None
  1403. ----------------------------------------------------------------------
  1404. Traceback (most recent call last):
  1405.   File "/usr/local/lib/python2.7/dist-packages/nose-1.2.1-py2.7.egg/nose/case.py", line 197, in runTest
  1406.     self.test(*self.arg)
  1407.   File "/home/mqk/local/yt/yt/utilities/answer_testing/framework.py", line 279, in __call__
  1408.     dd = self.reference_storage.get(self.storage_name)
  1409.   File "/home/mqk/local/yt/yt/utilities/answer_testing/framework.py", line 170, in get
  1410.     raise YTNoOldAnswer(url)
  1411. YTNoOldAnswer: There is no old answer available.
  1412. http://yt-answer-tests.s3-website-us-east-1.amazonaws.com/enzogold2.2_ExtremeAdvectionTest.enzo_moving7_0007
  1413.  
  1414. ======================================================================
  1415. ERROR: ProjectionValues_moving7_0007_all_x-velocity_1_Density
  1416. ----------------------------------------------------------------------
  1417. Traceback (most recent call last):
  1418.   File "/usr/local/lib/python2.7/dist-packages/nose-1.2.1-py2.7.egg/nose/case.py", line 197, in runTest
  1419.     self.test(*self.arg)
  1420.   File "/home/mqk/local/yt/yt/utilities/answer_testing/framework.py", line 279, in __call__
  1421.     dd = self.reference_storage.get(self.storage_name)
  1422.   File "/home/mqk/local/yt/yt/utilities/answer_testing/framework.py", line 170, in get
  1423.     raise YTNoOldAnswer(url)
  1424. YTNoOldAnswer: There is no old answer available.
  1425. http://yt-answer-tests.s3-website-us-east-1.amazonaws.com/enzogold2.2_ExtremeAdvectionTest.enzo_moving7_0007
  1426.  
  1427. ======================================================================
  1428. ERROR: ProjectionValues_moving7_0007_all_x-velocity_2_None
  1429. ----------------------------------------------------------------------
  1430. Traceback (most recent call last):
  1431.   File "/usr/local/lib/python2.7/dist-packages/nose-1.2.1-py2.7.egg/nose/case.py", line 197, in runTest
  1432.     self.test(*self.arg)
  1433.   File "/home/mqk/local/yt/yt/utilities/answer_testing/framework.py", line 279, in __call__
  1434.     dd = self.reference_storage.get(self.storage_name)
  1435.   File "/home/mqk/local/yt/yt/utilities/answer_testing/framework.py", line 170, in get
  1436.     raise YTNoOldAnswer(url)
  1437. YTNoOldAnswer: There is no old answer available.
  1438. http://yt-answer-tests.s3-website-us-east-1.amazonaws.com/enzogold2.2_ExtremeAdvectionTest.enzo_moving7_0007
  1439.  
  1440. ======================================================================
  1441. ERROR: ProjectionValues_moving7_0007_all_x-velocity_2_Density
  1442. ----------------------------------------------------------------------
  1443. Traceback (most recent call last):
  1444.   File "/usr/local/lib/python2.7/dist-packages/nose-1.2.1-py2.7.egg/nose/case.py", line 197, in runTest
  1445.     self.test(*self.arg)
  1446.   File "/home/mqk/local/yt/yt/utilities/answer_testing/framework.py", line 279, in __call__
  1447.     dd = self.reference_storage.get(self.storage_name)
  1448.   File "/home/mqk/local/yt/yt/utilities/answer_testing/framework.py", line 170, in get
  1449.     raise YTNoOldAnswer(url)
  1450. YTNoOldAnswer: There is no old answer available.
  1451. http://yt-answer-tests.s3-website-us-east-1.amazonaws.com/enzogold2.2_ExtremeAdvectionTest.enzo_moving7_0007
  1452.  
  1453. ======================================================================
  1454. ERROR: FieldValues_moving7_0007_all_x-velocity
  1455. ----------------------------------------------------------------------
  1456. Traceback (most recent call last):
  1457.   File "/usr/local/lib/python2.7/dist-packages/nose-1.2.1-py2.7.egg/nose/case.py", line 197, in runTest
  1458.     self.test(*self.arg)
  1459.   File "/home/mqk/local/yt/yt/utilities/answer_testing/framework.py", line 279, in __call__
  1460.     dd = self.reference_storage.get(self.storage_name)
  1461.   File "/home/mqk/local/yt/yt/utilities/answer_testing/framework.py", line 170, in get
  1462.     raise YTNoOldAnswer(url)
  1463. YTNoOldAnswer: There is no old answer available.
  1464. http://yt-answer-tests.s3-website-us-east-1.amazonaws.com/enzogold2.2_ExtremeAdvectionTest.enzo_moving7_0007
  1465.  
  1466. ======================================================================
  1467. ERROR: ProjectionValues_moving7_0007_all_y-velocity_0_None
  1468. ----------------------------------------------------------------------
  1469. Traceback (most recent call last):
  1470.   File "/usr/local/lib/python2.7/dist-packages/nose-1.2.1-py2.7.egg/nose/case.py", line 197, in runTest
  1471.     self.test(*self.arg)
  1472.   File "/home/mqk/local/yt/yt/utilities/answer_testing/framework.py", line 279, in __call__
  1473.     dd = self.reference_storage.get(self.storage_name)
  1474.   File "/home/mqk/local/yt/yt/utilities/answer_testing/framework.py", line 170, in get
  1475.     raise YTNoOldAnswer(url)
  1476. YTNoOldAnswer: There is no old answer available.
  1477. http://yt-answer-tests.s3-website-us-east-1.amazonaws.com/enzogold2.2_ExtremeAdvectionTest.enzo_moving7_0007
  1478.  
  1479. ======================================================================
  1480. ERROR: ProjectionValues_moving7_0007_all_y-velocity_0_Density
  1481. ----------------------------------------------------------------------
  1482. Traceback (most recent call last):
  1483.   File "/usr/local/lib/python2.7/dist-packages/nose-1.2.1-py2.7.egg/nose/case.py", line 197, in runTest
  1484.     self.test(*self.arg)
  1485.   File "/home/mqk/local/yt/yt/utilities/answer_testing/framework.py", line 279, in __call__
  1486.     dd = self.reference_storage.get(self.storage_name)
  1487.   File "/home/mqk/local/yt/yt/utilities/answer_testing/framework.py", line 170, in get
  1488.     raise YTNoOldAnswer(url)
  1489. YTNoOldAnswer: There is no old answer available.
  1490. http://yt-answer-tests.s3-website-us-east-1.amazonaws.com/enzogold2.2_ExtremeAdvectionTest.enzo_moving7_0007
  1491.  
  1492. ======================================================================
  1493. ERROR: ProjectionValues_moving7_0007_all_y-velocity_1_None
  1494. ----------------------------------------------------------------------
  1495. Traceback (most recent call last):
  1496.   File "/usr/local/lib/python2.7/dist-packages/nose-1.2.1-py2.7.egg/nose/case.py", line 197, in runTest
  1497.     self.test(*self.arg)
  1498.   File "/home/mqk/local/yt/yt/utilities/answer_testing/framework.py", line 279, in __call__
  1499.     dd = self.reference_storage.get(self.storage_name)
  1500.   File "/home/mqk/local/yt/yt/utilities/answer_testing/framework.py", line 170, in get
  1501.     raise YTNoOldAnswer(url)
  1502. YTNoOldAnswer: There is no old answer available.
  1503. http://yt-answer-tests.s3-website-us-east-1.amazonaws.com/enzogold2.2_ExtremeAdvectionTest.enzo_moving7_0007
  1504.  
  1505. ======================================================================
  1506. ERROR: ProjectionValues_moving7_0007_all_y-velocity_1_Density
  1507. ----------------------------------------------------------------------
  1508. Traceback (most recent call last):
  1509.   File "/usr/local/lib/python2.7/dist-packages/nose-1.2.1-py2.7.egg/nose/case.py", line 197, in runTest
  1510.     self.test(*self.arg)
  1511.   File "/home/mqk/local/yt/yt/utilities/answer_testing/framework.py", line 279, in __call__
  1512.     dd = self.reference_storage.get(self.storage_name)
  1513.   File "/home/mqk/local/yt/yt/utilities/answer_testing/framework.py", line 170, in get
  1514.     raise YTNoOldAnswer(url)
  1515. YTNoOldAnswer: There is no old answer available.
  1516. http://yt-answer-tests.s3-website-us-east-1.amazonaws.com/enzogold2.2_ExtremeAdvectionTest.enzo_moving7_0007
  1517.  
  1518. ======================================================================
  1519. ERROR: ProjectionValues_moving7_0007_all_y-velocity_2_None
  1520. ----------------------------------------------------------------------
  1521. Traceback (most recent call last):
  1522.   File "/usr/local/lib/python2.7/dist-packages/nose-1.2.1-py2.7.egg/nose/case.py", line 197, in runTest
  1523.     self.test(*self.arg)
  1524.   File "/home/mqk/local/yt/yt/utilities/answer_testing/framework.py", line 279, in __call__
  1525.     dd = self.reference_storage.get(self.storage_name)
  1526.   File "/home/mqk/local/yt/yt/utilities/answer_testing/framework.py", line 170, in get
  1527.     raise YTNoOldAnswer(url)
  1528. YTNoOldAnswer: There is no old answer available.
  1529. http://yt-answer-tests.s3-website-us-east-1.amazonaws.com/enzogold2.2_ExtremeAdvectionTest.enzo_moving7_0007
  1530.  
  1531. ======================================================================
  1532. ERROR: ProjectionValues_moving7_0007_all_y-velocity_2_Density
  1533. ----------------------------------------------------------------------
  1534. Traceback (most recent call last):
  1535.   File "/usr/local/lib/python2.7/dist-packages/nose-1.2.1-py2.7.egg/nose/case.py", line 197, in runTest
  1536.     self.test(*self.arg)
  1537.   File "/home/mqk/local/yt/yt/utilities/answer_testing/framework.py", line 279, in __call__
  1538.     dd = self.reference_storage.get(self.storage_name)
  1539.   File "/home/mqk/local/yt/yt/utilities/answer_testing/framework.py", line 170, in get
  1540.     raise YTNoOldAnswer(url)
  1541. YTNoOldAnswer: There is no old answer available.
  1542. http://yt-answer-tests.s3-website-us-east-1.amazonaws.com/enzogold2.2_ExtremeAdvectionTest.enzo_moving7_0007
  1543.  
  1544. ======================================================================
  1545. ERROR: FieldValues_moving7_0007_all_y-velocity
  1546. ----------------------------------------------------------------------
  1547. Traceback (most recent call last):
  1548.   File "/usr/local/lib/python2.7/dist-packages/nose-1.2.1-py2.7.egg/nose/case.py", line 197, in runTest
  1549.     self.test(*self.arg)
  1550.   File "/home/mqk/local/yt/yt/utilities/answer_testing/framework.py", line 279, in __call__
  1551.     dd = self.reference_storage.get(self.storage_name)
  1552.   File "/home/mqk/local/yt/yt/utilities/answer_testing/framework.py", line 170, in get
  1553.     raise YTNoOldAnswer(url)
  1554. YTNoOldAnswer: There is no old answer available.
  1555. http://yt-answer-tests.s3-website-us-east-1.amazonaws.com/enzogold2.2_ExtremeAdvectionTest.enzo_moving7_0007
  1556.  
  1557. ======================================================================
  1558. ERROR: ProjectionValues_moving7_0007_all_z-velocity_0_None
  1559. ----------------------------------------------------------------------
  1560. Traceback (most recent call last):
  1561.   File "/usr/local/lib/python2.7/dist-packages/nose-1.2.1-py2.7.egg/nose/case.py", line 197, in runTest
  1562.     self.test(*self.arg)
  1563.   File "/home/mqk/local/yt/yt/utilities/answer_testing/framework.py", line 279, in __call__
  1564.     dd = self.reference_storage.get(self.storage_name)
  1565.   File "/home/mqk/local/yt/yt/utilities/answer_testing/framework.py", line 170, in get
  1566.     raise YTNoOldAnswer(url)
  1567. YTNoOldAnswer: There is no old answer available.
  1568. http://yt-answer-tests.s3-website-us-east-1.amazonaws.com/enzogold2.2_ExtremeAdvectionTest.enzo_moving7_0007
  1569.  
  1570. ======================================================================
  1571. ERROR: ProjectionValues_moving7_0007_all_z-velocity_0_Density
  1572. ----------------------------------------------------------------------
  1573. Traceback (most recent call last):
  1574.   File "/usr/local/lib/python2.7/dist-packages/nose-1.2.1-py2.7.egg/nose/case.py", line 197, in runTest
  1575.     self.test(*self.arg)
  1576.   File "/home/mqk/local/yt/yt/utilities/answer_testing/framework.py", line 279, in __call__
  1577.     dd = self.reference_storage.get(self.storage_name)
  1578.   File "/home/mqk/local/yt/yt/utilities/answer_testing/framework.py", line 170, in get
  1579.     raise YTNoOldAnswer(url)
  1580. YTNoOldAnswer: There is no old answer available.
  1581. http://yt-answer-tests.s3-website-us-east-1.amazonaws.com/enzogold2.2_ExtremeAdvectionTest.enzo_moving7_0007
  1582.  
  1583. ======================================================================
  1584. ERROR: ProjectionValues_moving7_0007_all_z-velocity_1_None
  1585. ----------------------------------------------------------------------
  1586. Traceback (most recent call last):
  1587.   File "/usr/local/lib/python2.7/dist-packages/nose-1.2.1-py2.7.egg/nose/case.py", line 197, in runTest
  1588.     self.test(*self.arg)
  1589.   File "/home/mqk/local/yt/yt/utilities/answer_testing/framework.py", line 279, in __call__
  1590.     dd = self.reference_storage.get(self.storage_name)
  1591.   File "/home/mqk/local/yt/yt/utilities/answer_testing/framework.py", line 170, in get
  1592.     raise YTNoOldAnswer(url)
  1593. YTNoOldAnswer: There is no old answer available.
  1594. http://yt-answer-tests.s3-website-us-east-1.amazonaws.com/enzogold2.2_ExtremeAdvectionTest.enzo_moving7_0007
  1595.  
  1596. ======================================================================
  1597. ERROR: ProjectionValues_moving7_0007_all_z-velocity_1_Density
  1598. ----------------------------------------------------------------------
  1599. Traceback (most recent call last):
  1600.   File "/usr/local/lib/python2.7/dist-packages/nose-1.2.1-py2.7.egg/nose/case.py", line 197, in runTest
  1601.     self.test(*self.arg)
  1602.   File "/home/mqk/local/yt/yt/utilities/answer_testing/framework.py", line 279, in __call__
  1603.     dd = self.reference_storage.get(self.storage_name)
  1604.   File "/home/mqk/local/yt/yt/utilities/answer_testing/framework.py", line 170, in get
  1605.     raise YTNoOldAnswer(url)
  1606. YTNoOldAnswer: There is no old answer available.
  1607. http://yt-answer-tests.s3-website-us-east-1.amazonaws.com/enzogold2.2_ExtremeAdvectionTest.enzo_moving7_0007
  1608.  
  1609. ======================================================================
  1610. ERROR: ProjectionValues_moving7_0007_all_z-velocity_2_None
  1611. ----------------------------------------------------------------------
  1612. Traceback (most recent call last):
  1613.   File "/usr/local/lib/python2.7/dist-packages/nose-1.2.1-py2.7.egg/nose/case.py", line 197, in runTest
  1614.     self.test(*self.arg)
  1615.   File "/home/mqk/local/yt/yt/utilities/answer_testing/framework.py", line 279, in __call__
  1616.     dd = self.reference_storage.get(self.storage_name)
  1617.   File "/home/mqk/local/yt/yt/utilities/answer_testing/framework.py", line 170, in get
  1618.     raise YTNoOldAnswer(url)
  1619. YTNoOldAnswer: There is no old answer available.
  1620. http://yt-answer-tests.s3-website-us-east-1.amazonaws.com/enzogold2.2_ExtremeAdvectionTest.enzo_moving7_0007
  1621.  
  1622. ======================================================================
  1623. ERROR: ProjectionValues_moving7_0007_all_z-velocity_2_Density
  1624. ----------------------------------------------------------------------
  1625. Traceback (most recent call last):
  1626.   File "/usr/local/lib/python2.7/dist-packages/nose-1.2.1-py2.7.egg/nose/case.py", line 197, in runTest
  1627.     self.test(*self.arg)
  1628.   File "/home/mqk/local/yt/yt/utilities/answer_testing/framework.py", line 279, in __call__
  1629.     dd = self.reference_storage.get(self.storage_name)
  1630.   File "/home/mqk/local/yt/yt/utilities/answer_testing/framework.py", line 170, in get
  1631.     raise YTNoOldAnswer(url)
  1632. YTNoOldAnswer: There is no old answer available.
  1633. http://yt-answer-tests.s3-website-us-east-1.amazonaws.com/enzogold2.2_ExtremeAdvectionTest.enzo_moving7_0007
  1634.  
  1635. ======================================================================
  1636. ERROR: FieldValues_moving7_0007_all_z-velocity
  1637. ----------------------------------------------------------------------
  1638. Traceback (most recent call last):
  1639.   File "/usr/local/lib/python2.7/dist-packages/nose-1.2.1-py2.7.egg/nose/case.py", line 197, in runTest
  1640.     self.test(*self.arg)
  1641.   File "/home/mqk/local/yt/yt/utilities/answer_testing/framework.py", line 279, in __call__
  1642.     dd = self.reference_storage.get(self.storage_name)
  1643.   File "/home/mqk/local/yt/yt/utilities/answer_testing/framework.py", line 170, in get
  1644.     raise YTNoOldAnswer(url)
  1645. YTNoOldAnswer: There is no old answer available.
  1646. http://yt-answer-tests.s3-website-us-east-1.amazonaws.com/enzogold2.2_ExtremeAdvectionTest.enzo_moving7_0007
  1647.  
  1648. ======================================================================
  1649. FAIL: VerifySimulationSame_ExtremeAdvectionTest.enzo_all
  1650. ----------------------------------------------------------------------
  1651. Traceback (most recent call last):
  1652.   File "/usr/local/lib/python2.7/dist-packages/nose-1.2.1-py2.7.egg/nose/case.py", line 197, in runTest
  1653.     self.test(*self.arg)
  1654.   File "/home/mqk/local/yt/yt/utilities/answer_testing/framework.py", line 283, in __call__
  1655.     self.compare(nv, ov)
  1656.   File "/home/mqk/local/yt/yt/utilities/answer_testing/framework.py", line 503, in compare
  1657.     verbose=True)
  1658.   File "/usr/lib/python2.7/dist-packages/numpy/testing/utils.py", line 313, in assert_equal
  1659.     raise AssertionError(msg)
  1660. AssertionError:
  1661. Items are not equal: Number of outputs not equal.
  1662.  ACTUAL: 8
  1663.  DESIRED: 7
  1664.  
  1665. ----------------------------------------------------------------------
  1666. Ran 30 tests in 7.125s
  1667.  
  1668. FAILED (errors=28, failures=1)
  1669. Running test: 32 of 36.
  1670. ...............................
  1671. ----------------------------------------------------------------------
  1672. Ran 31 tests in 4.054s
  1673.  
  1674. OK
  1675. Running test: 33 of 36.
  1676. ...................
  1677. ----------------------------------------------------------------------
  1678. Ran 19 tests in 11.449s
  1679.  
  1680. OK
  1681. Running test: 34 of 36.
  1682. ..................................
  1683. ----------------------------------------------------------------------
  1684. Ran 34 tests in 19.039s
  1685.  
  1686. OK
  1687. Running test: 35 of 36.
  1688. ..................................
  1689. ----------------------------------------------------------------------
  1690. Ran 34 tests in 4.169s
  1691.  
  1692. OK
  1693. Running test: 36 of 36.
  1694. .................................
  1695. ----------------------------------------------------------------------
  1696. Ran 33 tests in 9.201s
  1697.  
  1698. OK
  1699. Testing complete.
  1700. Sims not finishing: 0
  1701. Number of errors: 91
  1702. Number of failures: 4
  1703. Number of successes: 897
  1704.  
  1705.  
  1706. Complete!
  1707. Total time: 173.997410 seconds.
  1708. See /home/mqk/Enzo/Code/AnswerTesting/301413545861/test_results.txt for a summary of all tests.
RAW Paste Data
We use cookies for various purposes including analytics. By continuing to use Pastebin, you agree to our use of cookies as described in the Cookies Policy. OK, I Understand
Top