Guest User

Untitled

a guest
Nov 5th, 2017
116
Never
Not a member of Pastebin yet? Sign Up, it unlocks many cool features!
  1. [ 18%] Generating ../../../sandbox/shaders/maya/as_maya_samplerInfo.oso
  2. Compiled /home/pouar/src/ABS/appleseed/src/appleseed/src/appleseed.shaders/src/maya/as_maya_samplerInfo.osl -> /home/pouar/src/ABS/appleseed/src/appleseed/sandbox/shaders/maya/as_maya_samplerInfo.oso
  3. [ 19%] Generating ../../../sandbox/shaders/maya/as_maya_setRange.oso
  4. Compiled /home/pouar/src/ABS/appleseed/src/appleseed/src/appleseed.shaders/src/maya/as_maya_setRange.osl -> /home/pouar/src/ABS/appleseed/src/appleseed/sandbox/shaders/maya/as_maya_setRange.oso
  5. [ 19%] Generating ../../../sandbox/shaders/maya/as_maya_singleShadingSwitch.oso
  6. Compiled /home/pouar/src/ABS/appleseed/src/appleseed/src/appleseed.shaders/src/maya/as_maya_singleShadingSwitch.osl -> /home/pouar/src/ABS/appleseed/src/appleseed/sandbox/shaders/maya/as_maya_singleShadingSwitch.oso
  7. [ 19%] Generating ../../../sandbox/shaders/maya/as_maya_stencil.oso
  8. Compiled /home/pouar/src/ABS/appleseed/src/appleseed/src/appleseed.shaders/src/maya/as_maya_stencil.osl -> /home/pouar/src/ABS/appleseed/src/appleseed/sandbox/shaders/maya/as_maya_stencil.oso
  9. [ 19%] Building CXX object src/appleseed/CMakeFiles/appleseed.dir/foundation/meta/benchmarks/benchmark_qmc.cpp.o
  10. In file included from /home/pouar/src/ABS/appleseed/src/appleseed/src/appleseed/foundation/utility/job/abortswitch.h:35:0,
  11. from /home/pouar/src/ABS/appleseed/src/appleseed/src/appleseed/foundation/utility/job.h:34,
  12. from /home/pouar/src/ABS/appleseed/src/appleseed/src/appleseed/foundation/meta/benchmarks/benchmark_job.cpp:32:
  13. /home/pouar/src/ABS/appleseed/src/appleseed/src/appleseed/foundation/platform/thread.h: In constructor ‘foundation::Spinlock::Spinlock()’:
  14. /home/pouar/src/ABS/appleseed/src/appleseed/src/appleseed/foundation/platform/thread.h:301:12: error: use of deleted function ‘boost::detail::spinlock& boost::detail::spinlock::operator=(const boost::detail::spinlock&)’
  15. m_sp = initialized_sp;
  16. ^~~~~~~~~~~~~~
  17. In file included from /usr/include/boost/smart_ptr/detail/spinlock.hpp:47:0,
  18. from /usr/include/boost/smart_ptr/detail/spinlock_pool.hpp:25,
  19. from /usr/include/boost/smart_ptr/shared_ptr.hpp:36,
  20. from /usr/include/boost/shared_ptr.hpp:17,
  21. from /usr/include/boost/date_time/gregorian/greg_month.hpp:14,
  22. from /usr/include/boost/date_time/gregorian/greg_ymd.hpp:16,
  23. from /usr/include/boost/date_time/gregorian/greg_calendar.hpp:17,
  24. from /usr/include/boost/date_time/gregorian/gregorian_types.hpp:19,
  25. from /usr/include/boost/date_time/gregorian/gregorian.hpp:20,
  26. from /home/pouar/src/ABS/appleseed/src/appleseed/src/appleseed/foundation/platform/datetime.h:38,
  27. from /home/pouar/src/ABS/appleseed/src/appleseed/src/appleseed/foundation/utility/benchmark/benchmarkdatapoint.h:34,
  28. from /home/pouar/src/ABS/appleseed/src/appleseed/src/appleseed/foundation/utility/benchmark.h:35,
  29. from /home/pouar/src/ABS/appleseed/src/appleseed/src/appleseed/foundation/meta/benchmarks/benchmark_job.cpp:31:
  30. /usr/include/boost/smart_ptr/detail/spinlock_std_atomic.hpp:27:7: note: ‘boost::detail::spinlock& boost::detail::spinlock::operator=(const boost::detail::spinlock&)’ is implicitly deleted because the default definition would be ill-formed:
  31. class spinlock
  32. ^~~~~~~~
  33. /usr/include/boost/smart_ptr/detail/spinlock_std_atomic.hpp:27:7: error: use of deleted function ‘std::atomic_flag& std::atomic_flag::operator=(const std::atomic_flag&)’
  34. In file included from /usr/include/c++/7.2.0/bits/shared_ptr_atomic.h:33:0,
  35. from /usr/include/c++/7.2.0/memory:82,
  36. from /usr/include/boost/config/no_tr1/memory.hpp:21,
  37. from /usr/include/boost/smart_ptr/shared_ptr.hpp:23,
  38. from /usr/include/boost/shared_ptr.hpp:17,
  39. from /usr/include/boost/date_time/gregorian/greg_month.hpp:14,
  40. from /usr/include/boost/date_time/gregorian/greg_ymd.hpp:16,
  41. from /usr/include/boost/date_time/gregorian/greg_calendar.hpp:17,
  42. from /usr/include/boost/date_time/gregorian/gregorian_types.hpp:19,
  43. from /usr/include/boost/date_time/gregorian/gregorian.hpp:20,
  44. from /home/pouar/src/ABS/appleseed/src/appleseed/src/appleseed/foundation/platform/datetime.h:38,
  45. from /home/pouar/src/ABS/appleseed/src/appleseed/src/appleseed/foundation/utility/benchmark/benchmarkdatapoint.h:34,
  46. from /home/pouar/src/ABS/appleseed/src/appleseed/src/appleseed/foundation/utility/benchmark.h:35,
  47. from /home/pouar/src/ABS/appleseed/src/appleseed/src/appleseed/foundation/meta/benchmarks/benchmark_job.cpp:31:
  48. /usr/include/c++/7.2.0/bits/atomic_base.h:165:18: note: declared here
  49. atomic_flag& operator=(const atomic_flag&) = delete;
  50. ^~~~~~~~
  51. make[2]: *** [src/appleseed/CMakeFiles/appleseed.dir/build.make:1095: src/appleseed/CMakeFiles/appleseed.dir/foundation/meta/benchmarks/benchmark_job.cpp.o] Error 1
  52. make[2]: *** Waiting for unfinished jobs....
  53. [ 19%] Generating ../../../sandbox/shaders/maya/as_maya_texture2Surface.oso
  54. Compiled /home/pouar/src/ABS/appleseed/src/appleseed/src/appleseed.shaders/src/maya/as_maya_texture2Surface.osl -> /home/pouar/src/ABS/appleseed/src/appleseed/sandbox/shaders/maya/as_maya_texture2Surface.oso
  55. [ 19%] Generating ../../../sandbox/shaders/maya/as_maya_transposeMatrix.oso
  56. Compiled /home/pouar/src/ABS/appleseed/src/appleseed/src/appleseed.shaders/src/maya/as_maya_transposeMatrix.osl -> /home/pouar/src/ABS/appleseed/src/appleseed/sandbox/shaders/maya/as_maya_transposeMatrix.oso
  57. [ 19%] Generating ../../../sandbox/shaders/maya/as_maya_tripleShadingSwitch.oso
  58. Compiled /home/pouar/src/ABS/appleseed/src/appleseed/src/appleseed.shaders/src/maya/as_maya_tripleShadingSwitch.osl -> /home/pouar/src/ABS/appleseed/src/appleseed/sandbox/shaders/maya/as_maya_tripleShadingSwitch.oso
  59. [ 19%] Generating ../../../sandbox/shaders/maya/as_maya_uv2Components.oso
  60. Compiled /home/pouar/src/ABS/appleseed/src/appleseed/src/appleseed.shaders/src/maya/as_maya_uv2Components.osl -> /home/pouar/src/ABS/appleseed/src/appleseed/sandbox/shaders/maya/as_maya_uv2Components.oso
  61. [ 19%] Generating ../../../sandbox/shaders/maya/as_maya_vector2Components.oso
  62. Compiled /home/pouar/src/ABS/appleseed/src/appleseed/src/appleseed.shaders/src/maya/as_maya_vector2Components.osl -> /home/pouar/src/ABS/appleseed/src/appleseed/sandbox/shaders/maya/as_maya_vector2Components.oso
  63. [ 19%] Generating ../../../sandbox/shaders/maya/as_maya_vectorProduct.oso
  64. In file included from /home/pouar/src/ABS/appleseed/src/appleseed/src/appleseed/foundation/utility/poolallocator.h:35:0,
  65. from /home/pouar/src/ABS/appleseed/src/appleseed/src/appleseed/foundation/meta/benchmarks/benchmark_poolallocator.cpp:33:
  66. /home/pouar/src/ABS/appleseed/src/appleseed/src/appleseed/foundation/platform/thread.h: In constructor ‘foundation::Spinlock::Spinlock()’:
  67. /home/pouar/src/ABS/appleseed/src/appleseed/src/appleseed/foundation/platform/thread.h:301:12: error: use of deleted function ‘boost::detail::spinlock& boost::detail::spinlock::operator=(const boost::detail::spinlock&)’
  68. m_sp = initialized_sp;
  69. ^~~~~~~~~~~~~~
  70. In file included from /usr/include/boost/smart_ptr/detail/spinlock.hpp:47:0,
  71. from /usr/include/boost/smart_ptr/detail/spinlock_pool.hpp:25,
  72. from /usr/include/boost/smart_ptr/shared_ptr.hpp:36,
  73. from /usr/include/boost/shared_ptr.hpp:17,
  74. from /usr/include/boost/date_time/gregorian/greg_month.hpp:14,
  75. from /usr/include/boost/date_time/gregorian/greg_ymd.hpp:16,
  76. from /usr/include/boost/date_time/gregorian/greg_calendar.hpp:17,
  77. from /usr/include/boost/date_time/gregorian/gregorian_types.hpp:19,
  78. from /usr/include/boost/date_time/gregorian/gregorian.hpp:20,
  79. from /home/pouar/src/ABS/appleseed/src/appleseed/src/appleseed/foundation/platform/datetime.h:38,
  80. from /home/pouar/src/ABS/appleseed/src/appleseed/src/appleseed/foundation/utility/benchmark/benchmarkdatapoint.h:34,
  81. from /home/pouar/src/ABS/appleseed/src/appleseed/src/appleseed/foundation/utility/benchmark.h:35,
  82. from /home/pouar/src/ABS/appleseed/src/appleseed/src/appleseed/foundation/meta/benchmarks/benchmark_poolallocator.cpp:32:
  83. /usr/include/boost/smart_ptr/detail/spinlock_std_atomic.hpp:27:7: note: ‘boost::detail::spinlock& boost::detail::spinlock::operator=(const boost::detail::spinlock&)’ is implicitly deleted because the default definition would be ill-formed:
  84. class spinlock
  85. ^~~~~~~~
  86. /usr/include/boost/smart_ptr/detail/spinlock_std_atomic.hpp:27:7: error: use of deleted function ‘std::atomic_flag& std::atomic_flag::operator=(const std::atomic_flag&)’
  87. In file included from /usr/include/c++/7.2.0/bits/shared_ptr_atomic.h:33:0,
  88. from /usr/include/c++/7.2.0/memory:82,
  89. from /usr/include/boost/config/no_tr1/memory.hpp:21,
  90. from /usr/include/boost/smart_ptr/shared_ptr.hpp:23,
  91. from /usr/include/boost/shared_ptr.hpp:17,
  92. from /usr/include/boost/date_time/gregorian/greg_month.hpp:14,
  93. from /usr/include/boost/date_time/gregorian/greg_ymd.hpp:16,
  94. from /usr/include/boost/date_time/gregorian/greg_calendar.hpp:17,
  95. from /usr/include/boost/date_time/gregorian/gregorian_types.hpp:19,
  96. from /usr/include/boost/date_time/gregorian/gregorian.hpp:20,
  97. from /home/pouar/src/ABS/appleseed/src/appleseed/src/appleseed/foundation/platform/datetime.h:38,
  98. from /home/pouar/src/ABS/appleseed/src/appleseed/src/appleseed/foundation/utility/benchmark/benchmarkdatapoint.h:34,
  99. from /home/pouar/src/ABS/appleseed/src/appleseed/src/appleseed/foundation/utility/benchmark.h:35,
  100. from /home/pouar/src/ABS/appleseed/src/appleseed/src/appleseed/foundation/meta/benchmarks/benchmark_poolallocator.cpp:32:
  101. /usr/include/c++/7.2.0/bits/atomic_base.h:165:18: note: declared here
  102. atomic_flag& operator=(const atomic_flag&) = delete;
  103. ^~~~~~~~
  104. make[2]: *** [src/appleseed/CMakeFiles/appleseed.dir/build.make:1239: src/appleseed/CMakeFiles/appleseed.dir/foundation/meta/benchmarks/benchmark_poolallocator.cpp.o] Error 1
  105. [ 19%] Generating ../../../sandbox/shaders/maya/as_maya_water.oso
  106. Compiled /home/pouar/src/ABS/appleseed/src/appleseed/src/appleseed.shaders/src/maya/as_maya_vectorProduct.osl -> /home/pouar/src/ABS/appleseed/src/appleseed/sandbox/shaders/maya/as_maya_vectorProduct.oso
  107. [ 19%] Generating ../../../sandbox/shaders/maya/as_maya_wtAddMatrix.oso
  108. Compiled /home/pouar/src/ABS/appleseed/src/appleseed/src/appleseed.shaders/src/maya/as_maya_wtAddMatrix.osl -> /home/pouar/src/ABS/appleseed/src/appleseed/sandbox/shaders/maya/as_maya_wtAddMatrix.oso
  109. [ 20%] Generating ../../../sandbox/shaders/appleseed/asDisneyMaterial.oso
  110. Compiled /home/pouar/src/ABS/appleseed/src/appleseed/src/appleseed.shaders/src/appleseed/asDisneyMaterial.osl -> /home/pouar/src/ABS/appleseed/src/appleseed/sandbox/shaders/appleseed/asDisneyMaterial.oso
  111. [ 20%] Generating ../../../sandbox/shaders/appleseed/asGlass.oso
  112. Compiled /home/pouar/src/ABS/appleseed/src/appleseed/src/appleseed.shaders/src/appleseed/asGlass.osl -> /home/pouar/src/ABS/appleseed/src/appleseed/sandbox/shaders/appleseed/asGlass.oso
  113. [ 20%] Generating ../../../sandbox/shaders/appleseed/asVoronoi2D.oso
  114. Compiled /home/pouar/src/ABS/appleseed/src/appleseed/src/appleseed.shaders/src/maya/as_maya_fractal.osl -> /home/pouar/src/ABS/appleseed/src/appleseed/sandbox/shaders/maya/as_maya_fractal.oso
  115. [ 20%] Generating ../../../sandbox/shaders/appleseed/asVoronoi3D.oso
  116. Compiled /home/pouar/src/ABS/appleseed/src/appleseed/src/appleseed.shaders/src/appleseed/asVoronoi2D.osl -> /home/pouar/src/ABS/appleseed/src/appleseed/sandbox/shaders/appleseed/asVoronoi2D.oso
  117. Compiled /home/pouar/src/ABS/appleseed/src/appleseed/src/appleseed.shaders/src/maya/as_maya_cloud.osl -> /home/pouar/src/ABS/appleseed/src/appleseed/sandbox/shaders/maya/as_maya_cloud.oso
  118. Compiled /home/pouar/src/ABS/appleseed/src/appleseed/src/appleseed.shaders/src/maya/as_maya_mandelbrot.osl -> /home/pouar/src/ABS/appleseed/src/appleseed/sandbox/shaders/maya/as_maya_mandelbrot.oso
  119. Compiled /home/pouar/src/ABS/appleseed/src/appleseed/src/appleseed.shaders/src/maya/as_maya_noise.osl -> /home/pouar/src/ABS/appleseed/src/appleseed/sandbox/shaders/maya/as_maya_noise.oso
  120. Compiled /home/pouar/src/ABS/appleseed/src/appleseed/src/appleseed.shaders/src/maya/as_maya_mountain.osl -> /home/pouar/src/ABS/appleseed/src/appleseed/sandbox/shaders/maya/as_maya_mountain.oso
  121. Compiled /home/pouar/src/ABS/appleseed/src/appleseed/src/appleseed.shaders/src/maya/as_maya_water.osl -> /home/pouar/src/ABS/appleseed/src/appleseed/sandbox/shaders/maya/as_maya_water.oso
  122. make[1]: *** [CMakeFiles/Makefile2:118: src/appleseed/CMakeFiles/appleseed.dir/all] Error 2
  123. make[1]: *** Waiting for unfinished jobs....
  124. Compiled /home/pouar/src/ABS/appleseed/src/appleseed/src/appleseed.shaders/src/appleseed/asVoronoi3D.osl -> /home/pouar/src/ABS/appleseed/src/appleseed/sandbox/shaders/appleseed/asVoronoi3D.oso
  125. [ 20%] Built target appleseed.shaders
  126. make: *** [Makefile:130: all] Error 2
  127. ==> ERROR: A failure occurred in build().
  128. Aborting...
RAW Paste Data