SHARE
TWEET

Untitled

a guest Oct 3rd, 2017 103 Never
Not a member of Pastebin yet? Sign Up, it unlocks many cool features!
  1. [INFO] Scanning for projects...
  2. [INFO]
  3. [INFO] ------------------------------------------------------------------------
  4. [INFO] Building optilion-engine 2.6.0
  5. [INFO] ------------------------------------------------------------------------
  6. [INFO]
  7. [INFO] --- maven-clean-plugin:2.5:clean (default-clean) @ optilion-engine ---
  8. [INFO] Deleting /Users/arturlaskowski/Documents/github/optilion/optilion-engine/target
  9. [INFO]
  10. [INFO] ------------------------------------------------------------------------
  11. [INFO] Building optilion-engine 2.6.0
  12. [INFO] ------------------------------------------------------------------------
  13. [INFO]
  14. [INFO] --- jgitflow-maven-plugin:1.0-m5.1:release-finish (default-cli) @ optilion-engine ---
  15. Username: plglaskowski
  16. Password:
  17. [INFO] running jgitflow release finish...
  18. [INFO] (release/2.6.0) Updating poms for RELEASE
  19. [INFO] (release/2.6.0) removing snapshot from pom versions...
  20. [INFO] (release/2.6.0) updating poms for all projects...
  21. [INFO] turn on debug logging with -X to see exact changes
  22. [INFO] (release/2.6.0) updating pom for optilion-engine...
  23. [INFO] (release/2.6.0) Checking for RELEASE version in projects...
  24. [INFO] (release/2.6.0) Checking dependencies and plugins for snapshots ...
  25. [INFO] Executing: /bin/sh -c cd /Users/arturlaskowski/Documents/github/optilion/optilion-engine && /usr/local/Cellar/maven/3.3.9/libexec/bin/mvn -s /var/folders/vh/6fcggyss5l97cvn2qzsd94n40000gn/T/release-settings8147745497846428034.xml clean install --no-plugin-updates -DperformRelease=true -DskipTests=true
  26.     [WARNING] Command line option -npu is deprecated and will be removed in future Maven versions.
  27.     [INFO] Scanning for projects...
  28.     [WARNING]
  29.     [WARNING] Some problems were encountered while building the effective model for optilion:optilion-engine:jar:2.6.0
  30.     [WARNING] 'build.plugins.plugin.version' for org.apache.maven.plugins:maven-source-plugin is missing.
  31.     [WARNING] 'build.plugins.plugin.version' for org.apache.maven.plugins:maven-javadoc-plugin is missing.
  32.     [WARNING] 'build.plugins.plugin.version' for org.apache.maven.plugins:maven-deploy-plugin is missing.
  33.     [WARNING]
  34.     [WARNING] It is highly recommended to fix these problems because they threaten the stability of your build.
  35.     [WARNING]
  36.     [WARNING] For this reason, future Maven versions might no longer support building such malformed projects.
  37.     [WARNING]
  38.     [INFO]
  39.     [INFO] ------------------------------------------------------------------------
  40.     [INFO] Building optilion-engine 2.6.0
  41.     [INFO] ------------------------------------------------------------------------
  42.     [INFO]
  43.     [INFO] --- maven-clean-plugin:2.5:clean (default-clean) @ optilion-engine ---
  44.     [INFO]
  45.     [INFO] --- maven-resources-plugin:2.6:resources (default-resources) @ optilion-engine ---
  46.     [INFO] Using 'UTF-8' encoding to copy filtered resources.
  47.     [INFO] Copying 2 resources
  48.     [INFO]
  49.     [INFO] --- maven-compiler-plugin:3.1:compile (default-compile) @ optilion-engine ---
  50.     [INFO] Changes detected - recompiling the module!
  51.     [INFO] Compiling 28 source files to /Users/arturlaskowski/Documents/github/optilion/optilion-engine/target/classes
  52.     [INFO]
  53.     [INFO] --- maven-resources-plugin:2.6:testResources (default-testResources) @ optilion-engine ---
  54.     [INFO] Using 'UTF-8' encoding to copy filtered resources.
  55.     [INFO] Copying 21 resources
  56.     [INFO]
  57.     [INFO] --- maven-compiler-plugin:3.1:testCompile (default-testCompile) @ optilion-engine ---
  58.     [INFO] Changes detected - recompiling the module!
  59.     [INFO] Compiling 13 source files to /Users/arturlaskowski/Documents/github/optilion/optilion-engine/target/test-classes
  60.     [INFO] -------------------------------------------------------------
  61.     [ERROR] COMPILATION ERROR :
  62.     [INFO] -------------------------------------------------------------
  63.     [ERROR] /Users/arturlaskowski/Documents/github/optilion/optilion-engine/src/test/java/pl/poznan/put/optilion/judge/implementation/JudgeTSP2DTest.java:[30,34] method judge in class pl.poznan.put.optilion.judge.implementation.JudgeTSP2D cannot be applied to given types;
  64.       required: pl.poznan.put.optilion.model.ProblemInstance,pl.poznan.put.optilion.model.OptFile,java.lang.String,pl.poznan.put.optilion.model.OptTest
  65.       found: pl.poznan.put.optilion.model.ProblemInstance,pl.poznan.put.optilion.model.OptFile,java.lang.String
  66.       reason: actual and formal argument lists differ in length
  67.     [ERROR] /Users/arturlaskowski/Documents/github/optilion/optilion-engine/src/test/java/pl/poznan/put/optilion/judge/implementation/JudgeTSP2DTest.java:[40,34] method judge in class pl.poznan.put.optilion.judge.implementation.JudgeTSP2D cannot be applied to given types;
  68.       required: pl.poznan.put.optilion.model.ProblemInstance,pl.poznan.put.optilion.model.OptFile,java.lang.String,pl.poznan.put.optilion.model.OptTest
  69.       found: pl.poznan.put.optilion.model.ProblemInstance,pl.poznan.put.optilion.model.OptFile,java.lang.String
  70.       reason: actual and formal argument lists differ in length
  71.     [ERROR] /Users/arturlaskowski/Documents/github/optilion/optilion-engine/src/test/java/pl/poznan/put/optilion/judge/implementation/JudgeTSP2DTest.java:[51,34] method judge in class pl.poznan.put.optilion.judge.implementation.JudgeTSP2D cannot be applied to given types;
  72.       required: pl.poznan.put.optilion.model.ProblemInstance,pl.poznan.put.optilion.model.OptFile,java.lang.String,pl.poznan.put.optilion.model.OptTest
  73.       found: pl.poznan.put.optilion.model.ProblemInstance,pl.poznan.put.optilion.model.OptFile,java.lang.String
  74.       reason: actual and formal argument lists differ in length
  75.     [ERROR] /Users/arturlaskowski/Documents/github/optilion/optilion-engine/src/test/java/pl/poznan/put/optilion/judge/implementation/JudgeTSP2DTest.java:[61,34] method judge in class pl.poznan.put.optilion.judge.implementation.JudgeTSP2D cannot be applied to given types;
  76.       required: pl.poznan.put.optilion.model.ProblemInstance,pl.poznan.put.optilion.model.OptFile,java.lang.String,pl.poznan.put.optilion.model.OptTest
  77.       found: pl.poznan.put.optilion.model.ProblemInstance,pl.poznan.put.optilion.model.OptFile,java.lang.String
  78.       reason: actual and formal argument lists differ in length
  79.     [ERROR] /Users/arturlaskowski/Documents/github/optilion/optilion-engine/src/test/java/pl/poznan/put/optilion/judge/implementation/JudgeTSP2DTest.java:[70,34] method judge in class pl.poznan.put.optilion.judge.implementation.JudgeTSP2D cannot be applied to given types;
  80.       required: pl.poznan.put.optilion.model.ProblemInstance,pl.poznan.put.optilion.model.OptFile,java.lang.String,pl.poznan.put.optilion.model.OptTest
  81.       found: pl.poznan.put.optilion.model.ProblemInstance,pl.poznan.put.optilion.model.OptFile,java.lang.String
  82.       reason: actual and formal argument lists differ in length
  83.     [ERROR] /Users/arturlaskowski/Documents/github/optilion/optilion-engine/src/test/java/pl/poznan/put/optilion/judge/implementation/JudgeTSP2DTest.java:[79,34] method judge in class pl.poznan.put.optilion.judge.implementation.JudgeTSP2D cannot be applied to given types;
  84.       required: pl.poznan.put.optilion.model.ProblemInstance,pl.poznan.put.optilion.model.OptFile,java.lang.String,pl.poznan.put.optilion.model.OptTest
  85.       found: pl.poznan.put.optilion.model.ProblemInstance,pl.poznan.put.optilion.model.OptFile,java.lang.String
  86.       reason: actual and formal argument lists differ in length
  87.     [ERROR] /Users/arturlaskowski/Documents/github/optilion/optilion-engine/src/test/java/pl/poznan/put/optilion/judge/implementation/BinaryJudgeTest.java:[56,35] method judge in interface pl.poznan.put.optilion.judge.Judge cannot be applied to given types;
  88.       required: pl.poznan.put.optilion.model.ProblemInstance,pl.poznan.put.optilion.model.OptFile,java.lang.String,pl.poznan.put.optilion.model.OptTest
  89.       found: pl.poznan.put.optilion.model.ProblemInstance,pl.poznan.put.optilion.model.OptFile,java.lang.String
  90.       reason: actual and formal argument lists differ in length
  91.     [ERROR] /Users/arturlaskowski/Documents/github/optilion/optilion-engine/src/test/java/pl/poznan/put/optilion/judge/implementation/BinaryJudgeTest.java:[65,35] method judge in interface pl.poznan.put.optilion.judge.Judge cannot be applied to given types;
  92.       required: pl.poznan.put.optilion.model.ProblemInstance,pl.poznan.put.optilion.model.OptFile,java.lang.String,pl.poznan.put.optilion.model.OptTest
  93.       found: pl.poznan.put.optilion.model.ProblemInstance,pl.poznan.put.optilion.model.OptFile,java.lang.String
  94.       reason: actual and formal argument lists differ in length
  95.     [ERROR] /Users/arturlaskowski/Documents/github/optilion/optilion-engine/src/test/java/pl/poznan/put/optilion/judge/implementation/BinaryJudgeModuloTest.java:[61,35] method judge in interface pl.poznan.put.optilion.judge.Judge cannot be applied to given types;
  96.       required: pl.poznan.put.optilion.model.ProblemInstance,pl.poznan.put.optilion.model.OptFile,java.lang.String,pl.poznan.put.optilion.model.OptTest
  97.       found: pl.poznan.put.optilion.model.ProblemInstance,pl.poznan.put.optilion.model.OptFile,java.lang.String
  98.       reason: actual and formal argument lists differ in length
  99.     [ERROR] /Users/arturlaskowski/Documents/github/optilion/optilion-engine/src/test/java/pl/poznan/put/optilion/judge/implementation/BinaryJudgeModuloTest.java:[70,35] method judge in interface pl.poznan.put.optilion.judge.Judge cannot be applied to given types;
  100.       required: pl.poznan.put.optilion.model.ProblemInstance,pl.poznan.put.optilion.model.OptFile,java.lang.String,pl.poznan.put.optilion.model.OptTest
  101.       found: pl.poznan.put.optilion.model.ProblemInstance,pl.poznan.put.optilion.model.OptFile,java.lang.String
  102.       reason: actual and formal argument lists differ in length
  103.     [ERROR] /Users/arturlaskowski/Documents/github/optilion/optilion-engine/src/test/java/pl/poznan/put/optilion/judge/implementation/BinaryJudgeModuloTest.java:[79,35] method judge in interface pl.poznan.put.optilion.judge.Judge cannot be applied to given types;
  104.       required: pl.poznan.put.optilion.model.ProblemInstance,pl.poznan.put.optilion.model.OptFile,java.lang.String,pl.poznan.put.optilion.model.OptTest
  105.       found: pl.poznan.put.optilion.model.ProblemInstance,pl.poznan.put.optilion.model.OptFile,java.lang.String
  106.       reason: actual and formal argument lists differ in length
  107.     [INFO] 11 errors
  108.     [INFO] -------------------------------------------------------------
  109.     [INFO] ------------------------------------------------------------------------
  110.     [INFO] BUILD FAILURE
  111.     [INFO] ------------------------------------------------------------------------
  112.     [INFO] Total time: 2.705 s
  113.     [INFO] Finished at: 2017-10-03T23:39:41+02:00
  114.     [INFO] Final Memory: 25M/209M
  115.     [INFO] ------------------------------------------------------------------------
  116.     [ERROR] Failed to execute goal org.apache.maven.plugins:maven-compiler-plugin:3.1:testCompile (default-testCompile) on project optilion-engine: Compilation failure: Compilation failure:
  117.     [ERROR] /Users/arturlaskowski/Documents/github/optilion/optilion-engine/src/test/java/pl/poznan/put/optilion/judge/implementation/JudgeTSP2DTest.java:[30,34] method judge in class pl.poznan.put.optilion.judge.implementation.JudgeTSP2D cannot be applied to given types;
  118.     [ERROR] required: pl.poznan.put.optilion.model.ProblemInstance,pl.poznan.put.optilion.model.OptFile,java.lang.String,pl.poznan.put.optilion.model.OptTest
  119.     [ERROR] found: pl.poznan.put.optilion.model.ProblemInstance,pl.poznan.put.optilion.model.OptFile,java.lang.String
  120.     [ERROR] reason: actual and formal argument lists differ in length
  121.     [ERROR] /Users/arturlaskowski/Documents/github/optilion/optilion-engine/src/test/java/pl/poznan/put/optilion/judge/implementation/JudgeTSP2DTest.java:[40,34] method judge in class pl.poznan.put.optilion.judge.implementation.JudgeTSP2D cannot be applied to given types;
  122.     [ERROR] required: pl.poznan.put.optilion.model.ProblemInstance,pl.poznan.put.optilion.model.OptFile,java.lang.String,pl.poznan.put.optilion.model.OptTest
  123.     [ERROR] found: pl.poznan.put.optilion.model.ProblemInstance,pl.poznan.put.optilion.model.OptFile,java.lang.String
  124.     [ERROR] reason: actual and formal argument lists differ in length
  125.     [ERROR] /Users/arturlaskowski/Documents/github/optilion/optilion-engine/src/test/java/pl/poznan/put/optilion/judge/implementation/JudgeTSP2DTest.java:[51,34] method judge in class pl.poznan.put.optilion.judge.implementation.JudgeTSP2D cannot be applied to given types;
  126.     [ERROR] required: pl.poznan.put.optilion.model.ProblemInstance,pl.poznan.put.optilion.model.OptFile,java.lang.String,pl.poznan.put.optilion.model.OptTest
  127.     [ERROR] found: pl.poznan.put.optilion.model.ProblemInstance,pl.poznan.put.optilion.model.OptFile,java.lang.String
  128.     [ERROR] reason: actual and formal argument lists differ in length
  129.     [ERROR] /Users/arturlaskowski/Documents/github/optilion/optilion-engine/src/test/java/pl/poznan/put/optilion/judge/implementation/JudgeTSP2DTest.java:[61,34] method judge in class pl.poznan.put.optilion.judge.implementation.JudgeTSP2D cannot be applied to given types;
  130.     [ERROR] required: pl.poznan.put.optilion.model.ProblemInstance,pl.poznan.put.optilion.model.OptFile,java.lang.String,pl.poznan.put.optilion.model.OptTest
  131.     [ERROR] found: pl.poznan.put.optilion.model.ProblemInstance,pl.poznan.put.optilion.model.OptFile,java.lang.String
  132.     [ERROR] reason: actual and formal argument lists differ in length
  133.     [ERROR] /Users/arturlaskowski/Documents/github/optilion/optilion-engine/src/test/java/pl/poznan/put/optilion/judge/implementation/JudgeTSP2DTest.java:[70,34] method judge in class pl.poznan.put.optilion.judge.implementation.JudgeTSP2D cannot be applied to given types;
  134.     [ERROR] required: pl.poznan.put.optilion.model.ProblemInstance,pl.poznan.put.optilion.model.OptFile,java.lang.String,pl.poznan.put.optilion.model.OptTest
  135.     [ERROR] found: pl.poznan.put.optilion.model.ProblemInstance,pl.poznan.put.optilion.model.OptFile,java.lang.String
  136.     [ERROR] reason: actual and formal argument lists differ in length
  137.     [ERROR] /Users/arturlaskowski/Documents/github/optilion/optilion-engine/src/test/java/pl/poznan/put/optilion/judge/implementation/JudgeTSP2DTest.java:[79,34] method judge in class pl.poznan.put.optilion.judge.implementation.JudgeTSP2D cannot be applied to given types;
  138.     [ERROR] required: pl.poznan.put.optilion.model.ProblemInstance,pl.poznan.put.optilion.model.OptFile,java.lang.String,pl.poznan.put.optilion.model.OptTest
  139.     [ERROR] found: pl.poznan.put.optilion.model.ProblemInstance,pl.poznan.put.optilion.model.OptFile,java.lang.String
  140.     [ERROR] reason: actual and formal argument lists differ in length
  141.     [ERROR] /Users/arturlaskowski/Documents/github/optilion/optilion-engine/src/test/java/pl/poznan/put/optilion/judge/implementation/BinaryJudgeTest.java:[56,35] method judge in interface pl.poznan.put.optilion.judge.Judge cannot be applied to given types;
  142.     [ERROR] required: pl.poznan.put.optilion.model.ProblemInstance,pl.poznan.put.optilion.model.OptFile,java.lang.String,pl.poznan.put.optilion.model.OptTest
  143.     [ERROR] found: pl.poznan.put.optilion.model.ProblemInstance,pl.poznan.put.optilion.model.OptFile,java.lang.String
  144.     [ERROR] reason: actual and formal argument lists differ in length
  145.     [ERROR] /Users/arturlaskowski/Documents/github/optilion/optilion-engine/src/test/java/pl/poznan/put/optilion/judge/implementation/BinaryJudgeTest.java:[65,35] method judge in interface pl.poznan.put.optilion.judge.Judge cannot be applied to given types;
  146.     [ERROR] required: pl.poznan.put.optilion.model.ProblemInstance,pl.poznan.put.optilion.model.OptFile,java.lang.String,pl.poznan.put.optilion.model.OptTest
  147.     [ERROR] found: pl.poznan.put.optilion.model.ProblemInstance,pl.poznan.put.optilion.model.OptFile,java.lang.String
  148.     [ERROR] reason: actual and formal argument lists differ in length
  149.     [ERROR] /Users/arturlaskowski/Documents/github/optilion/optilion-engine/src/test/java/pl/poznan/put/optilion/judge/implementation/BinaryJudgeModuloTest.java:[61,35] method judge in interface pl.poznan.put.optilion.judge.Judge cannot be applied to given types;
  150.     [ERROR] required: pl.poznan.put.optilion.model.ProblemInstance,pl.poznan.put.optilion.model.OptFile,java.lang.String,pl.poznan.put.optilion.model.OptTest
  151.     [ERROR] found: pl.poznan.put.optilion.model.ProblemInstance,pl.poznan.put.optilion.model.OptFile,java.lang.String
  152.     [ERROR] reason: actual and formal argument lists differ in length
  153.     [ERROR] /Users/arturlaskowski/Documents/github/optilion/optilion-engine/src/test/java/pl/poznan/put/optilion/judge/implementation/BinaryJudgeModuloTest.java:[70,35] method judge in interface pl.poznan.put.optilion.judge.Judge cannot be applied to given types;
  154.     [ERROR] required: pl.poznan.put.optilion.model.ProblemInstance,pl.poznan.put.optilion.model.OptFile,java.lang.String,pl.poznan.put.optilion.model.OptTest
  155.     [ERROR] found: pl.poznan.put.optilion.model.ProblemInstance,pl.poznan.put.optilion.model.OptFile,java.lang.String
  156.     [ERROR] reason: actual and formal argument lists differ in length
  157.     [ERROR] /Users/arturlaskowski/Documents/github/optilion/optilion-engine/src/test/java/pl/poznan/put/optilion/judge/implementation/BinaryJudgeModuloTest.java:[79,35] method judge in interface pl.poznan.put.optilion.judge.Judge cannot be applied to given types;
  158.     [ERROR] required: pl.poznan.put.optilion.model.ProblemInstance,pl.poznan.put.optilion.model.OptFile,java.lang.String,pl.poznan.put.optilion.model.OptTest
  159.     [ERROR] found: pl.poznan.put.optilion.model.ProblemInstance,pl.poznan.put.optilion.model.OptFile,java.lang.String
  160.     [ERROR] reason: actual and formal argument lists differ in length
  161.     [ERROR] -> [Help 1]
  162.     [ERROR]
  163.     [ERROR] To see the full stack trace of the errors, re-run Maven with the -e switch.
  164.     [ERROR] Re-run Maven using the -X switch to enable full debug logging.
  165.     [ERROR]
  166.     [ERROR] For more information about the errors and possible solutions, please read the following articles:
  167.     [ERROR] [Help 1] http://cwiki.apache.org/confluence/display/MAVEN/MojoFailureException
  168. [INFO] ------------------------------------------------------------------------
  169. [INFO] BUILD FAILURE
  170. [INFO] ------------------------------------------------------------------------
  171. [INFO] Total time: 31.981 s
  172. [INFO] Finished at: 2017-10-03T23:39:41+02:00
  173. [INFO] Final Memory: 19M/175M
  174. [INFO] ------------------------------------------------------------------------
  175. [ERROR] Failed to execute goal external.atlassian.jgitflow:jgitflow-maven-plugin:1.0-m5.1:release-finish (default-cli) on project optilion-engine: Error finishing release: Error finishing release: Error building project from MavenBuildCommand: Maven execution failed, exit code: '1' -> [Help 1]
  176. [ERROR]
  177. [ERROR] To see the full stack trace of the errors, re-run Maven with the -e switch.
  178. [ERROR] Re-run Maven using the -X switch to enable full debug logging.
  179. [ERROR]
  180. [ERROR] For more information about the errors and possible solutions, please read the following articles:
  181. [ERROR] [Help 1] http://cwiki.apache.org/confluence/display/MAVEN/MojoExecutionException
RAW Paste Data
We use cookies for various purposes including analytics. By continuing to use Pastebin, you agree to our use of cookies as described in the Cookies Policy. OK, I Understand
 
Top