Advertisement
Guest User

Untitled

a guest
May 30th, 2019
162
0
Never
Not a member of Pastebin yet? Sign Up, it unlocks many cool features!
text 13.43 KB | None | 0 0
  1. [DEBUG] /home/irynah/.m2/repository/javax/validation/validation-api/1.0.0.GA/validation-api-1.0.0.GA.jar
  2. [DEBUG] /home/irynah/.m2/repository/org/hibernate/validator/hibernate-validator/6.0.16.Final/hibernate-validator-6.0.16.Final.jar
  3. [DEBUG] /home/irynah/.m2/repository/org/codehaus/jackson/jackson-core-asl/1.9.13/jackson-core-asl-1.9.13.jar
  4. [DEBUG] /home/irynah/.m2/repository/org/codehaus/jackson/jackson-mapper-asl/1.9.13/jackson-mapper-asl-1.9.13.jar
  5. [DEBUG] /home/irynah/.m2/repository/org/codehaus/groovy/groovy-all/2.4.6/groovy-all-2.4.6.jar
  6. [DEBUG] /home/irynah/.m2/repository/net/sf/ehcache/ehcache/2.10.0/ehcache-2.10.0.jar
  7. [DEBUG] Source roots:
  8. [DEBUG] /home/irynah/Openmrs-Projects/trunk-5499/openmrs-core/api/src/main/java
  9. [INFO] Compiling 664 source files to /home/irynah/Openmrs-Projects/trunk-5499/openmrs-core/api/target/classes
  10. [INFO] -------------------------------------------------------------
  11. [ERROR] COMPILATION ERROR :
  12. [INFO] -------------------------------------------------------------
  13. [ERROR] /home/irynah/Openmrs-Projects/trunk-5499/openmrs-core/api/src/main/java/org/openmrs/api/db/hibernate/search/TermsFilterFactory.java:[26,39] error: cannot find symbol
  14.  
  15. [ERROR] package org.hibernate.search.filter.impl
  16. /home/irynah/Openmrs-Projects/trunk-5499/openmrs-core/api/src/main/java/org/openmrs/api/db/hibernate/search/TermsFilterFactory.java:[75,13] error: cannot find symbol
  17.  
  18. [ERROR] class TermsFilterFactory
  19. /home/irynah/Openmrs-Projects/trunk-5499/openmrs-core/api/src/main/java/org/openmrs/api/db/hibernate/HibernateAdministrationDAO.java:[193,49] error: cannot find symbol
  20.  
  21. [ERROR] variable configuration of type Configuration
  22. /home/irynah/Openmrs-Projects/trunk-5499/openmrs-core/api/src/main/java/org/openmrs/api/db/hibernate/HibernateAdministrationDAO.java:[259,79] error: incompatible types: FlushModeType cannot be converted to FlushMode
  23.  
  24. [ERROR] /home/irynah/Openmrs-Projects/trunk-5499/openmrs-core/api/src/main/java/org/openmrs/api/db/hibernate/NativeIfNotAssignedIdentityGenerator.java:[36,7] error: NativeIfNotAssignedIdentityGenerator is not abstract and does not override abstract method configure(Type,Properties,ServiceRegistry) in Configurable
  25.  
  26. [ERROR] /home/irynah/Openmrs-Projects/trunk-5499/openmrs-core/api/src/main/java/org/openmrs/api/db/hibernate/NativeIfNotAssignedIdentityGenerator.java:[40,1] error: method does not override or implement a method from a supertype
  27.  
  28. [ERROR] /home/irynah/Openmrs-Projects/trunk-5499/openmrs-core/api/src/main/java/org/openmrs/api/db/hibernate/NativeIfNotAssignedIdentityGenerator.java:[56,1] error: method does not override or implement a method from a supertype
  29.  
  30. [ERROR] /home/irynah/Openmrs-Projects/trunk-5499/openmrs-core/api/src/main/java/org/openmrs/api/db/hibernate/HibernateEncounterDAO.java:[244,44] error: incompatible types: FlushModeType cannot be converted to FlushMode
  31.  
  32. [ERROR] /home/irynah/Openmrs-Projects/trunk-5499/openmrs-core/api/src/main/java/org/openmrs/api/db/hibernate/HibernateEncounterDAO.java:[303,44] error: incompatible types: FlushModeType cannot be converted to FlushMode
  33.  
  34. [ERROR] /home/irynah/Openmrs-Projects/trunk-5499/openmrs-core/api/src/main/java/org/openmrs/api/db/hibernate/DbSession.java:[262,34] error: incompatible types: FlushModeType cannot be converted to FlushMode
  35.  
  36. [ERROR] /home/irynah/Openmrs-Projects/trunk-5499/openmrs-core/api/src/main/java/org/openmrs/api/db/hibernate/DbSession.java:[304,27] error: incompatible types: void cannot be converted to Connection
  37.  
  38. [ERROR] /home/irynah/Openmrs-Projects/trunk-5499/openmrs-core/api/src/main/java/org/openmrs/api/db/hibernate/HibernateConceptDAO.java:[1841,79] error: incompatible types: FlushModeType cannot be converted to FlushMode
  39.  
  40. [ERROR] /home/irynah/Openmrs-Projects/trunk-5499/openmrs-core/api/src/main/java/org/openmrs/api/db/hibernate/HibernateContextDAO.java:[217,71] error: incompatible types: FlushModeType cannot be converted to FlushMode
  41.  
  42. [ERROR] /home/irynah/Openmrs-Projects/trunk-5499/openmrs-core/api/src/main/java/org/openmrs/api/db/hibernate/HibernateContextDAO.java:[444,44] error: incompatible types: FlushModeType cannot be converted to FlushMode
  43.  
  44. [ERROR] /home/irynah/Openmrs-Projects/trunk-5499/openmrs-core/api/src/main/java/org/openmrs/api/db/hibernate/HibernateObsDAO.java:[283,44] error: incompatible types: FlushModeType cannot be converted to FlushMode
  45.  
  46. [INFO] 15 errors
  47. [INFO] -------------------------------------------------------------
  48. [INFO] ------------------------------------------------------------------------
  49. [INFO] Reactor Summary for OpenMRS 2.2.0-SNAPSHOT:
  50. [INFO]
  51. [INFO] OpenMRS ............................................ SUCCESS [ 2.427 s]
  52. [INFO] openmrs-tools ...................................... SUCCESS [ 1.256 s]
  53. [INFO] openmrs-test ....................................... SUCCESS [ 0.172 s]
  54. [INFO] openmrs-api ........................................ FAILURE [ 13.012 s]
  55. [INFO] openmrs-web ........................................ SKIPPED
  56. [INFO] openmrs-webapp ..................................... SKIPPED
  57. [INFO] ------------------------------------------------------------------------
  58. [INFO] BUILD FAILURE
  59. [INFO] ------------------------------------------------------------------------
  60. [INFO] Total time: 17.354 s
  61. [INFO] Finished at: 2019-05-30T16:02:33+03:00
  62. [INFO] ------------------------------------------------------------------------
  63. [ERROR] Failed to execute goal org.apache.maven.plugins:maven-compiler-plugin:2.1:compile (default-compile) on project openmrs-api: Compilation failure: Compilation failure:
  64. [ERROR] /home/irynah/Openmrs-Projects/trunk-5499/openmrs-core/api/src/main/java/org/openmrs/api/db/hibernate/search/TermsFilterFactory.java:[26,39] error: cannot find symbol
  65. [ERROR]
  66. [ERROR] package org.hibernate.search.filter.impl
  67. [ERROR] /home/irynah/Openmrs-Projects/trunk-5499/openmrs-core/api/src/main/java/org/openmrs/api/db/hibernate/search/TermsFilterFactory.java:[75,13] error: cannot find symbol
  68. [ERROR]
  69. [ERROR] class TermsFilterFactory
  70. [ERROR] /home/irynah/Openmrs-Projects/trunk-5499/openmrs-core/api/src/main/java/org/openmrs/api/db/hibernate/HibernateAdministrationDAO.java:[193,49] error: cannot find symbol
  71. [ERROR]
  72. [ERROR] variable configuration of type Configuration
  73. [ERROR] /home/irynah/Openmrs-Projects/trunk-5499/openmrs-core/api/src/main/java/org/openmrs/api/db/hibernate/HibernateAdministrationDAO.java:[259,79] error: incompatible types: FlushModeType cannot be converted to FlushMode
  74. [ERROR]
  75. [ERROR] /home/irynah/Openmrs-Projects/trunk-5499/openmrs-core/api/src/main/java/org/openmrs/api/db/hibernate/NativeIfNotAssignedIdentityGenerator.java:[36,7] error: NativeIfNotAssignedIdentityGenerator is not abstract and does not override abstract method configure(Type,Properties,ServiceRegistry) in Configurable
  76. [ERROR]
  77. [ERROR] /home/irynah/Openmrs-Projects/trunk-5499/openmrs-core/api/src/main/java/org/openmrs/api/db/hibernate/NativeIfNotAssignedIdentityGenerator.java:[40,1] error: method does not override or implement a method from a supertype
  78. [ERROR]
  79. [ERROR] /home/irynah/Openmrs-Projects/trunk-5499/openmrs-core/api/src/main/java/org/openmrs/api/db/hibernate/NativeIfNotAssignedIdentityGenerator.java:[56,1] error: method does not override or implement a method from a supertype
  80. [ERROR]
  81. [ERROR] /home/irynah/Openmrs-Projects/trunk-5499/openmrs-core/api/src/main/java/org/openmrs/api/db/hibernate/HibernateEncounterDAO.java:[244,44] error: incompatible types: FlushModeType cannot be converted to FlushMode
  82. [ERROR]
  83. [ERROR] /home/irynah/Openmrs-Projects/trunk-5499/openmrs-core/api/src/main/java/org/openmrs/api/db/hibernate/HibernateEncounterDAO.java:[303,44] error: incompatible types: FlushModeType cannot be converted to FlushMode
  84. [ERROR]
  85. [ERROR] /home/irynah/Openmrs-Projects/trunk-5499/openmrs-core/api/src/main/java/org/openmrs/api/db/hibernate/DbSession.java:[262,34] error: incompatible types: FlushModeType cannot be converted to FlushMode
  86. [ERROR]
  87. [ERROR] /home/irynah/Openmrs-Projects/trunk-5499/openmrs-core/api/src/main/java/org/openmrs/api/db/hibernate/DbSession.java:[304,27] error: incompatible types: void cannot be converted to Connection
  88. [ERROR]
  89. [ERROR] /home/irynah/Openmrs-Projects/trunk-5499/openmrs-core/api/src/main/java/org/openmrs/api/db/hibernate/HibernateConceptDAO.java:[1841,79] error: incompatible types: FlushModeType cannot be converted to FlushMode
  90. [ERROR]
  91. [ERROR] /home/irynah/Openmrs-Projects/trunk-5499/openmrs-core/api/src/main/java/org/openmrs/api/db/hibernate/HibernateContextDAO.java:[217,71] error: incompatible types: FlushModeType cannot be converted to FlushMode
  92. [ERROR]
  93. [ERROR] /home/irynah/Openmrs-Projects/trunk-5499/openmrs-core/api/src/main/java/org/openmrs/api/db/hibernate/HibernateContextDAO.java:[444,44] error: incompatible types: FlushModeType cannot be converted to FlushMode
  94. [ERROR]
  95. [ERROR] /home/irynah/Openmrs-Projects/trunk-5499/openmrs-core/api/src/main/java/org/openmrs/api/db/hibernate/HibernateObsDAO.java:[283,44] error: incompatible types: FlushModeType cannot be converted to FlushMode
  96. [ERROR] -> [Help 1]
  97. org.apache.maven.lifecycle.LifecycleExecutionException: Failed to execute goal org.apache.maven.plugins:maven-compiler-plugin:2.1:compile (default-compile) on project openmrs-api: Compilation failure
  98. at org.apache.maven.lifecycle.internal.MojoExecutor.execute (MojoExecutor.java:215)
  99. at org.apache.maven.lifecycle.internal.MojoExecutor.execute (MojoExecutor.java:156)
  100. at org.apache.maven.lifecycle.internal.MojoExecutor.execute (MojoExecutor.java:148)
  101. at org.apache.maven.lifecycle.internal.LifecycleModuleBuilder.buildProject (LifecycleModuleBuilder.java:117)
  102. at org.apache.maven.lifecycle.internal.LifecycleModuleBuilder.buildProject (LifecycleModuleBuilder.java:81)
  103. at org.apache.maven.lifecycle.internal.builder.singlethreaded.SingleThreadedBuilder.build (SingleThreadedBuilder.java:56)
  104. at org.apache.maven.lifecycle.internal.LifecycleStarter.execute (LifecycleStarter.java:128)
  105. at org.apache.maven.DefaultMaven.doExecute (DefaultMaven.java:305)
  106. at org.apache.maven.DefaultMaven.doExecute (DefaultMaven.java:192)
  107. at org.apache.maven.DefaultMaven.execute (DefaultMaven.java:105)
  108. at org.apache.maven.cli.MavenCli.execute (MavenCli.java:956)
  109. at org.apache.maven.cli.MavenCli.doMain (MavenCli.java:288)
  110. at org.apache.maven.cli.MavenCli.main (MavenCli.java:192)
  111. at sun.reflect.NativeMethodAccessorImpl.invoke0 (Native Method)
  112. at sun.reflect.NativeMethodAccessorImpl.invoke (NativeMethodAccessorImpl.java:62)
  113. at sun.reflect.DelegatingMethodAccessorImpl.invoke (DelegatingMethodAccessorImpl.java:43)
  114. at java.lang.reflect.Method.invoke (Method.java:498)
  115. at org.codehaus.plexus.classworlds.launcher.Launcher.launchEnhanced (Launcher.java:289)
  116. at org.codehaus.plexus.classworlds.launcher.Launcher.launch (Launcher.java:229)
  117. at org.codehaus.plexus.classworlds.launcher.Launcher.mainWithExitCode (Launcher.java:415)
  118. at org.codehaus.plexus.classworlds.launcher.Launcher.main (Launcher.java:356)
  119. Caused by: org.apache.maven.plugin.CompilationFailureException: Compilation failure
  120. at org.apache.maven.plugin.AbstractCompilerMojo.execute (AbstractCompilerMojo.java:613)
  121. at org.apache.maven.plugin.CompilerMojo.execute (CompilerMojo.java:116)
  122. at org.apache.maven.plugin.DefaultBuildPluginManager.executeMojo (DefaultBuildPluginManager.java:137)
  123. at org.apache.maven.lifecycle.internal.MojoExecutor.execute (MojoExecutor.java:210)
  124. at org.apache.maven.lifecycle.internal.MojoExecutor.execute (MojoExecutor.java:156)
  125. at org.apache.maven.lifecycle.internal.MojoExecutor.execute (MojoExecutor.java:148)
  126. at org.apache.maven.lifecycle.internal.LifecycleModuleBuilder.buildProject (LifecycleModuleBuilder.java:117)
  127. at org.apache.maven.lifecycle.internal.LifecycleModuleBuilder.buildProject (LifecycleModuleBuilder.java:81)
  128. at org.apache.maven.lifecycle.internal.builder.singlethreaded.SingleThreadedBuilder.build (SingleThreadedBuilder.java:56)
  129. at org.apache.maven.lifecycle.internal.LifecycleStarter.execute (LifecycleStarter.java:128)
  130. at org.apache.maven.DefaultMaven.doExecute (DefaultMaven.java:305)
  131. at org.apache.maven.DefaultMaven.doExecute (DefaultMaven.java:192)
  132. at org.apache.maven.DefaultMaven.execute (DefaultMaven.java:105)
  133. at org.apache.maven.cli.MavenCli.execute (MavenCli.java:956)
  134. at org.apache.maven.cli.MavenCli.doMain (MavenCli.java:288)
  135. at org.apache.maven.cli.MavenCli.main (MavenCli.java:192)
  136. at sun.reflect.NativeMethodAccessorImpl.invoke0 (Native Method)
  137. at sun.reflect.NativeMethodAccessorImpl.invoke (NativeMethodAccessorImpl.java:62)
  138. at sun.reflect.DelegatingMethodAccessorImpl.invoke (DelegatingMethodAccessorImpl.java:43)
  139. at java.lang.reflect.Method.invoke (Method.java:498)
  140. at org.codehaus.plexus.classworlds.launcher.Launcher.launchEnhanced (Launcher.java:289)
  141. at org.codehaus.plexus.classworlds.launcher.Launcher.launch (Launcher.java:229)
  142. at org.codehaus.plexus.classworlds.launcher.Launcher.mainWithExitCode (Launcher.java:415)
  143. at org.codehaus.plexus.classworlds.launcher.Launcher.main (Launcher.java:356)
  144. [ERROR]
  145. [ERROR]
  146. [ERROR] For more information about the errors and possible solutions, please read the following articles:
  147. [ERROR] [Help 1] http://cwiki.apache.org/confluence/display/MAVEN/MojoFailureException
  148. [ERROR]
  149. [ERROR] After correcting the problems, you can resume the build with the command
  150. [ERROR] mvn <goals> -rf :openmrs-api
  151. irynah@irynah-Vostro-3560:~/Openmrs-Projects/trunk-5499/openmrs-core$
Advertisement
Add Comment
Please, Sign In to add comment
Advertisement