SHARE
TWEET

Untitled

a guest Jan 14th, 2020 51 Never
Not a member of Pastebin yet? Sign Up, it unlocks many cool features!
  1. 18:37:46: Running steps for project SimpleCalculus...
  2. 18:37:46: Starting: "/usr/bin/cmake" --build . --target all
  3. [  6%] Automatic MOC, UIC and RCC for target SimpleCalculus
  4. [  6%] Built target SimpleCalculus_autogen
  5. [ 12%] Generating /home/nikittossii/Documents/QT/SimpleCalculus/SimpleCalculus_ru_RU.ts
  6. Scanning directory '/home/nikittossii/Documents/QT/SimpleCalculus'...
  7. Updating '../SimpleCalculus/SimpleCalculus_ru_RU.ts'...
  8.     Found 1 source text(s) (0 new and 1 already existing)
  9. Scanning dependencies of target SimpleCalculus
  10. [ 18%] Building CXX object CMakeFiles/SimpleCalculus.dir/main.cpp.o
  11. In file included from /home/nikittossii/Documents/QT/SimpleCalculus/mylayout.h:4:0,
  12.                  from /home/nikittossii/Documents/QT/SimpleCalculus/mainwindow.h:5,
  13.                  from /home/nikittossii/Documents/QT/SimpleCalculus/main.cpp:1:
  14. /home/nikittossii/Documents/QT/SimpleCalculus/actionlayout.h:8:1: error: expected class-name before ‘{’ token
  15.  {
  16.  ^
  17. /home/nikittossii/Documents/QT/SimpleCalculus/actionlayout.h:13:10: error: ‘void ActionLayout::_connect()’ marked ‘override’, but does not override
  18.      void _connect() override{};
  19.           ^~~~~~~~
  20. In file included from /home/nikittossii/Documents/QT/SimpleCalculus/mylayout.h:5:0,
  21.                  from /home/nikittossii/Documents/QT/SimpleCalculus/mainwindow.h:5,
  22.                  from /home/nikittossii/Documents/QT/SimpleCalculus/main.cpp:1:
  23. /home/nikittossii/Documents/QT/SimpleCalculus/statuslayout.h:9:29: error: invalid use of incomplete type ‘class MyLayout’
  24.  class StatusLayout : public MyLayout{
  25.                              ^~~~~~~~
  26. /home/nikittossii/Documents/QT/SimpleCalculus/statuslayout.h:7:7: note: forward declaration of ‘class MyLayout’
  27.  class MyLayout;
  28.        ^~~~~~~~
  29. /home/nikittossii/Documents/QT/SimpleCalculus/statuslayout.h:12:10: error: ‘void StatusLayout::_connect()’ marked ‘override’, but does not override
  30.      void _connect() override{};
  31.           ^~~~~~~~
  32. In file included from /home/nikittossii/Documents/QT/SimpleCalculus/mylayout.h:6:0,
  33.                  from /home/nikittossii/Documents/QT/SimpleCalculus/mainwindow.h:5,
  34.                  from /home/nikittossii/Documents/QT/SimpleCalculus/main.cpp:1:
  35. /home/nikittossii/Documents/QT/SimpleCalculus/controllayout.h:8:38: error: invalid use of incomplete type ‘class MyLayout’
  36.  class ControlLayout : public virtual MyLayout
  37.                                       ^~~~~~~~
  38. In file included from /home/nikittossii/Documents/QT/SimpleCalculus/mylayout.h:5:0,
  39.                  from /home/nikittossii/Documents/QT/SimpleCalculus/mainwindow.h:5,
  40.                  from /home/nikittossii/Documents/QT/SimpleCalculus/main.cpp:1:
  41. /home/nikittossii/Documents/QT/SimpleCalculus/statuslayout.h:7:7: note: forward declaration of ‘class MyLayout’
  42.  class MyLayout;
  43.        ^~~~~~~~
  44. In file included from /home/nikittossii/Documents/QT/SimpleCalculus/mylayout.h:6:0,
  45.                  from /home/nikittossii/Documents/QT/SimpleCalculus/mainwindow.h:5,
  46.                  from /home/nikittossii/Documents/QT/SimpleCalculus/main.cpp:1:
  47. /home/nikittossii/Documents/QT/SimpleCalculus/controllayout.h:14:10: error: ‘void ControlLayout::_connect()’ marked ‘override’, but does not override
  48.      void _connect() override{};
  49.           ^~~~~~~~
  50. CMakeFiles/SimpleCalculus.dir/build.make:66: recipe for target 'CMakeFiles/SimpleCalculus.dir/main.cpp.o' failed
  51. make[2]: *** [CMakeFiles/SimpleCalculus.dir/main.cpp.o] Error 1
  52. make[1]: *** [CMakeFiles/SimpleCalculus.dir/all] Error 2
  53. make: *** [all] Error 2
  54. CMakeFiles/Makefile2:67: recipe for target 'CMakeFiles/SimpleCalculus.dir/all' failed
  55. Makefile:83: recipe for target 'all' failed
  56. 18:37:47: The process "/usr/bin/cmake" exited with code 2.
  57. Error while building/deploying project SimpleCalculus (kit: Desktop Qt 5.12.6 GCC 64bit)
  58. When executing step "CMake Build"
  59. 18:37:47: Elapsed time: 00:02.
RAW Paste Data
We use cookies for various purposes including analytics. By continuing to use Pastebin, you agree to our use of cookies as described in the Cookies Policy. OK, I Understand
 
Top