daily pastebin goal
19%
SHARE
TWEET

Untitled

a guest Mar 8th, 2019 81 Never
Not a member of Pastebin yet? Sign Up, it unlocks many cool features!
  1. [1] mrturcot@GL552VW
  2. [~/mitch/builds/dolphin-emu-git] >$ makepkg -si
  3. ==> Making package: dolphin-emu-git 5.0.r9717.db2542886a-1 (Fri 08 Mar 2019 10:47:36 AM PST)
  4. ==> Checking runtime dependencies...
  5. ==> Checking buildtime dependencies...
  6. ==> Retrieving sources...
  7.   -> Updating dolphin-emu git repo...
  8. Fetching origin
  9. remote: Enumerating objects: 2237, done.
  10. remote: Counting objects: 100% (1019/1019), done.
  11. remote: Compressing objects: 100% (386/386), done.
  12. remote: Total 671 (delta 522), reused 365 (delta 269), pack-reused 0
  13. Receiving objects: 100% (671/671), 145.81 KiB | 506.00 KiB/s, done.
  14. Resolving deltas: 100% (522/522), completed with 201 local objects.
  15. From https://github.com/dolphin-emu/dolphin
  16.  + 1503fdd200...fd56b1e617 refs/pull/6023/merge -> refs/pull/6023/merge  (forced update)
  17.  + f5acd4ee84...5bc7c601dd refs/pull/6075/merge -> refs/pull/6075/merge  (forced update)
  18.  + 2f50d9b107...b34afc6d6f refs/pull/6904/merge -> refs/pull/6904/merge  (forced update)
  19.  + e08945a53d...5445fde9b8 refs/pull/6913/merge -> refs/pull/6913/merge  (forced update)
  20.  + 3f71b3d746...fb41f41bfe refs/pull/7214/merge -> refs/pull/7214/merge  (forced update)
  21.  + dcb8065ba2...a4ce437005 refs/pull/7274/merge -> refs/pull/7274/merge  (forced update)
  22.  + f56c8ae277...f8baae1388 refs/pull/7568/merge -> refs/pull/7568/merge  (forced update)
  23.  + 4c4d0d6810...8488ac792e refs/pull/7660/merge -> refs/pull/7660/merge  (forced update)
  24.  + 40ec501223...16cf5d01ee refs/pull/7676/merge -> refs/pull/7676/merge  (forced update)
  25.  + a8bfa49ec3...27e629e138 refs/pull/7689/merge -> refs/pull/7689/merge  (forced update)
  26.  + 47af31acfa...7de37d4216 refs/pull/7704/merge -> refs/pull/7704/merge  (forced update)
  27.  + f5c48f65c8...5bd50c54c8 refs/pull/7707/merge -> refs/pull/7707/merge  (forced update)
  28.  + 84acde50fe...aef01f5557 refs/pull/7711/merge -> refs/pull/7711/merge  (forced update)
  29.  + 8bcc179e2a...73d682c919 refs/pull/7760/merge -> refs/pull/7760/merge  (forced update)
  30.  + 5d8d7ade74...ecbd9e0c4a refs/pull/7765/merge -> refs/pull/7765/merge  (forced update)
  31.  + 86c0f158ce...2f6ae80c6d refs/pull/7776/merge -> refs/pull/7776/merge  (forced update)
  32.  + 0c3a4993d2...f0d98c82af refs/pull/7786/merge -> refs/pull/7786/merge  (forced update)
  33.  + afb8bb72f5...06ba67d0ae refs/pull/7807/merge -> refs/pull/7807/merge  (forced update)
  34.  + 41bf5ef490...94590b2b42 refs/pull/7829/merge -> refs/pull/7829/merge  (forced update)
  35.  + 7b847162f2...712d3315a5 refs/pull/7830/merge -> refs/pull/7830/merge  (forced update)
  36.  + a017d491c3...3a5f8230fe refs/pull/7834/merge -> refs/pull/7834/merge  (forced update)
  37.  + 36d271bf2d...769da344f6 refs/pull/7835/merge -> refs/pull/7835/merge  (forced update)
  38.  + fc58a132f2...5453fe112d refs/pull/7839/merge -> refs/pull/7839/merge  (forced update)
  39.  + 6bbb13cb90...75c80e0db1 refs/pull/7841/merge -> refs/pull/7841/merge  (forced update)
  40.  * [new ref]               refs/pull/7867/head  -> refs/pull/7867/head
  41.  * [new ref]               refs/pull/7867/merge -> refs/pull/7867/merge
  42. ==> Validating source files with sha256sums...
  43.     dolphin-emu ... Skipped
  44. ==> Extracting sources...
  45.   -> Creating working copy of dolphin-emu git repo...
  46. Switched to a new branch 'makepkg'
  47. ==> Starting prepare()...
  48. ==> Starting pkgver()...
  49. ==> Removing existing $pkgdir/ directory...
  50. ==> Starting build()...
  51. -- The C compiler identification is GNU 8.2.1
  52. -- The CXX compiler identification is GNU 8.2.1
  53. -- Check for working C compiler: /usr/lib/ccache/bin/cc
  54. -- Check for working C compiler: /usr/lib/ccache/bin/cc -- works
  55. -- Detecting C compiler ABI info
  56. -- Detecting C compiler ABI info - done
  57. -- Detecting C compile features
  58. -- Detecting C compile features - done
  59. -- Check for working CXX compiler: /usr/lib/ccache/bin/c++
  60. -- Check for working CXX compiler: /usr/lib/ccache/bin/c++ -- works
  61. -- Detecting CXX compiler ABI info
  62. -- Detecting CXX compiler ABI info - done
  63. -- Detecting CXX compile features
  64. -- Detecting CXX compile features - done
  65. -- Found Git: /usr/bin/git (found version "2.20.1")
  66. -- Detected architecture: x86_64
  67. -- Performing Test FLAG_C_HAVE_SSE2
  68. -- Performing Test FLAG_C_HAVE_SSE2 - Success
  69. -- Performing Test FLAG_CXX_HAVE_SSE2
  70. -- Performing Test FLAG_CXX_HAVE_SSE2 - Success
  71. -- Performing Test FLAG_C_HAVE_WALL
  72. -- Performing Test FLAG_C_HAVE_WALL - Success
  73. -- Performing Test FLAG_CXX_HAVE_WALL
  74. -- Performing Test FLAG_CXX_HAVE_WALL - Success
  75. -- Performing Test FLAG_C_TYPE_LIMITS
  76. -- Performing Test FLAG_C_TYPE_LIMITS - Success
  77. -- Performing Test FLAG_CXX_TYPE_LIMITS
  78. -- Performing Test FLAG_CXX_TYPE_LIMITS - Success
  79. -- Performing Test FLAG_C_SIGN_COMPARE
  80. -- Performing Test FLAG_C_SIGN_COMPARE - Success
  81. -- Performing Test FLAG_CXX_SIGN_COMPARE
  82. -- Performing Test FLAG_CXX_SIGN_COMPARE - Success
  83. -- Performing Test FLAG_C_IGNORED_QUALIFIERS
  84. -- Performing Test FLAG_C_IGNORED_QUALIFIERS - Success
  85. -- Performing Test FLAG_CXX_IGNORED_QUALIFIERS
  86. -- Performing Test FLAG_CXX_IGNORED_QUALIFIERS - Success
  87. -- Performing Test FLAG_C_UNINITIALIZED
  88. -- Performing Test FLAG_C_UNINITIALIZED - Success
  89. -- Performing Test FLAG_CXX_UNINITIALIZED
  90. -- Performing Test FLAG_CXX_UNINITIALIZED - Success
  91. -- Performing Test FLAG_C_LOGICAL_OP
  92. -- Performing Test FLAG_C_LOGICAL_OP - Success
  93. -- Performing Test FLAG_CXX_LOGICAL_OP
  94. -- Performing Test FLAG_CXX_LOGICAL_OP - Success
  95. -- Performing Test FLAG_C_SHADOW
  96. -- Performing Test FLAG_C_SHADOW - Success
  97. -- Performing Test FLAG_CXX_SHADOW
  98. -- Performing Test FLAG_CXX_SHADOW - Success
  99. -- Performing Test FLAG_C_INIT_SELF
  100. -- Performing Test FLAG_C_INIT_SELF - Success
  101. -- Performing Test FLAG_CXX_INIT_SELF
  102. -- Performing Test FLAG_CXX_INIT_SELF - Success
  103. -- Performing Test FLAG_C_MISSING_DECLARATIONS
  104. -- Performing Test FLAG_C_MISSING_DECLARATIONS - Success
  105. -- Performing Test FLAG_CXX_MISSING_DECLARATIONS
  106. -- Performing Test FLAG_CXX_MISSING_DECLARATIONS - Success
  107. -- Performing Test FLAG_C_MISSING_VARIABLE_DECLARATIONS
  108. -- Performing Test FLAG_C_MISSING_VARIABLE_DECLARATIONS - Failed
  109. -- Performing Test FLAG_CXX_MISSING_VARIABLE_DECLARATIONS
  110. -- Performing Test FLAG_CXX_MISSING_VARIABLE_DECLARATIONS - Failed
  111. -- Performing Test FLAG_C_NO_STRICT_ALIASING
  112. -- Performing Test FLAG_C_NO_STRICT_ALIASING - Success
  113. -- Performing Test FLAG_CXX_NO_STRICT_ALIASING
  114. -- Performing Test FLAG_CXX_NO_STRICT_ALIASING - Success
  115. -- Performing Test FLAG_C_NO_EXCEPTIONS
  116. -- Performing Test FLAG_C_NO_EXCEPTIONS - Success
  117. -- Performing Test FLAG_CXX_NO_EXCEPTIONS
  118. -- Performing Test FLAG_CXX_NO_EXCEPTIONS - Success
  119. -- Performing Test FLAG_C_VISIBILITY_INLINES_HIDDEN
  120. -- Performing Test FLAG_C_VISIBILITY_INLINES_HIDDEN - Failed
  121. -- Performing Test FLAG_CXX_VISIBILITY_INLINES_HIDDEN
  122. -- Performing Test FLAG_CXX_VISIBILITY_INLINES_HIDDEN - Success
  123. -- Performing Test FLAG_C_VISIBILITY_HIDDEN
  124. -- Performing Test FLAG_C_VISIBILITY_HIDDEN - Success
  125. -- Performing Test FLAG_CXX_VISIBILITY_HIDDEN
  126. -- Performing Test FLAG_CXX_VISIBILITY_HIDDEN - Success
  127. -- Performing Test FLAG_C_FOMIT_FRAME_POINTER
  128. -- Performing Test FLAG_C_FOMIT_FRAME_POINTER - Success
  129. -- Performing Test FLAG_CXX_FOMIT_FRAME_POINTER
  130. -- Performing Test FLAG_CXX_FOMIT_FRAME_POINTER - Success
  131. -- Performing Test FLAG_C_GGDB
  132. -- Performing Test FLAG_C_GGDB - Success
  133. -- Performing Test FLAG_CXX_GGDB
  134. -- Performing Test FLAG_CXX_GGDB - Success
  135. -- Looking for pthread.h
  136. -- Looking for pthread.h - found
  137. -- Looking for pthread_create
  138. -- Looking for pthread_create - not found
  139. -- Looking for pthread_create in pthreads
  140. -- Looking for pthread_create in pthreads - not found
  141. -- Looking for pthread_create in pthread
  142. -- Looking for pthread_create in pthread - found
  143. -- Found Threads: TRUE  
  144. -- Found PkgConfig: /usr/bin/pkg-config (found version "1.6.0")
  145. -- Found OpenGL: /usr/lib/libOpenGL.so  
  146. -- Looking for XOpenDisplay in /usr/lib/libX11.so;/usr/lib/libXext.so
  147. -- Looking for XOpenDisplay in /usr/lib/libX11.so;/usr/lib/libXext.so - found
  148. -- Looking for gethostbyname
  149. -- Looking for gethostbyname - found
  150. -- Looking for connect
  151. -- Looking for connect - found
  152. -- Looking for remove
  153. -- Looking for remove - found
  154. -- Looking for shmat
  155. -- Looking for shmat - found
  156. -- Looking for IceConnectionNumber in ICE
  157. -- Looking for IceConnectionNumber in ICE - found
  158. -- Found X11: /usr/lib/libX11.so
  159. -- Xrandr found
  160. -- Checking for module 'xi>=1.5.0'
  161. --   Found xi, version 1.7.9
  162. -- X11 support enabled
  163. -- Checking for module 'egl'
  164. --   Found egl, version 18.3.3
  165. -- Found EGL: /usr/include  
  166. -- EGL OpenGL interface enabled
  167. --  Found avcodec: /usr/include /usr/lib/libavcodec.so
  168. --  Found avdevice: /usr/include /usr/lib/libavdevice.so
  169. --  Found avfilter: /usr/include /usr/lib/libavfilter.so
  170. --  Found avformat: /usr/include /usr/lib/libavformat.so
  171. --  Found avutil: /usr/include /usr/lib/libavutil.so
  172. --  Found swresample: /usr/include /usr/lib/libswresample.so
  173. --  Found swscale: /usr/include /usr/lib/libswscale.so
  174. -- Found FFmpeg: /usr/include  found components:  avcodec avformat avutil swscale
  175. -- libav/ffmpeg found, enabling AVI frame dumps
  176. -- Found LIBUDEV: /usr/lib/libudev.so  
  177. -- Found libevdev: /usr/lib/libevdev.so  
  178. -- libevdev/libudev found, enabling evdev controller backend
  179. -- Using named pipes as controller inputs
  180. -- Watching game memory for changes
  181. -- Enabling analytics collection (subject to end-user opt-in)
  182. -- Performing Test FLAG_C_CXX11
  183. -- Performing Test FLAG_C_CXX11 - Failed
  184. -- Performing Test FLAG_CXX_CXX11
  185. -- Performing Test FLAG_CXX_CXX11 - Success
  186. -- Found pugixml: /usr/lib/libpugixml.so  
  187. -- Looking for enet_socket_get_address
  188. -- Looking for enet_socket_get_address - found
  189. -- Using shared enet
  190. -- Found ZLIB: /usr/lib/libz.so (found version "1.2.11")
  191. -- Using shared zlib
  192. -- Using shared lzo
  193. -- Using shared libpng
  194. -- Using static FreeSurround from Externals
  195. -- Could NOT find CUBEB (missing: CUBEB_INCLUDE_DIR CUBEB_LIBRARY)
  196. -- Using static cubeb from Externals
  197. -- Performing Test COMPILER_HAS_HIDDEN_VISIBILITY
  198. -- Performing Test COMPILER_HAS_HIDDEN_VISIBILITY - Success
  199. -- Performing Test COMPILER_HAS_HIDDEN_INLINE_VISIBILITY
  200. -- Performing Test COMPILER_HAS_HIDDEN_INLINE_VISIBILITY - Success
  201. -- Performing Test COMPILER_HAS_DEPRECATED_ATTR
  202. -- Performing Test COMPILER_HAS_DEPRECATED_ATTR - Success
  203. -- Looking for include file AudioUnit/AudioUnit.h
  204. -- Looking for include file AudioUnit/AudioUnit.h - not found
  205. -- Looking for include file pulse/pulseaudio.h
  206. -- Looking for include file pulse/pulseaudio.h - found
  207. -- Looking for include file alsa/asoundlib.h
  208. -- Looking for include file alsa/asoundlib.h - found
  209. -- Looking for include file jack/jack.h
  210. -- Looking for include file jack/jack.h - found
  211. -- Looking for include file audioclient.h
  212. -- Looking for include file audioclient.h - not found
  213. -- Looking for include files windows.h, mmsystem.h
  214. -- Looking for include files windows.h, mmsystem.h - not found
  215. -- Looking for include file SLES/OpenSLES.h
  216. -- Looking for include file SLES/OpenSLES.h - not found
  217. -- Looking for include file android/log.h
  218. -- Looking for include file android/log.h - not found
  219. -- Looking for include file sndio.h
  220. -- Looking for include file sndio.h - not found
  221. -- Looking for include file kai.h
  222. -- Looking for include file kai.h - not found
  223. -- Checking for module 'libusb-1.0'
  224. --   Found libusb-1.0, version 1.0.22
  225. -- Found libusb-1.0: /usr/include/libusb-1.0, /usr/lib/libusb-1.0.so
  226. -- Using shared LibUSB
  227. -- Found SFML 2.5 in /usr/include
  228. -- Using shared SFML
  229. -- Found MINIUPNPC: /usr/include/miniupnpc  
  230. -- Using shared miniupnpc
  231. -- Performing Test MBEDTLS_VERSION_OK
  232. -- Performing Test MBEDTLS_VERSION_OK - Success
  233. -- Found MBEDTLS: /usr/include  
  234. -- Using shared mbed TLS
  235. -- Found CURL: /usr/lib/libcurl.so (found version "7.64.0")
  236. -- Using shared libcurl
  237. -- Found HIDAPI: /usr/lib/libhidapi-hidraw.so  
  238. -- Using static DiscordRPC from Externals
  239. -- Found SYSTEMD: /usr/lib/libsystemd.so  
  240. -- libsystemd found, enabling traversal server watchdog support
  241. -- Using static gtest from Externals
  242. -- Found PythonInterp: /usr/bin/python (found version "3.7.2")
  243. -- Check if compiler accepts -pthread
  244. -- Check if compiler accepts -pthread - yes
  245. -- Performing Test FLAG_C_CXX17
  246. -- Performing Test FLAG_C_CXX17 - Failed
  247. -- Performing Test FLAG_CXX_CXX17
  248. -- Performing Test FLAG_CXX_CXX17 - Success
  249. -- Could NOT find OpenSLES (missing: OPENSLES_LIBRARY OPENSLES_INCLUDE_DIR)
  250. -- Found ALSA: /usr/lib/libasound.so (found version "1.1.8")
  251. -- ALSA found, enabling ALSA sound backend
  252. -- PulseAudio found, enabling PulseAudio sound backend
  253. -- Found BlueZ: /usr/lib/libbluetooth.so  
  254. -- BlueZ found, enabling bluetooth support
  255. -- LLVM found, enabling LLVM support in disassembler
  256. -- Found Qt version 5.12.1
  257. -- Found Gettext: /usr/bin/msgmerge (found version "0.19.8.1")
  258. -- Configuring done
  259. -- Generating done
  260. -- Build files have been written to: /home/mrturcot/mitch/builds/dolphin-emu-git/src/build
  261. Scanning dependencies of target imgui
  262. Scanning dependencies of target cpp-optparse
  263. Scanning dependencies of target FreeSurround
  264. Scanning dependencies of target minizip
  265. Scanning dependencies of target discord-rpc
  266. Scanning dependencies of target SoundTouch
  267. Scanning dependencies of target glslang
  268. Scanning dependencies of target bdisasm
  269. [  0%] Building CXX object Externals/cpp-optparse/CMakeFiles/cpp-optparse.dir/OptionParser.cpp.o
  270. [  0%] Building C object Externals/minizip/CMakeFiles/minizip.dir/ioapi.c.o
  271. In function ‘file_build_ioposix’,
  272.     inlined from ‘fopen_file_func.constprop’ at /home/mrturcot/mitch/builds/dolphin-emu-git/src/dolphin-emu/Externals/minizip/ioapi.c:124:16,
  273.     inlined from ‘fopendisk_file_func’ at /home/mrturcot/mitch/builds/dolphin-emu-git/src/dolphin-emu/Externals/minizip/ioapi.c:193:15:
  274. /home/mrturcot/mitch/builds/dolphin-emu-git/src/dolphin-emu/Externals/minizip/ioapi.c:106:5: warning: ‘strncpy’ specified bound depends on the length of the source argument [-Wstringop-overflow=]
  275.      strncpy((char*)ioposix->filename, filename, ioposix->filenameLength);
  276.      ^~~~~~~~~~~~~~~~~~~~~~~~~~~~~~~~~~~~~~~~~~~~~~~~~~~~~~~~~~~~~~~~~~~~
  277. /home/mrturcot/mitch/builds/dolphin-emu-git/src/dolphin-emu/Externals/minizip/ioapi.c: In function ‘fopendisk_file_func’:
  278. /home/mrturcot/mitch/builds/dolphin-emu-git/src/dolphin-emu/Externals/minizip/ioapi.c:104:36: note: length computed here
  279.      ioposix->filenameLength = (int)strlen(filename) + 1;
  280.                                     ^~~~~~~~~~~~~~~~
  281. In function ‘file_build_ioposix’,
  282.     inlined from ‘fopen64_file_func’ at /home/mrturcot/mitch/builds/dolphin-emu-git/src/dolphin-emu/Externals/minizip/ioapi.c:143:16:
  283. /home/mrturcot/mitch/builds/dolphin-emu-git/src/dolphin-emu/Externals/minizip/ioapi.c:106:5: warning: ‘strncpy’ specified bound depends on the length of the source argument [-Wstringop-overflow=]
  284.      strncpy((char*)ioposix->filename, filename, ioposix->filenameLength);
  285.      ^~~~~~~~~~~~~~~~~~~~~~~~~~~~~~~~~~~~~~~~~~~~~~~~~~~~~~~~~~~~~~~~~~~~
  286. /home/mrturcot/mitch/builds/dolphin-emu-git/src/dolphin-emu/Externals/minizip/ioapi.c: In function ‘fopen64_file_func’:
  287. /home/mrturcot/mitch/builds/dolphin-emu-git/src/dolphin-emu/Externals/minizip/ioapi.c:104:36: note: length computed here
  288.      ioposix->filenameLength = (int)strlen(filename) + 1;
  289.                                     ^~~~~~~~~~~~~~~~
  290. In function ‘file_build_ioposix’,
  291.     inlined from ‘fopen_file_func’ at /home/mrturcot/mitch/builds/dolphin-emu-git/src/dolphin-emu/Externals/minizip/ioapi.c:124:16:
  292. /home/mrturcot/mitch/builds/dolphin-emu-git/src/dolphin-emu/Externals/minizip/ioapi.c:106:5: warning: ‘strncpy’ specified bound depends on the length of the source argument [-Wstringop-overflow=]
  293.      strncpy((char*)ioposix->filename, filename, ioposix->filenameLength);
  294.      ^~~~~~~~~~~~~~~~~~~~~~~~~~~~~~~~~~~~~~~~~~~~~~~~~~~~~~~~~~~~~~~~~~~~
  295. /home/mrturcot/mitch/builds/dolphin-emu-git/src/dolphin-emu/Externals/minizip/ioapi.c: In function ‘fopen_file_func’:
  296. /home/mrturcot/mitch/builds/dolphin-emu-git/src/dolphin-emu/Externals/minizip/ioapi.c:104:36: note: length computed here
  297.      ioposix->filenameLength = (int)strlen(filename) + 1;
  298.                                     ^~~~~~~~~~~~~~~~
  299. In function ‘file_build_ioposix’,
  300.     inlined from ‘fopen64_file_func.constprop’ at /home/mrturcot/mitch/builds/dolphin-emu-git/src/dolphin-emu/Externals/minizip/ioapi.c:143:16,
  301.     inlined from ‘fopendisk64_file_func’ at /home/mrturcot/mitch/builds/dolphin-emu-git/src/dolphin-emu/Externals/minizip/ioapi.c:168:15:
  302. /home/mrturcot/mitch/builds/dolphin-emu-git/src/dolphin-emu/Externals/minizip/ioapi.c:106:5: warning: ‘strncpy’ specified bound depends on the length of the source argument [-Wstringop-overflow=]
  303.      strncpy((char*)ioposix->filename, filename, ioposix->filenameLength);
  304.      ^~~~~~~~~~~~~~~~~~~~~~~~~~~~~~~~~~~~~~~~~~~~~~~~~~~~~~~~~~~~~~~~~~~~
  305. /home/mrturcot/mitch/builds/dolphin-emu-git/src/dolphin-emu/Externals/minizip/ioapi.c: In function ‘fopendisk64_file_func’:
  306. /home/mrturcot/mitch/builds/dolphin-emu-git/src/dolphin-emu/Externals/minizip/ioapi.c:104:36: note: length computed here
  307.      ioposix->filenameLength = (int)strlen(filename) + 1;
  308.                                     ^~~~~~~~~~~~~~~~
  309. [  0%] Linking CXX static library libcpp-optparse.a
  310. [  0%] Building C object Externals/minizip/CMakeFiles/minizip.dir/unzip.c.o
  311. [  0%] Linking C static library libminizip.a
  312. [  0%] Building CXX object Externals/FreeSurround/CMakeFiles/FreeSurround.dir/source/ChannelMaps.cpp.o
  313. [  0%] Building CXX object Externals/Bochs_disasm/CMakeFiles/bdisasm.dir/dis_decode.cc.o
  314. [  0%] Building CXX object Externals/soundtouch/CMakeFiles/SoundTouch.dir/AAFilter.cpp.o
  315. [  0%] Built target cpp-optparse
  316. [  0%] Building CXX object Externals/FreeSurround/CMakeFiles/FreeSurround.dir/source/KissFFT.cpp.o
  317. [  0%] Building CXX object Externals/soundtouch/CMakeFiles/SoundTouch.dir/BPMDetect.cpp.o
  318. [  0%] Building CXX object Externals/soundtouch/CMakeFiles/SoundTouch.dir/cpu_detect_x86.cpp.o
  319. [  0%] Building CXX object Externals/FreeSurround/CMakeFiles/FreeSurround.dir/source/KissFFTR.cpp.o
  320. [  0%] Building CXX object Externals/Bochs_disasm/CMakeFiles/bdisasm.dir/dis_groups.cc.o
  321. [  0%] Building CXX object Externals/Bochs_disasm/CMakeFiles/bdisasm.dir/resolve.cc.o
  322. [  0%] Building CXX object Externals/soundtouch/CMakeFiles/SoundTouch.dir/FIFOSampleBuffer.cpp.o
  323. [  0%] Building CXX object Externals/Bochs_disasm/CMakeFiles/bdisasm.dir/syntax.cc.o
  324. [  1%] Building CXX object Externals/soundtouch/CMakeFiles/SoundTouch.dir/InterpolateCubic.cpp.o
  325. [  1%] Building CXX object Externals/soundtouch/CMakeFiles/SoundTouch.dir/FIRFilter.cpp.o
  326. [  1%] Building CXX object Externals/FreeSurround/CMakeFiles/FreeSurround.dir/source/FreeSurroundDecoder.cpp.o
  327. Scanning dependencies of target speex
  328. [  1%] Built target minizip
  329. [  1%] Building CXX object Externals/discord-rpc/src/CMakeFiles/discord-rpc.dir/discord_rpc.cpp.o
  330. [  1%] Building CXX object Externals/soundtouch/CMakeFiles/SoundTouch.dir/InterpolateLinear.cpp.o
  331. [  1%] Linking CXX static library libbdisasm.a
  332. [  1%] Building CXX object Externals/discord-rpc/src/CMakeFiles/discord-rpc.dir/rpc_connection.cpp.o
  333. [  1%] Building CXX object Externals/glslang/CMakeFiles/glslang.dir/glslang/GenericCodeGen/CodeGen.cpp.o
  334. [  1%] Building C object Externals/cubeb/CMakeFiles/speex.dir/src/speex/resample.c.o
  335. [  1%] Building CXX object Externals/soundtouch/CMakeFiles/SoundTouch.dir/InterpolateShannon.cpp.o
  336. [  1%] Building CXX object Externals/glslang/CMakeFiles/glslang.dir/glslang/GenericCodeGen/Link.cpp.o
  337. /home/mrturcot/mitch/builds/dolphin-emu-git/src/dolphin-emu/Externals/cubeb/src/speex/resample.c: In function ‘update_filter’:
  338. /home/mrturcot/mitch/builds/dolphin-emu-git/src/dolphin-emu/Externals/cubeb/src/speex/resample.c:674:20: warning: comparison of integer expressions of different signedness: ‘int’ and ‘unsigned int’ [-Wsign-compare]
  339.           for (j=0;j<st->filt_len;j++)
  340.                     ^
  341. /home/mrturcot/mitch/builds/dolphin-emu-git/src/dolphin-emu/Externals/cubeb/src/speex/resample.c: In function ‘speex_resampler_process_float’:
  342. /home/mrturcot/mitch/builds/dolphin-emu-git/src/dolphin-emu/Externals/cubeb/src/speex/resample.c:946:21: warning: comparison of integer expressions of different signedness: ‘int’ and ‘unsigned int’ [-Wsign-compare]
  343.             for(j=0;j<ichunk;++j)
  344.                      ^
  345. /home/mrturcot/mitch/builds/dolphin-emu-git/src/dolphin-emu/Externals/cubeb/src/speex/resample.c:949:20: warning: comparison of integer expressions of different signedness: ‘int’ and ‘unsigned int’ [-Wsign-compare]
  346.            for(j=0;j<ichunk;++j)
  347.                     ^
  348. /home/mrturcot/mitch/builds/dolphin-emu-git/src/dolphin-emu/Externals/cubeb/src/speex/resample.c: In function ‘speex_resampler_process_int’:
  349. /home/mrturcot/mitch/builds/dolphin-emu-git/src/dolphin-emu/Externals/cubeb/src/speex/resample.c:1002:19: warning: comparison of integer expressions of different signedness: ‘int’ and ‘unsigned int’ [-Wsign-compare]
  350.           for(j=0;j<ichunk;++j)
  351.                    ^
  352. /home/mrturcot/mitch/builds/dolphin-emu-git/src/dolphin-emu/Externals/cubeb/src/speex/resample.c:1009:19: warning: comparison of integer expressions of different signedness: ‘int’ and ‘unsigned int’ [-Wsign-compare]
  353.           for(j=0;j<ichunk;++j)
  354.                    ^
  355. /home/mrturcot/mitch/builds/dolphin-emu-git/src/dolphin-emu/Externals/cubeb/src/speex/resample.c:1019:16: warning: comparison of integer expressions of different signedness: ‘int’ and ‘unsigned int’ [-Wsign-compare]
  356.       for (j=0;j<ochunk+omagic;++j)
  357.                 ^
  358. In file included from /home/mrturcot/mitch/builds/dolphin-emu-git/src/dolphin-emu/Externals/discord-rpc/src/serialization.h:15,
  359.                  from /home/mrturcot/mitch/builds/dolphin-emu-git/src/dolphin-emu/Externals/discord-rpc/src/rpc_connection.h:4,
  360.                  from /home/mrturcot/mitch/builds/dolphin-emu-git/src/dolphin-emu/Externals/discord-rpc/src/rpc_connection.cpp:1:
  361. /home/mrturcot/mitch/builds/dolphin-emu-git/src/dolphin-emu/Externals/discord-rpc/thirdparty/include/rapidjson/document.h: In instantiation of ‘void rapidjson::GenericValue<Encoding, Allocator>::SetObjectRaw(rapidjson::GenericValue<Encoding, Allocator>::Member*, rapidjson::SizeType, Allocator&) [with Encoding = rapidjson::UTF8<>; Allocator = rapidjson::MemoryPoolAllocator<>; rapidjson::GenericValue<Encoding, Allocator>::Member = rapidjson::GenericMember<rapidjson::UTF8<>, rapidjson::MemoryPoolAllocator<> >; rapidjson::SizeType = unsigned int]’:
  362. /home/mrturcot/mitch/builds/dolphin-emu-git/src/dolphin-emu/Externals/discord-rpc/thirdparty/include/rapidjson/document.h:2363:9:   required from ‘bool rapidjson::GenericDocument<Encoding, Allocator, StackAllocator>::EndObject(rapidjson::SizeType) [with Encoding = rapidjson::UTF8<>; Allocator = rapidjson::MemoryPoolAllocator<>; StackAllocator = FixedLinearAllocator<2048>; rapidjson::SizeType = unsigned int]’
  363. /home/mrturcot/mitch/builds/dolphin-emu-git/src/dolphin-emu/Externals/discord-rpc/thirdparty/include/rapidjson/reader.h:1736:18:   required from ‘rapidjson::GenericReader<SourceEncoding, TargetEncoding, StackAllocator>::IterativeParsingState rapidjson::GenericReader<SourceEncoding, TargetEncoding, StackAllocator>::Transit(rapidjson::GenericReader<SourceEncoding, TargetEncoding, StackAllocator>::IterativeParsingState, rapidjson::GenericReader<SourceEncoding, TargetEncoding, StackAllocator>::Token, rapidjson::GenericReader<SourceEncoding, TargetEncoding, StackAllocator>::IterativeParsingState, InputStream&, Handler&) [with unsigned int parseFlags = 1; InputStream = rapidjson::GenericInsituStringStream<rapidjson::UTF8<> >; Handler = rapidjson::GenericDocument<rapidjson::UTF8<>, rapidjson::MemoryPoolAllocator<>, FixedLinearAllocator<2048> >; SourceEncoding = rapidjson::UTF8<>; TargetEncoding = rapidjson::UTF8<>; StackAllocator = FixedLinearAllocator<2048>]’
  364. /home/mrturcot/mitch/builds/dolphin-emu-git/src/dolphin-emu/Externals/discord-rpc/thirdparty/include/rapidjson/reader.h:1832:58:   required from ‘rapidjson::ParseResult rapidjson::GenericReader<SourceEncoding, TargetEncoding, StackAllocator>::IterativeParse(InputStream&, Handler&) [with unsigned int parseFlags = 1; InputStream = rapidjson::GenericInsituStringStream<rapidjson::UTF8<> >; Handler = rapidjson::GenericDocument<rapidjson::UTF8<>, rapidjson::MemoryPoolAllocator<>, FixedLinearAllocator<2048> >; SourceEncoding = rapidjson::UTF8<>; TargetEncoding = rapidjson::UTF8<>; StackAllocator = FixedLinearAllocator<2048>]’
  365. /home/mrturcot/mitch/builds/dolphin-emu-git/src/dolphin-emu/Externals/discord-rpc/thirdparty/include/rapidjson/reader.h:487:46:   required from ‘rapidjson::ParseResult rapidjson::GenericReader<SourceEncoding, TargetEncoding, StackAllocator>::Parse(InputStream&, Handler&) [with unsigned int parseFlags = 1; InputStream = rapidjson::GenericInsituStringStream<rapidjson::UTF8<> >; Handler = rapidjson::GenericDocument<rapidjson::UTF8<>, rapidjson::MemoryPoolAllocator<>, FixedLinearAllocator<2048> >; SourceEncoding = rapidjson::UTF8<>; TargetEncoding = rapidjson::UTF8<>; StackAllocator = FixedLinearAllocator<2048>]’
  366. /home/mrturcot/mitch/builds/dolphin-emu-git/src/dolphin-emu/Externals/discord-rpc/thirdparty/include/rapidjson/document.h:2159:22:   required from ‘rapidjson::GenericDocument<Encoding, Allocator, StackAllocator>& rapidjson::GenericDocument<Encoding, Allocator, StackAllocator>::ParseStream(InputStream&) [with unsigned int parseFlags = 1; SourceEncoding = rapidjson::UTF8<>; InputStream = rapidjson::GenericInsituStringStream<rapidjson::UTF8<> >; Encoding = rapidjson::UTF8<>; Allocator = rapidjson::MemoryPoolAllocator<>; StackAllocator = FixedLinearAllocator<2048>]’
  367. /home/mrturcot/mitch/builds/dolphin-emu-git/src/dolphin-emu/Externals/discord-rpc/thirdparty/include/rapidjson/document.h:2175:62:   required from ‘rapidjson::GenericDocument<Encoding, Allocator, StackAllocator>& rapidjson::GenericDocument<Encoding, Allocator, StackAllocator>::ParseStream(InputStream&) [with unsigned int parseFlags = 1; InputStream = rapidjson::GenericInsituStringStream<rapidjson::UTF8<> >; Encoding = rapidjson::UTF8<>; Allocator = rapidjson::MemoryPoolAllocator<>; StackAllocator = FixedLinearAllocator<2048>]’
  368. /home/mrturcot/mitch/builds/dolphin-emu-git/src/dolphin-emu/Externals/discord-rpc/thirdparty/include/rapidjson/document.h:2200:58:   required from ‘rapidjson::GenericDocument<Encoding, Allocator, StackAllocator>& rapidjson::GenericDocument<Encoding, Allocator, StackAllocator>::ParseInsitu(rapidjson::GenericDocument<Encoding, Allocator, StackAllocator>::Ch*) [with unsigned int parseFlags = 0; Encoding = rapidjson::UTF8<>; Allocator = rapidjson::MemoryPoolAllocator<>; StackAllocator = FixedLinearAllocator<2048>; rapidjson::GenericDocument<Encoding, Allocator, StackAllocator>::Ch = char]’
  369. /home/mrturcot/mitch/builds/dolphin-emu-git/src/dolphin-emu/Externals/discord-rpc/thirdparty/include/rapidjson/document.h:2208:47:   required from ‘rapidjson::GenericDocument<Encoding, Allocator, StackAllocator>& rapidjson::GenericDocument<Encoding, Allocator, StackAllocator>::ParseInsitu(rapidjson::GenericDocument<Encoding, Allocator, StackAllocator>::Ch*) [with Encoding = rapidjson::UTF8<>; Allocator = rapidjson::MemoryPoolAllocator<>; StackAllocator = FixedLinearAllocator<2048>; rapidjson::GenericDocument<Encoding, Allocator, StackAllocator>::Ch = char]’
  370. /home/mrturcot/mitch/builds/dolphin-emu-git/src/dolphin-emu/Externals/discord-rpc/src/rpc_connection.cpp:115:50:   required from here
  371. /home/mrturcot/mitch/builds/dolphin-emu-git/src/dolphin-emu/Externals/discord-rpc/thirdparty/include/rapidjson/document.h:1952:24: warning: ‘void* memcpy(void*, const void*, size_t)’ writing to an object of type ‘rapidjson::GenericValue<rapidjson::UTF8<> >::Member’ {aka ‘struct rapidjson::GenericMember<rapidjson::UTF8<>, rapidjson::MemoryPoolAllocator<> >’} with no trivial copy-assignment; use copy-assignment instead [-Wclass-memaccess]
  372.              std::memcpy(m, members, count * sizeof(Member));
  373.              ~~~~~~~~~~~^~~~~~~~~~~~~~~~~~~~~~~~~~~~~~~~~~~~
  374. In file included from /home/mrturcot/mitch/builds/dolphin-emu-git/src/dolphin-emu/Externals/discord-rpc/src/serialization.h:15,
  375.                  from /home/mrturcot/mitch/builds/dolphin-emu-git/src/dolphin-emu/Externals/discord-rpc/src/rpc_connection.h:4,
  376.                  from /home/mrturcot/mitch/builds/dolphin-emu-git/src/dolphin-emu/Externals/discord-rpc/src/rpc_connection.cpp:1:
  377. /home/mrturcot/mitch/builds/dolphin-emu-git/src/dolphin-emu/Externals/discord-rpc/thirdparty/include/rapidjson/document.h:71:8: note: ‘rapidjson::GenericValue<rapidjson::UTF8<> >::Member’ {aka ‘struct rapidjson::GenericMember<rapidjson::UTF8<>, rapidjson::MemoryPoolAllocator<> >’} declared here
  378.  struct GenericMember {
  379.         ^~~~~~~~~~~~~
  380. In file included from /home/mrturcot/mitch/builds/dolphin-emu-git/src/dolphin-emu/Externals/discord-rpc/src/serialization.h:15,
  381.                  from /home/mrturcot/mitch/builds/dolphin-emu-git/src/dolphin-emu/Externals/discord-rpc/src/rpc_connection.h:4,
  382.                  from /home/mrturcot/mitch/builds/dolphin-emu-git/src/dolphin-emu/Externals/discord-rpc/src/rpc_connection.cpp:1:
  383. /home/mrturcot/mitch/builds/dolphin-emu-git/src/dolphin-emu/Externals/discord-rpc/thirdparty/include/rapidjson/document.h: In instantiation of ‘void rapidjson::GenericValue<Encoding, Allocator>::SetArrayRaw(rapidjson::GenericValue<Encoding, Allocator>*, rapidjson::SizeType, Allocator&) [with Encoding = rapidjson::UTF8<>; Allocator = rapidjson::MemoryPoolAllocator<>; rapidjson::SizeType = unsigned int]’:
  384. /home/mrturcot/mitch/builds/dolphin-emu-git/src/dolphin-emu/Externals/discord-rpc/thirdparty/include/rapidjson/document.h:2371:9:   required from ‘bool rapidjson::GenericDocument<Encoding, Allocator, StackAllocator>::EndArray(rapidjson::SizeType) [with Encoding = rapidjson::UTF8<>; Allocator = rapidjson::MemoryPoolAllocator<>; StackAllocator = FixedLinearAllocator<2048>; rapidjson::SizeType = unsigned int]’
  385. /home/mrturcot/mitch/builds/dolphin-emu-git/src/dolphin-emu/Externals/discord-rpc/thirdparty/include/rapidjson/reader.h:1766:18:   required from ‘rapidjson::GenericReader<SourceEncoding, TargetEncoding, StackAllocator>::IterativeParsingState rapidjson::GenericReader<SourceEncoding, TargetEncoding, StackAllocator>::Transit(rapidjson::GenericReader<SourceEncoding, TargetEncoding, StackAllocator>::IterativeParsingState, rapidjson::GenericReader<SourceEncoding, TargetEncoding, StackAllocator>::Token, rapidjson::GenericReader<SourceEncoding, TargetEncoding, StackAllocator>::IterativeParsingState, InputStream&, Handler&) [with unsigned int parseFlags = 1; InputStream = rapidjson::GenericInsituStringStream<rapidjson::UTF8<> >; Handler = rapidjson::GenericDocument<rapidjson::UTF8<>, rapidjson::MemoryPoolAllocator<>, FixedLinearAllocator<2048> >; SourceEncoding = rapidjson::UTF8<>; TargetEncoding = rapidjson::UTF8<>; StackAllocator = FixedLinearAllocator<2048>]’
  386. /home/mrturcot/mitch/builds/dolphin-emu-git/src/dolphin-emu/Externals/discord-rpc/thirdparty/include/rapidjson/reader.h:1832:58:   required from ‘rapidjson::ParseResult rapidjson::GenericReader<SourceEncoding, TargetEncoding, StackAllocator>::IterativeParse(InputStream&, Handler&) [with unsigned int parseFlags = 1; InputStream = rapidjson::GenericInsituStringStream<rapidjson::UTF8<> >; Handler = rapidjson::GenericDocument<rapidjson::UTF8<>, rapidjson::MemoryPoolAllocator<>, FixedLinearAllocator<2048> >; SourceEncoding = rapidjson::UTF8<>; TargetEncoding = rapidjson::UTF8<>; StackAllocator = FixedLinearAllocator<2048>]’
  387. /home/mrturcot/mitch/builds/dolphin-emu-git/src/dolphin-emu/Externals/discord-rpc/thirdparty/include/rapidjson/reader.h:487:46:   required from ‘rapidjson::ParseResult rapidjson::GenericReader<SourceEncoding, TargetEncoding, StackAllocator>::Parse(InputStream&, Handler&) [with unsigned int parseFlags = 1; InputStream = rapidjson::GenericInsituStringStream<rapidjson::UTF8<> >; Handler = rapidjson::GenericDocument<rapidjson::UTF8<>, rapidjson::MemoryPoolAllocator<>, FixedLinearAllocator<2048> >; SourceEncoding = rapidjson::UTF8<>; TargetEncoding = rapidjson::UTF8<>; StackAllocator = FixedLinearAllocator<2048>]’
  388. /home/mrturcot/mitch/builds/dolphin-emu-git/src/dolphin-emu/Externals/discord-rpc/thirdparty/include/rapidjson/document.h:2159:22:   required from ‘rapidjson::GenericDocument<Encoding, Allocator, StackAllocator>& rapidjson::GenericDocument<Encoding, Allocator, StackAllocator>::ParseStream(InputStream&) [with unsigned int parseFlags = 1; SourceEncoding = rapidjson::UTF8<>; InputStream = rapidjson::GenericInsituStringStream<rapidjson::UTF8<> >; Encoding = rapidjson::UTF8<>; Allocator = rapidjson::MemoryPoolAllocator<>; StackAllocator = FixedLinearAllocator<2048>]’
  389. /home/mrturcot/mitch/builds/dolphin-emu-git/src/dolphin-emu/Externals/discord-rpc/thirdparty/include/rapidjson/document.h:2175:62:   required from ‘rapidjson::GenericDocument<Encoding, Allocator, StackAllocator>& rapidjson::GenericDocument<Encoding, Allocator, StackAllocator>::ParseStream(InputStream&) [with unsigned int parseFlags = 1; InputStream = rapidjson::GenericInsituStringStream<rapidjson::UTF8<> >; Encoding = rapidjson::UTF8<>; Allocator = rapidjson::MemoryPoolAllocator<>; StackAllocator = FixedLinearAllocator<2048>]’
  390. /home/mrturcot/mitch/builds/dolphin-emu-git/src/dolphin-emu/Externals/discord-rpc/thirdparty/include/rapidjson/document.h:2200:58:   required from ‘rapidjson::GenericDocument<Encoding, Allocator, StackAllocator>& rapidjson::GenericDocument<Encoding, Allocator, StackAllocator>::ParseInsitu(rapidjson::GenericDocument<Encoding, Allocator, StackAllocator>::Ch*) [with unsigned int parseFlags = 0; Encoding = rapidjson::UTF8<>; Allocator = rapidjson::MemoryPoolAllocator<>; StackAllocator = FixedLinearAllocator<2048>; rapidjson::GenericDocument<Encoding, Allocator, StackAllocator>::Ch = char]’
  391. /home/mrturcot/mitch/builds/dolphin-emu-git/src/dolphin-emu/Externals/discord-rpc/thirdparty/include/rapidjson/document.h:2208:47:   required from ‘rapidjson::GenericDocument<Encoding, Allocator, StackAllocator>& rapidjson::GenericDocument<Encoding, Allocator, StackAllocator>::ParseInsitu(rapidjson::GenericDocument<Encoding, Allocator, StackAllocator>::Ch*) [with Encoding = rapidjson::UTF8<>; Allocator = rapidjson::MemoryPoolAllocator<>; StackAllocator = FixedLinearAllocator<2048>; rapidjson::GenericDocument<Encoding, Allocator, StackAllocator>::Ch = char]’
  392. /home/mrturcot/mitch/builds/dolphin-emu-git/src/dolphin-emu/Externals/discord-rpc/src/rpc_connection.cpp:115:50:   required from here
  393. /home/mrturcot/mitch/builds/dolphin-emu-git/src/dolphin-emu/Externals/discord-rpc/thirdparty/include/rapidjson/document.h:1939:24: warning: ‘void* memcpy(void*, const void*, size_t)’ writing to an object of type ‘class rapidjson::GenericValue<rapidjson::UTF8<> >’ with no trivial copy-assignment; use copy-assignment or copy-initialization instead [-Wclass-memaccess]
  394.              std::memcpy(e, values, count * sizeof(GenericValue));
  395.              ~~~~~~~~~~~^~~~~~~~~~~~~~~~~~~~~~~~~~~~~~~~~~~~~~~~~
  396. /home/mrturcot/mitch/builds/dolphin-emu-git/src/dolphin-emu/Externals/discord-rpc/thirdparty/include/rapidjson/document.h:540:7: note: ‘class rapidjson::GenericValue<rapidjson::UTF8<> >’ declared here
  397.  class GenericValue {
  398.        ^~~~~~~~~~~~
  399. cc1plus: warning: unrecognized command line option ‘-Wno-global-constructors’
  400. cc1plus: warning: unrecognized command line option ‘-Wno-exit-time-destructors’
  401. cc1plus: warning: unrecognized command line option ‘-Wno-covered-switch-default’
  402. cc1plus: warning: unrecognized command line option ‘-Wno-c++98-compat-pedantic’
  403. cc1plus: warning: unrecognized command line option ‘-Wno-c++98-compat’
  404. [  1%] Building CXX object Externals/discord-rpc/src/CMakeFiles/discord-rpc.dir/serialization.cpp.o
  405. [  1%] Building CXX object Externals/soundtouch/CMakeFiles/SoundTouch.dir/mmx_optimized.cpp.o
  406. [  1%] Linking CXX static library libFreeSurround.a
  407. [  1%] Built target speex
  408. [  2%] Building CXX object Externals/discord-rpc/src/CMakeFiles/discord-rpc.dir/connection_unix.cpp.o
  409. [  2%] Built target bdisasm
  410. [  2%] Building CXX object Externals/glslang/CMakeFiles/glslang.dir/glslang/MachineIndependent/attribute.cpp.o
  411. [  2%] Building CXX object Externals/imgui/CMakeFiles/imgui.dir/imgui.cpp.o
  412. Scanning dependencies of target common
  413. Scanning dependencies of target discio
  414. [  2%] Building CXX object Externals/soundtouch/CMakeFiles/SoundTouch.dir/PeakFinder.cpp.o
  415. [  2%] Building CXX object Externals/glslang/CMakeFiles/glslang.dir/glslang/MachineIndependent/Constant.cpp.o
  416. In function ‘void ImStrncpy(char*, const char*, size_t)’,
  417.     inlined from ‘void ImStrncpy(char*, const char*, size_t)’ at /home/mrturcot/mitch/builds/dolphin-emu-git/src/dolphin-emu/Externals/imgui/imgui.cpp:1208:6,
  418.     inlined from ‘ImGuiTextFilter::ImGuiTextFilter(const char*)’ at /home/mrturcot/mitch/builds/dolphin-emu-git/src/dolphin-emu/Externals/imgui/imgui.cpp:1874:18,
  419.     inlined from ‘ImGuiTextFilter::ImGuiTextFilter(const char*)’ at /home/mrturcot/mitch/builds/dolphin-emu-git/src/dolphin-emu/Externals/imgui/imgui.cpp:1870:1:
  420. /home/mrturcot/mitch/builds/dolphin-emu-git/src/dolphin-emu/Externals/imgui/imgui.cpp:1211:12: warning: ‘char* strncpy(char*, const char*, size_t)’ specified bound 256 equals destination size [-Wstringop-truncation]
  421.      strncpy(dst, src, count);
  422.      ~~~~~~~^~~~~~~~~~~~~~~~~
  423. In function ‘void ImStrncpy(char*, const char*, size_t)’,
  424.     inlined from ‘bool ImGui::SetDragDropPayload(const char*, const void*, size_t, ImGuiCond)’ at /home/mrturcot/mitch/builds/dolphin-emu-git/src/dolphin-emu/Externals/imgui/imgui.cpp:1208:6:
  425. /home/mrturcot/mitch/builds/dolphin-emu-git/src/dolphin-emu/Externals/imgui/imgui.cpp:1211:12: warning: ‘char* strncpy(char*, const char*, size_t)’ specified bound 33 equals destination size [-Wstringop-truncation]
  426.      strncpy(dst, src, count);
  427.      ~~~~~~~^~~~~~~~~~~~~~~~~
  428. [  2%] Building CXX object Externals/imgui/CMakeFiles/imgui.dir/imgui_draw.cpp.o
  429. [  2%] Building CXX object Externals/imgui/CMakeFiles/imgui.dir/imgui_widgets.cpp.o
  430. [  2%] Building CXX object Externals/discord-rpc/src/CMakeFiles/discord-rpc.dir/discord_register_linux.cpp.o
  431. [  2%] Building CXX object Externals/soundtouch/CMakeFiles/SoundTouch.dir/RateTransposer.cpp.o
  432. [  2%] Built target FreeSurround
  433. [  2%] Building CXX object Externals/glslang/CMakeFiles/glslang.dir/glslang/MachineIndependent/glslang_tab.cpp.o
  434. Scanning dependencies of target unittests_stubhost
  435. [  2%] Building CXX object Externals/soundtouch/CMakeFiles/SoundTouch.dir/SoundTouch.cpp.o
  436. [  2%] Linking CXX static library libdiscord-rpc.a
  437. Scanning dependencies of target cubeb
  438. [  2%] Building CXX object Source/UnitTests/CMakeFiles/unittests_stubhost.dir/StubHost.cpp.o
  439. [  2%] Building C object Externals/cubeb/CMakeFiles/cubeb.dir/src/cubeb.c.o
  440. [  2%] Linking CXX static library libimgui.a
  441. [  2%] Built target unittests_stubhost
  442. [  2%] Built target discord-rpc
  443. [  2%] Building CXX object Externals/glslang/CMakeFiles/glslang.dir/glslang/MachineIndependent/InfoSink.cpp.o
  444. [  3%] Building CXX object Externals/soundtouch/CMakeFiles/SoundTouch.dir/sse_optimized.cpp.o
  445. [  3%] Building CXX object Externals/soundtouch/CMakeFiles/SoundTouch.dir/TDStretch.cpp.o
  446. [  3%] Building CXX object Externals/cubeb/CMakeFiles/cubeb.dir/src/cubeb_mixer.cpp.o
  447. [  3%] Building CXX object Externals/glslang/CMakeFiles/glslang.dir/glslang/MachineIndependent/Initialize.cpp.o
  448. [  4%] Building CXX object Externals/cubeb/CMakeFiles/cubeb.dir/src/cubeb_resampler.cpp.o
  449. [  4%] Building CXX object Externals/cubeb/CMakeFiles/cubeb.dir/src/cubeb_panner.cpp.o
  450. [  5%] Building CXX object Externals/glslang/CMakeFiles/glslang.dir/glslang/MachineIndependent/Intermediate.cpp.o
  451. [  5%] Building CXX object Externals/cubeb/CMakeFiles/cubeb.dir/src/cubeb_log.cpp.o
  452. In file included from /home/mrturcot/mitch/builds/dolphin-emu-git/src/dolphin-emu/Externals/cubeb/src/cubeb_resampler.cpp:19:
  453. /home/mrturcot/mitch/builds/dolphin-emu-git/src/dolphin-emu/Externals/cubeb/src/cubeb_resampler_internal.h: In constructor ‘processor::processor(uint32_t)’:
  454. /home/mrturcot/mitch/builds/dolphin-emu-git/src/dolphin-emu/Externals/cubeb/src/cubeb_resampler_internal.h:62:5: warning: declaration of ‘channels’ shadows a member of ‘processor’ [-Wshadow]
  455.      : channels(channels)
  456.      ^
  457. /home/mrturcot/mitch/builds/dolphin-emu-git/src/dolphin-emu/Externals/cubeb/src/cubeb_resampler_internal.h:75:18: note: shadowed declaration is here
  458.    const uint32_t channels;
  459.                   ^~~~~~~~
  460. In file included from /home/mrturcot/mitch/builds/dolphin-emu-git/src/dolphin-emu/Externals/cubeb/src/cubeb_resampler.cpp:19:
  461. /home/mrturcot/mitch/builds/dolphin-emu-git/src/dolphin-emu/Externals/cubeb/src/cubeb_resampler_internal.h: In constructor ‘cubeb_resampler_speex_one_way<T>::cubeb_resampler_speex_one_way(uint32_t, uint32_t, uint32_t, int)’:
  462. /home/mrturcot/mitch/builds/dolphin-emu-git/src/dolphin-emu/Externals/cubeb/src/cubeb_resampler_internal.h:183:3: warning: declaration of ‘source_rate’ shadows a member of ‘cubeb_resampler_speex_one_way<T>’ [-Wshadow]
  463.    : processor(channels)
  464.    ^
  465. /home/mrturcot/mitch/builds/dolphin-emu-git/src/dolphin-emu/Externals/cubeb/src/cubeb_resampler_internal.h:364:18: note: shadowed declaration is here
  466.    const uint32_t source_rate;
  467.                   ^~~~~~~~~~~
  468. /home/mrturcot/mitch/builds/dolphin-emu-git/src/dolphin-emu/Externals/cubeb/src/cubeb_resampler_internal.h:183:3: warning: declaration of ‘channels’ shadows a member of ‘cubeb_resampler_speex_one_way<T>’ [-Wshadow]
  469.    : processor(channels)
  470.    ^
  471. In file included from /home/mrturcot/mitch/builds/dolphin-emu-git/src/dolphin-emu/Externals/cubeb/src/cubeb_resampler.cpp:19:
  472. /home/mrturcot/mitch/builds/dolphin-emu-git/src/dolphin-emu/Externals/cubeb/src/cubeb_resampler_internal.h:75:18: note: shadowed declaration is here
  473.    const uint32_t channels;
  474.                   ^~~~~~~~
  475. In file included from /home/mrturcot/mitch/builds/dolphin-emu-git/src/dolphin-emu/Externals/cubeb/src/cubeb_resampler.cpp:19:
  476. /home/mrturcot/mitch/builds/dolphin-emu-git/src/dolphin-emu/Externals/cubeb/src/cubeb_resampler_internal.h: In constructor ‘delay_line<T>::delay_line(uint32_t, uint32_t, uint32_t)’:
  477. /home/mrturcot/mitch/builds/dolphin-emu-git/src/dolphin-emu/Externals/cubeb/src/cubeb_resampler_internal.h:386:5: warning: declaration of ‘sample_rate’ shadows a member of ‘delay_line<T>’ [-Wshadow]
  478.      : processor(channels)
  479.      ^
  480. /home/mrturcot/mitch/builds/dolphin-emu-git/src/dolphin-emu/Externals/cubeb/src/cubeb_resampler_internal.h:499:12: note: shadowed declaration is here
  481.    uint32_t sample_rate;
  482.             ^~~~~~~~~~~
  483. /home/mrturcot/mitch/builds/dolphin-emu-git/src/dolphin-emu/Externals/cubeb/src/cubeb_resampler_internal.h:386:5: warning: declaration of ‘channels’ shadows a member of ‘delay_line<T>’ [-Wshadow]
  484.      : processor(channels)
  485.      ^
  486. In file included from /home/mrturcot/mitch/builds/dolphin-emu-git/src/dolphin-emu/Externals/cubeb/src/cubeb_resampler.cpp:19:
  487. /home/mrturcot/mitch/builds/dolphin-emu-git/src/dolphin-emu/Externals/cubeb/src/cubeb_resampler_internal.h:75:18: note: shadowed declaration is here
  488.    const uint32_t channels;
  489.                   ^~~~~~~~
  490. /home/mrturcot/mitch/builds/dolphin-emu-git/src/dolphin-emu/Externals/cubeb/src/cubeb_resampler.cpp: In constructor ‘passthrough_resampler<T>::passthrough_resampler(cubeb_stream*, cubeb_data_callback, void*, uint32_t, uint32_t)’:
  491. /home/mrturcot/mitch/builds/dolphin-emu-git/src/dolphin-emu/Externals/cubeb/src/cubeb_resampler.cpp:48:69: warning: declaration of ‘sample_rate’ shadows a member of ‘passthrough_resampler<T>’ [-Wshadow]
  492.                                                  uint32_t sample_rate)
  493.                                                                      ^
  494. In file included from /home/mrturcot/mitch/builds/dolphin-emu-git/src/dolphin-emu/Externals/cubeb/src/cubeb_resampler.cpp:19:
  495. /home/mrturcot/mitch/builds/dolphin-emu-git/src/dolphin-emu/Externals/cubeb/src/cubeb_resampler_internal.h:112:12: note: shadowed declaration is here
  496.    uint32_t sample_rate;
  497.             ^~~~~~~~~~~
  498. /home/mrturcot/mitch/builds/dolphin-emu-git/src/dolphin-emu/Externals/cubeb/src/cubeb_resampler.cpp: In constructor ‘cubeb_resampler_speex<T, InputProcessing, OutputProcessing>::cubeb_resampler_speex(InputProcessor*, OutputProcessor*, cubeb_stream*, cubeb_data_callback, void*)’:
  499. /home/mrturcot/mitch/builds/dolphin-emu-git/src/dolphin-emu/Externals/cubeb/src/cubeb_resampler.cpp:95:37: warning: declaration of ‘output_processor’ shadows a member of ‘cubeb_resampler_speex<T, InputProcessing, OutputProcessing>’ [-Wshadow]
  500.                            void * ptr)
  501.                                      ^
  502. In file included from /home/mrturcot/mitch/builds/dolphin-emu-git/src/dolphin-emu/Externals/cubeb/src/cubeb_resampler.cpp:19:
  503. /home/mrturcot/mitch/builds/dolphin-emu-git/src/dolphin-emu/Externals/cubeb/src/cubeb_resampler_internal.h:155:37: note: shadowed declaration is here
  504.    std::unique_ptr<OutputProcessing> output_processor;
  505.                                      ^~~~~~~~~~~~~~~~
  506. /home/mrturcot/mitch/builds/dolphin-emu-git/src/dolphin-emu/Externals/cubeb/src/cubeb_resampler.cpp:95:37: warning: declaration of ‘input_processor’ shadows a member of ‘cubeb_resampler_speex<T, InputProcessing, OutputProcessing>’ [-Wshadow]
  507.                            void * ptr)
  508.                                      ^
  509. In file included from /home/mrturcot/mitch/builds/dolphin-emu-git/src/dolphin-emu/Externals/cubeb/src/cubeb_resampler.cpp:19:
  510. /home/mrturcot/mitch/builds/dolphin-emu-git/src/dolphin-emu/Externals/cubeb/src/cubeb_resampler_internal.h:154:36: note: shadowed declaration is here
  511.    std::unique_ptr<InputProcessing> input_processor;
  512.                                     ^~~~~~~~~~~~~~~
  513. /home/mrturcot/mitch/builds/dolphin-emu-git/src/dolphin-emu/Externals/cubeb/src/cubeb_resampler.cpp: In instantiation of ‘passthrough_resampler<T>::passthrough_resampler(cubeb_stream*, cubeb_data_callback, void*, uint32_t, uint32_t) [with T = short int; cubeb_stream = cubeb_stream; cubeb_data_callback = long int (*)(cubeb_stream*, void*, const void*, void*, long int); uint32_t = unsigned int]’:
  514. /home/mrturcot/mitch/builds/dolphin-emu-git/src/dolphin-emu/Externals/cubeb/src/cubeb_resampler_internal.h:528:12:   required from ‘cubeb_resampler* cubeb_resampler_create_internal(cubeb_stream*, cubeb_stream_params*, cubeb_stream_params*, unsigned int, cubeb_data_callback, void*, cubeb_resampler_quality) [with T = short int; cubeb_resampler = cubeb_resampler; cubeb_stream = cubeb_stream; cubeb_data_callback = long int (*)(cubeb_stream*, void*, const void*, void*, long int)]’
  515. /home/mrturcot/mitch/builds/dolphin-emu-git/src/dolphin-emu/Externals/cubeb/src/cubeb_resampler.cpp:293:60:   required from here
  516. /home/mrturcot/mitch/builds/dolphin-emu-git/src/dolphin-emu/Externals/cubeb/src/cubeb_resampler.cpp:44:1: warning: declaration of ‘sample_rate’ shadows a member of ‘passthrough_resampler<short int>’ [-Wshadow]
  517.  passthrough_resampler<T>::passthrough_resampler(cubeb_stream * s,
  518.  ^~~~~~~~~~~~~~~~~~~~~~~~
  519. In file included from /home/mrturcot/mitch/builds/dolphin-emu-git/src/dolphin-emu/Externals/cubeb/src/cubeb_resampler.cpp:19:
  520. /home/mrturcot/mitch/builds/dolphin-emu-git/src/dolphin-emu/Externals/cubeb/src/cubeb_resampler_internal.h:112:12: note: shadowed declaration is here
  521.    uint32_t sample_rate;
  522.             ^~~~~~~~~~~
  523. In file included from /home/mrturcot/mitch/builds/dolphin-emu-git/src/dolphin-emu/Externals/cubeb/src/cubeb_resampler.cpp:19:
  524. /home/mrturcot/mitch/builds/dolphin-emu-git/src/dolphin-emu/Externals/cubeb/src/cubeb_resampler_internal.h: In instantiation of ‘cubeb_resampler_speex_one_way<T>::cubeb_resampler_speex_one_way(uint32_t, uint32_t, uint32_t, int) [with T = short int; uint32_t = unsigned int]’:
  525. /home/mrturcot/mitch/builds/dolphin-emu-git/src/dolphin-emu/Externals/cubeb/src/cubeb_resampler_internal.h:538:9:   required from ‘cubeb_resampler* cubeb_resampler_create_internal(cubeb_stream*, cubeb_stream_params*, cubeb_stream_params*, unsigned int, cubeb_data_callback, void*, cubeb_resampler_quality) [with T = short int; cubeb_resampler = cubeb_resampler; cubeb_stream = cubeb_stream; cubeb_data_callback = long int (*)(cubeb_stream*, void*, const void*, void*, long int)]’
  526. /home/mrturcot/mitch/builds/dolphin-emu-git/src/dolphin-emu/Externals/cubeb/src/cubeb_resampler.cpp:293:60:   required from here
  527. /home/mrturcot/mitch/builds/dolphin-emu-git/src/dolphin-emu/Externals/cubeb/src/cubeb_resampler_internal.h:179:3: warning: declaration of ‘source_rate’ shadows a member of ‘cubeb_resampler_speex_one_way<short int>’ [-Wshadow]
  528.    cubeb_resampler_speex_one_way(uint32_t channels,
  529.    ^~~~~~~~~~~~~~~~~~~~~~~~~~~~~
  530. /home/mrturcot/mitch/builds/dolphin-emu-git/src/dolphin-emu/Externals/cubeb/src/cubeb_resampler_internal.h:364:18: note: shadowed declaration is here
  531.    const uint32_t source_rate;
  532.                   ^~~~~~~~~~~
  533. /home/mrturcot/mitch/builds/dolphin-emu-git/src/dolphin-emu/Externals/cubeb/src/cubeb_resampler_internal.h:179:3: warning: declaration of ‘channels’ shadows a member of ‘cubeb_resampler_speex_one_way<short int>’ [-Wshadow]
  534.    cubeb_resampler_speex_one_way(uint32_t channels,
  535.    ^~~~~~~~~~~~~~~~~~~~~~~~~~~~~
  536. In file included from /home/mrturcot/mitch/builds/dolphin-emu-git/src/dolphin-emu/Externals/cubeb/src/cubeb_resampler.cpp:19:
  537. /home/mrturcot/mitch/builds/dolphin-emu-git/src/dolphin-emu/Externals/cubeb/src/cubeb_resampler_internal.h:75:18: note: shadowed declaration is here
  538.    const uint32_t channels;
  539.                   ^~~~~~~~
  540. In file included from /home/mrturcot/mitch/builds/dolphin-emu-git/src/dolphin-emu/Externals/cubeb/src/cubeb_resampler.cpp:19:
  541. /home/mrturcot/mitch/builds/dolphin-emu-git/src/dolphin-emu/Externals/cubeb/src/cubeb_resampler_internal.h: In instantiation of ‘delay_line<T>::delay_line(uint32_t, uint32_t, uint32_t) [with T = short int; uint32_t = unsigned int]’:
  542. /home/mrturcot/mitch/builds/dolphin-emu-git/src/dolphin-emu/Externals/cubeb/src/cubeb_resampler_internal.h:562:24:   required from ‘cubeb_resampler* cubeb_resampler_create_internal(cubeb_stream*, cubeb_stream_params*, cubeb_stream_params*, unsigned int, cubeb_data_callback, void*, cubeb_resampler_quality) [with T = short int; cubeb_resampler = cubeb_resampler; cubeb_stream = cubeb_stream; cubeb_data_callback = long int (*)(cubeb_stream*, void*, const void*, void*, long int)]’
  543. /home/mrturcot/mitch/builds/dolphin-emu-git/src/dolphin-emu/Externals/cubeb/src/cubeb_resampler.cpp:293:60:   required from here
  544. /home/mrturcot/mitch/builds/dolphin-emu-git/src/dolphin-emu/Externals/cubeb/src/cubeb_resampler_internal.h:385:3: warning: declaration of ‘sample_rate’ shadows a member of ‘delay_line<short int>’ [-Wshadow]
  545.    delay_line(uint32_t frames, uint32_t channels, uint32_t sample_rate)
  546.    ^~~~~~~~~~
  547. /home/mrturcot/mitch/builds/dolphin-emu-git/src/dolphin-emu/Externals/cubeb/src/cubeb_resampler_internal.h:499:12: note: shadowed declaration is here
  548.    uint32_t sample_rate;
  549.             ^~~~~~~~~~~
  550. /home/mrturcot/mitch/builds/dolphin-emu-git/src/dolphin-emu/Externals/cubeb/src/cubeb_resampler_internal.h:385:3: warning: declaration of ‘channels’ shadows a member of ‘delay_line<short int>’ [-Wshadow]
  551.    delay_line(uint32_t frames, uint32_t channels, uint32_t sample_rate)
  552.    ^~~~~~~~~~
  553. In file included from /home/mrturcot/mitch/builds/dolphin-emu-git/src/dolphin-emu/Externals/cubeb/src/cubeb_resampler.cpp:19:
  554. /home/mrturcot/mitch/builds/dolphin-emu-git/src/dolphin-emu/Externals/cubeb/src/cubeb_resampler_internal.h:75:18: note: shadowed declaration is here
  555.    const uint32_t channels;
  556.                   ^~~~~~~~
  557. /home/mrturcot/mitch/builds/dolphin-emu-git/src/dolphin-emu/Externals/cubeb/src/cubeb_resampler.cpp: In instantiation of ‘cubeb_resampler_speex<T, InputProcessing, OutputProcessing>::cubeb_resampler_speex(InputProcessor*, OutputProcessor*, cubeb_stream*, cubeb_data_callback, void*) [with T = short int; InputProcessing = cubeb_resampler_speex_one_way<short int>; OutputProcessing = cubeb_resampler_speex_one_way<short int>; cubeb_stream = cubeb_stream; cubeb_data_callback = long int (*)(cubeb_stream*, void*, const void*, void*, long int)]’:
  558. /home/mrturcot/mitch/builds/dolphin-emu-git/src/dolphin-emu/Externals/cubeb/src/cubeb_resampler_internal.h:578:12:   required from ‘cubeb_resampler* cubeb_resampler_create_internal(cubeb_stream*, cubeb_stream_params*, cubeb_stream_params*, unsigned int, cubeb_data_callback, void*, cubeb_resampler_quality) [with T = short int; cubeb_resampler = cubeb_resampler; cubeb_stream = cubeb_stream; cubeb_data_callback = long int (*)(cubeb_stream*, void*, const void*, void*, long int)]’
  559. /home/mrturcot/mitch/builds/dolphin-emu-git/src/dolphin-emu/Externals/cubeb/src/cubeb_resampler.cpp:293:60:   required from here
  560. /home/mrturcot/mitch/builds/dolphin-emu-git/src/dolphin-emu/Externals/cubeb/src/cubeb_resampler.cpp:90:1: warning: declaration of ‘output_processor’ shadows a member of ‘cubeb_resampler_speex<short int, cubeb_resampler_speex_one_way<short int>, cubeb_resampler_speex_one_way<short int> >’ [-Wshadow]
  561.  cubeb_resampler_speex<T, InputProcessor, OutputProcessor>
  562.  ^~~~~~~~~~~~~~~~~~~~~~~~~~~~~~~~~~~~~~~~~~~~~~~~~~~~~~~~~
  563. In file included from /home/mrturcot/mitch/builds/dolphin-emu-git/src/dolphin-emu/Externals/cubeb/src/cubeb_resampler.cpp:19:
  564. /home/mrturcot/mitch/builds/dolphin-emu-git/src/dolphin-emu/Externals/cubeb/src/cubeb_resampler_internal.h:155:37: note: shadowed declaration is here
  565.    std::unique_ptr<OutputProcessing> output_processor;
  566.                                      ^~~~~~~~~~~~~~~~
  567. /home/mrturcot/mitch/builds/dolphin-emu-git/src/dolphin-emu/Externals/cubeb/src/cubeb_resampler.cpp:90:1: warning: declaration of ‘input_processor’ shadows a member of ‘cubeb_resampler_speex<short int, cubeb_resampler_speex_one_way<short int>, cubeb_resampler_speex_one_way<short int> >’ [-Wshadow]
  568.  cubeb_resampler_speex<T, InputProcessor, OutputProcessor>
  569.  ^~~~~~~~~~~~~~~~~~~~~~~~~~~~~~~~~~~~~~~~~~~~~~~~~~~~~~~~~
  570. In file included from /home/mrturcot/mitch/builds/dolphin-emu-git/src/dolphin-emu/Externals/cubeb/src/cubeb_resampler.cpp:19:
  571. /home/mrturcot/mitch/builds/dolphin-emu-git/src/dolphin-emu/Externals/cubeb/src/cubeb_resampler_internal.h:154:36: note: shadowed declaration is here
  572.    std::unique_ptr<InputProcessing> input_processor;
  573.                                     ^~~~~~~~~~~~~~~
  574. /home/mrturcot/mitch/builds/dolphin-emu-git/src/dolphin-emu/Externals/cubeb/src/cubeb_resampler.cpp: In instantiation of ‘cubeb_resampler_speex<T, InputProcessing, OutputProcessing>::cubeb_resampler_speex(InputProcessor*, OutputProcessor*, cubeb_stream*, cubeb_data_callback, void*) [with T = short int; InputProcessing = cubeb_resampler_speex_one_way<short int>; OutputProcessing = delay_line<short int>; cubeb_stream = cubeb_stream; cubeb_data_callback = long int (*)(cubeb_stream*, void*, const void*, void*, long int)]’:
  575. /home/mrturcot/mitch/builds/dolphin-emu-git/src/dolphin-emu/Externals/cubeb/src/cubeb_resampler_internal.h:585:12:   required from ‘cubeb_resampler* cubeb_resampler_create_internal(cubeb_stream*, cubeb_stream_params*, cubeb_stream_params*, unsigned int, cubeb_data_callback, void*, cubeb_resampler_quality) [with T = short int; cubeb_resampler = cubeb_resampler; cubeb_stream = cubeb_stream; cubeb_data_callback = long int (*)(cubeb_stream*, void*, const void*, void*, long int)]’
  576. /home/mrturcot/mitch/builds/dolphin-emu-git/src/dolphin-emu/Externals/cubeb/src/cubeb_resampler.cpp:293:60:   required from here
  577. /home/mrturcot/mitch/builds/dolphin-emu-git/src/dolphin-emu/Externals/cubeb/src/cubeb_resampler.cpp:90:1: warning: declaration of ‘output_processor’ shadows a member of ‘cubeb_resampler_speex<short int, cubeb_resampler_speex_one_way<short int>, delay_line<short int> >’ [-Wshadow]
  578.  cubeb_resampler_speex<T, InputProcessor, OutputProcessor>
  579.  ^~~~~~~~~~~~~~~~~~~~~~~~~~~~~~~~~~~~~~~~~~~~~~~~~~~~~~~~~
  580. In file included from /home/mrturcot/mitch/builds/dolphin-emu-git/src/dolphin-emu/Externals/cubeb/src/cubeb_resampler.cpp:19:
  581. /home/mrturcot/mitch/builds/dolphin-emu-git/src/dolphin-emu/Externals/cubeb/src/cubeb_resampler_internal.h:155:37: note: shadowed declaration is here
  582.    std::unique_ptr<OutputProcessing> output_processor;
  583.                                      ^~~~~~~~~~~~~~~~
  584. /home/mrturcot/mitch/builds/dolphin-emu-git/src/dolphin-emu/Externals/cubeb/src/cubeb_resampler.cpp:90:1: warning: declaration of ‘input_processor’ shadows a member of ‘cubeb_resampler_speex<short int, cubeb_resampler_speex_one_way<short int>, delay_line<short int> >’ [-Wshadow]
  585.  cubeb_resampler_speex<T, InputProcessor, OutputProcessor>
  586.  ^~~~~~~~~~~~~~~~~~~~~~~~~~~~~~~~~~~~~~~~~~~~~~~~~~~~~~~~~
  587. In file included from /home/mrturcot/mitch/builds/dolphin-emu-git/src/dolphin-emu/Externals/cubeb/src/cubeb_resampler.cpp:19:
  588. /home/mrturcot/mitch/builds/dolphin-emu-git/src/dolphin-emu/Externals/cubeb/src/cubeb_resampler_internal.h:154:36: note: shadowed declaration is here
  589.    std::unique_ptr<InputProcessing> input_processor;
  590.                                     ^~~~~~~~~~~~~~~
  591. /home/mrturcot/mitch/builds/dolphin-emu-git/src/dolphin-emu/Externals/cubeb/src/cubeb_resampler.cpp: In instantiation of ‘cubeb_resampler_speex<T, InputProcessing, OutputProcessing>::cubeb_resampler_speex(InputProcessor*, OutputProcessor*, cubeb_stream*, cubeb_data_callback, void*) [with T = short int; InputProcessing = delay_line<short int>; OutputProcessing = cubeb_resampler_speex_one_way<short int>; cubeb_stream = cubeb_stream; cubeb_data_callback = long int (*)(cubeb_stream*, void*, const void*, void*, long int)]’:
  592. /home/mrturcot/mitch/builds/dolphin-emu-git/src/dolphin-emu/Externals/cubeb/src/cubeb_resampler_internal.h:592:12:   required from ‘cubeb_resampler* cubeb_resampler_create_internal(cubeb_stream*, cubeb_stream_params*, cubeb_stream_params*, unsigned int, cubeb_data_callback, void*, cubeb_resampler_quality) [with T = short int; cubeb_resampler = cubeb_resampler; cubeb_stream = cubeb_stream; cubeb_data_callback = long int (*)(cubeb_stream*, void*, const void*, void*, long int)]’
  593. /home/mrturcot/mitch/builds/dolphin-emu-git/src/dolphin-emu/Externals/cubeb/src/cubeb_resampler.cpp:293:60:   required from here
  594. /home/mrturcot/mitch/builds/dolphin-emu-git/src/dolphin-emu/Externals/cubeb/src/cubeb_resampler.cpp:90:1: warning: declaration of ‘output_processor’ shadows a member of ‘cubeb_resampler_speex<short int, delay_line<short int>, cubeb_resampler_speex_one_way<short int> >’ [-Wshadow]
  595.  cubeb_resampler_speex<T, InputProcessor, OutputProcessor>
  596.  ^~~~~~~~~~~~~~~~~~~~~~~~~~~~~~~~~~~~~~~~~~~~~~~~~~~~~~~~~
  597. In file included from /home/mrturcot/mitch/builds/dolphin-emu-git/src/dolphin-emu/Externals/cubeb/src/cubeb_resampler.cpp:19:
  598. /home/mrturcot/mitch/builds/dolphin-emu-git/src/dolphin-emu/Externals/cubeb/src/cubeb_resampler_internal.h:155:37: note: shadowed declaration is here
  599.    std::unique_ptr<OutputProcessing> output_processor;
  600.                                      ^~~~~~~~~~~~~~~~
  601. /home/mrturcot/mitch/builds/dolphin-emu-git/src/dolphin-emu/Externals/cubeb/src/cubeb_resampler.cpp:90:1: warning: declaration of ‘input_processor’ shadows a member of ‘cubeb_resampler_speex<short int, delay_line<short int>, cubeb_resampler_speex_one_way<short int> >’ [-Wshadow]
  602.  cubeb_resampler_speex<T, InputProcessor, OutputProcessor>
  603.  ^~~~~~~~~~~~~~~~~~~~~~~~~~~~~~~~~~~~~~~~~~~~~~~~~~~~~~~~~
  604. In file included from /home/mrturcot/mitch/builds/dolphin-emu-git/src/dolphin-emu/Externals/cubeb/src/cubeb_resampler.cpp:19:
  605. /home/mrturcot/mitch/builds/dolphin-emu-git/src/dolphin-emu/Externals/cubeb/src/cubeb_resampler_internal.h:154:36: note: shadowed declaration is here
  606.    std::unique_ptr<InputProcessing> input_processor;
  607.                                     ^~~~~~~~~~~~~~~
  608. /home/mrturcot/mitch/builds/dolphin-emu-git/src/dolphin-emu/Externals/cubeb/src/cubeb_resampler.cpp: In instantiation of ‘passthrough_resampler<T>::passthrough_resampler(cubeb_stream*, cubeb_data_callback, void*, uint32_t, uint32_t) [with T = float; cubeb_stream = cubeb_stream; cubeb_data_callback = long int (*)(cubeb_stream*, void*, const void*, void*, long int); uint32_t = unsigned int]’:
  609. /home/mrturcot/mitch/builds/dolphin-emu-git/src/dolphin-emu/Externals/cubeb/src/cubeb_resampler_internal.h:528:12:   required from ‘cubeb_resampler* cubeb_resampler_create_internal(cubeb_stream*, cubeb_stream_params*, cubeb_stream_params*, unsigned int, cubeb_data_callback, void*, cubeb_resampler_quality) [with T = float; cubeb_resampler = cubeb_resampler; cubeb_stream = cubeb_stream; cubeb_data_callback = long int (*)(cubeb_stream*, void*, const void*, void*, long int)]’
  610. /home/mrturcot/mitch/builds/dolphin-emu-git/src/dolphin-emu/Externals/cubeb/src/cubeb_resampler.cpp:301:60:   required from here
  611. /home/mrturcot/mitch/builds/dolphin-emu-git/src/dolphin-emu/Externals/cubeb/src/cubeb_resampler.cpp:44:1: warning: declaration of ‘sample_rate’ shadows a member of ‘passthrough_resampler<float>’ [-Wshadow]
  612.  passthrough_resampler<T>::passthrough_resampler(cubeb_stream * s,
  613.  ^~~~~~~~~~~~~~~~~~~~~~~~
  614. In file included from /home/mrturcot/mitch/builds/dolphin-emu-git/src/dolphin-emu/Externals/cubeb/src/cubeb_resampler.cpp:19:
  615. /home/mrturcot/mitch/builds/dolphin-emu-git/src/dolphin-emu/Externals/cubeb/src/cubeb_resampler_internal.h:112:12: note: shadowed declaration is here
  616.    uint32_t sample_rate;
  617.             ^~~~~~~~~~~
  618. In file included from /home/mrturcot/mitch/builds/dolphin-emu-git/src/dolphin-emu/Externals/cubeb/src/cubeb_resampler.cpp:19:
  619. /home/mrturcot/mitch/builds/dolphin-emu-git/src/dolphin-emu/Externals/cubeb/src/cubeb_resampler_internal.h: In instantiation of ‘cubeb_resampler_speex_one_way<T>::cubeb_resampler_speex_one_way(uint32_t, uint32_t, uint32_t, int) [with T = float; uint32_t = unsigned int]’:
  620. /home/mrturcot/mitch/builds/dolphin-emu-git/src/dolphin-emu/Externals/cubeb/src/cubeb_resampler_internal.h:538:9:   required from ‘cubeb_resampler* cubeb_resampler_create_internal(cubeb_stream*, cubeb_stream_params*, cubeb_stream_params*, unsigned int, cubeb_data_callback, void*, cubeb_resampler_quality) [with T = float; cubeb_resampler = cubeb_resampler; cubeb_stream = cubeb_stream; cubeb_data_callback = long int (*)(cubeb_stream*, void*, const void*, void*, long int)]’
  621. /home/mrturcot/mitch/builds/dolphin-emu-git/src/dolphin-emu/Externals/cubeb/src/cubeb_resampler.cpp:301:60:   required from here
  622. /home/mrturcot/mitch/builds/dolphin-emu-git/src/dolphin-emu/Externals/cubeb/src/cubeb_resampler_internal.h:179:3: warning: declaration of ‘source_rate’ shadows a member of ‘cubeb_resampler_speex_one_way<float>’ [-Wshadow]
  623.    cubeb_resampler_speex_one_way(uint32_t channels,
  624.    ^~~~~~~~~~~~~~~~~~~~~~~~~~~~~
  625. /home/mrturcot/mitch/builds/dolphin-emu-git/src/dolphin-emu/Externals/cubeb/src/cubeb_resampler_internal.h:364:18: note: shadowed declaration is here
  626.    const uint32_t source_rate;
  627.                   ^~~~~~~~~~~
  628. /home/mrturcot/mitch/builds/dolphin-emu-git/src/dolphin-emu/Externals/cubeb/src/cubeb_resampler_internal.h:179:3: warning: declaration of ‘channels’ shadows a member of ‘cubeb_resampler_speex_one_way<float>’ [-Wshadow]
  629.    cubeb_resampler_speex_one_way(uint32_t channels,
  630.    ^~~~~~~~~~~~~~~~~~~~~~~~~~~~~
  631. In file included from /home/mrturcot/mitch/builds/dolphin-emu-git/src/dolphin-emu/Externals/cubeb/src/cubeb_resampler.cpp:19:
  632. /home/mrturcot/mitch/builds/dolphin-emu-git/src/dolphin-emu/Externals/cubeb/src/cubeb_resampler_internal.h:75:18: note: shadowed declaration is here
  633.    const uint32_t channels;
  634.                   ^~~~~~~~
  635. In file included from /home/mrturcot/mitch/builds/dolphin-emu-git/src/dolphin-emu/Externals/cubeb/src/cubeb_resampler.cpp:19:
  636. /home/mrturcot/mitch/builds/dolphin-emu-git/src/dolphin-emu/Externals/cubeb/src/cubeb_resampler_internal.h: In instantiation of ‘delay_line<T>::delay_line(uint32_t, uint32_t, uint32_t) [with T = float; uint32_t = unsigned int]’:
  637. /home/mrturcot/mitch/builds/dolphin-emu-git/src/dolphin-emu/Externals/cubeb/src/cubeb_resampler_internal.h:562:24:   required from ‘cubeb_resampler* cubeb_resampler_create_internal(cubeb_stream*, cubeb_stream_params*, cubeb_stream_params*, unsigned int, cubeb_data_callback, void*, cubeb_resampler_quality) [with T = float; cubeb_resampler = cubeb_resampler; cubeb_stream = cubeb_stream; cubeb_data_callback = long int (*)(cubeb_stream*, void*, const void*, void*, long int)]’
  638. /home/mrturcot/mitch/builds/dolphin-emu-git/src/dolphin-emu/Externals/cubeb/src/cubeb_resampler.cpp:301:60:   required from here
  639. /home/mrturcot/mitch/builds/dolphin-emu-git/src/dolphin-emu/Externals/cubeb/src/cubeb_resampler_internal.h:385:3: warning: declaration of ‘sample_rate’ shadows a member of ‘delay_line<float>’ [-Wshadow]
  640.    delay_line(uint32_t frames, uint32_t channels, uint32_t sample_rate)
  641.    ^~~~~~~~~~
  642. /home/mrturcot/mitch/builds/dolphin-emu-git/src/dolphin-emu/Externals/cubeb/src/cubeb_resampler_internal.h:499:12: note: shadowed declaration is here
  643.    uint32_t sample_rate;
  644.             ^~~~~~~~~~~
  645. /home/mrturcot/mitch/builds/dolphin-emu-git/src/dolphin-emu/Externals/cubeb/src/cubeb_resampler_internal.h:385:3: warning: declaration of ‘channels’ shadows a member of ‘delay_line<float>’ [-Wshadow]
  646.    delay_line(uint32_t frames, uint32_t channels, uint32_t sample_rate)
  647.    ^~~~~~~~~~
  648. In file included from /home/mrturcot/mitch/builds/dolphin-emu-git/src/dolphin-emu/Externals/cubeb/src/cubeb_resampler.cpp:19:
  649. /home/mrturcot/mitch/builds/dolphin-emu-git/src/dolphin-emu/Externals/cubeb/src/cubeb_resampler_internal.h:75:18: note: shadowed declaration is here
  650.    const uint32_t channels;
  651.                   ^~~~~~~~
  652. /home/mrturcot/mitch/builds/dolphin-emu-git/src/dolphin-emu/Externals/cubeb/src/cubeb_resampler.cpp: In instantiation of ‘cubeb_resampler_speex<T, InputProcessing, OutputProcessing>::cubeb_resampler_speex(InputProcessor*, OutputProcessor*, cubeb_stream*, cubeb_data_callback, void*) [with T = float; InputProcessing = cubeb_resampler_speex_one_way<float>; OutputProcessing = cubeb_resampler_speex_one_way<float>; cubeb_stream = cubeb_stream; cubeb_data_callback = long int (*)(cubeb_stream*, void*, const void*, void*, long int)]’:
  653. /home/mrturcot/mitch/builds/dolphin-emu-git/src/dolphin-emu/Externals/cubeb/src/cubeb_resampler_internal.h:578:12:   required from ‘cubeb_resampler* cubeb_resampler_create_internal(cubeb_stream*, cubeb_stream_params*, cubeb_stream_params*, unsigned int, cubeb_data_callback, void*, cubeb_resampler_quality) [with T = float; cubeb_resampler = cubeb_resampler; cubeb_stream = cubeb_stream; cubeb_data_callback = long int (*)(cubeb_stream*, void*, const void*, void*, long int)]’
  654. /home/mrturcot/mitch/builds/dolphin-emu-git/src/dolphin-emu/Externals/cubeb/src/cubeb_resampler.cpp:301:60:   required from here
  655. /home/mrturcot/mitch/builds/dolphin-emu-git/src/dolphin-emu/Externals/cubeb/src/cubeb_resampler.cpp:90:1: warning: declaration of ‘output_processor’ shadows a member of ‘cubeb_resampler_speex<float, cubeb_resampler_speex_one_way<float>, cubeb_resampler_speex_one_way<float> >’ [-Wshadow]
  656.  cubeb_resampler_speex<T, InputProcessor, OutputProcessor>
  657.  ^~~~~~~~~~~~~~~~~~~~~~~~~~~~~~~~~~~~~~~~~~~~~~~~~~~~~~~~~
  658. In file included from /home/mrturcot/mitch/builds/dolphin-emu-git/src/dolphin-emu/Externals/cubeb/src/cubeb_resampler.cpp:19:
  659. /home/mrturcot/mitch/builds/dolphin-emu-git/src/dolphin-emu/Externals/cubeb/src/cubeb_resampler_internal.h:155:37: note: shadowed declaration is here
  660.    std::unique_ptr<OutputProcessing> output_processor;
  661.                                      ^~~~~~~~~~~~~~~~
  662. /home/mrturcot/mitch/builds/dolphin-emu-git/src/dolphin-emu/Externals/cubeb/src/cubeb_resampler.cpp:90:1: warning: declaration of ‘input_processor’ shadows a member of ‘cubeb_resampler_speex<float, cubeb_resampler_speex_one_way<float>, cubeb_resampler_speex_one_way<float> >’ [-Wshadow]
  663.  cubeb_resampler_speex<T, InputProcessor, OutputProcessor>
  664.  ^~~~~~~~~~~~~~~~~~~~~~~~~~~~~~~~~~~~~~~~~~~~~~~~~~~~~~~~~
  665. In file included from /home/mrturcot/mitch/builds/dolphin-emu-git/src/dolphin-emu/Externals/cubeb/src/cubeb_resampler.cpp:19:
  666. /home/mrturcot/mitch/builds/dolphin-emu-git/src/dolphin-emu/Externals/cubeb/src/cubeb_resampler_internal.h:154:36: note: shadowed declaration is here
  667.    std::unique_ptr<InputProcessing> input_processor;
  668.                                     ^~~~~~~~~~~~~~~
  669. /home/mrturcot/mitch/builds/dolphin-emu-git/src/dolphin-emu/Externals/cubeb/src/cubeb_resampler.cpp: In instantiation of ‘cubeb_resampler_speex<T, InputProcessing, OutputProcessing>::cubeb_resampler_speex(InputProcessor*, OutputProcessor*, cubeb_stream*, cubeb_data_callback, void*) [with T = float; InputProcessing = cubeb_resampler_speex_one_way<float>; OutputProcessing = delay_line<float>; cubeb_stream = cubeb_stream; cubeb_data_callback = long int (*)(cubeb_stream*, void*, const void*, void*, long int)]’:
  670. /home/mrturcot/mitch/builds/dolphin-emu-git/src/dolphin-emu/Externals/cubeb/src/cubeb_resampler_internal.h:585:12:   required from ‘cubeb_resampler* cubeb_resampler_create_internal(cubeb_stream*, cubeb_stream_params*, cubeb_stream_params*, unsigned int, cubeb_data_callback, void*, cubeb_resampler_quality) [with T = float; cubeb_resampler = cubeb_resampler; cubeb_stream = cubeb_stream; cubeb_data_callback = long int (*)(cubeb_stream*, void*, const void*, void*, long int)]’
  671. /home/mrturcot/mitch/builds/dolphin-emu-git/src/dolphin-emu/Externals/cubeb/src/cubeb_resampler.cpp:301:60:   required from here
  672. /home/mrturcot/mitch/builds/dolphin-emu-git/src/dolphin-emu/Externals/cubeb/src/cubeb_resampler.cpp:90:1: warning: declaration of ‘output_processor’ shadows a member of ‘cubeb_resampler_speex<float, cubeb_resampler_speex_one_way<float>, delay_line<float> >’ [-Wshadow]
  673.  cubeb_resampler_speex<T, InputProcessor, OutputProcessor>
  674.  ^~~~~~~~~~~~~~~~~~~~~~~~~~~~~~~~~~~~~~~~~~~~~~~~~~~~~~~~~
  675. In file included from /home/mrturcot/mitch/builds/dolphin-emu-git/src/dolphin-emu/Externals/cubeb/src/cubeb_resampler.cpp:19:
  676. /home/mrturcot/mitch/builds/dolphin-emu-git/src/dolphin-emu/Externals/cubeb/src/cubeb_resampler_internal.h:155:37: note: shadowed declaration is here
  677.    std::unique_ptr<OutputProcessing> output_processor;
  678.                                      ^~~~~~~~~~~~~~~~
  679. /home/mrturcot/mitch/builds/dolphin-emu-git/src/dolphin-emu/Externals/cubeb/src/cubeb_resampler.cpp:90:1: warning: declaration of ‘input_processor’ shadows a member of ‘cubeb_resampler_speex<float, cubeb_resampler_speex_one_way<float>, delay_line<float> >’ [-Wshadow]
  680.  cubeb_resampler_speex<T, InputProcessor, OutputProcessor>
  681.  ^~~~~~~~~~~~~~~~~~~~~~~~~~~~~~~~~~~~~~~~~~~~~~~~~~~~~~~~~
  682. In file included from /home/mrturcot/mitch/builds/dolphin-emu-git/src/dolphin-emu/Externals/cubeb/src/cubeb_resampler.cpp:19:
  683. /home/mrturcot/mitch/builds/dolphin-emu-git/src/dolphin-emu/Externals/cubeb/src/cubeb_resampler_internal.h:154:36: note: shadowed declaration is here
  684.    std::unique_ptr<InputProcessing> input_processor;
  685.                                     ^~~~~~~~~~~~~~~
  686. /home/mrturcot/mitch/builds/dolphin-emu-git/src/dolphin-emu/Externals/cubeb/src/cubeb_resampler.cpp: In instantiation of ‘cubeb_resampler_speex<T, InputProcessing, OutputProcessing>::cubeb_resampler_speex(InputProcessor*, OutputProcessor*, cubeb_stream*, cubeb_data_callback, void*) [with T = float; InputProcessing = delay_line<float>; OutputProcessing = cubeb_resampler_speex_one_way<float>; cubeb_stream = cubeb_stream; cubeb_data_callback = long int (*)(cubeb_stream*, void*, const void*, void*, long int)]’:
  687. /home/mrturcot/mitch/builds/dolphin-emu-git/src/dolphin-emu/Externals/cubeb/src/cubeb_resampler_internal.h:592:12:   required from ‘cubeb_resampler* cubeb_resampler_create_internal(cubeb_stream*, cubeb_stream_params*, cubeb_stream_params*, unsigned int, cubeb_data_callback, void*, cubeb_resampler_quality) [with T = float; cubeb_resampler = cubeb_resampler; cubeb_stream = cubeb_stream; cubeb_data_callback = long int (*)(cubeb_stream*, void*, const void*, void*, long int)]’
  688. /home/mrturcot/mitch/builds/dolphin-emu-git/src/dolphin-emu/Externals/cubeb/src/cubeb_resampler.cpp:301:60:   required from here
  689. /home/mrturcot/mitch/builds/dolphin-emu-git/src/dolphin-emu/Externals/cubeb/src/cubeb_resampler.cpp:90:1: warning: declaration of ‘output_processor’ shadows a member of ‘cubeb_resampler_speex<float, delay_line<float>, cubeb_resampler_speex_one_way<float> >’ [-Wshadow]
  690.  cubeb_resampler_speex<T, InputProcessor, OutputProcessor>
  691.  ^~~~~~~~~~~~~~~~~~~~~~~~~~~~~~~~~~~~~~~~~~~~~~~~~~~~~~~~~
  692. In file included from /home/mrturcot/mitch/builds/dolphin-emu-git/src/dolphin-emu/Externals/cubeb/src/cubeb_resampler.cpp:19:
  693. /home/mrturcot/mitch/builds/dolphin-emu-git/src/dolphin-emu/Externals/cubeb/src/cubeb_resampler_internal.h:155:37: note: shadowed declaration is here
  694.    std::unique_ptr<OutputProcessing> output_processor;
  695.                                      ^~~~~~~~~~~~~~~~
  696. /home/mrturcot/mitch/builds/dolphin-emu-git/src/dolphin-emu/Externals/cubeb/src/cubeb_resampler.cpp:90:1: warning: declaration of ‘input_processor’ shadows a member of ‘cubeb_resampler_speex<float, delay_line<float>, cubeb_resampler_speex_one_way<float> >’ [-Wshadow]
  697.  cubeb_resampler_speex<T, InputProcessor, OutputProcessor>
  698.  ^~~~~~~~~~~~~~~~~~~~~~~~~~~~~~~~~~~~~~~~~~~~~~~~~~~~~~~~~
  699. In file included from /home/mrturcot/mitch/builds/dolphin-emu-git/src/dolphin-emu/Externals/cubeb/src/cubeb_resampler.cpp:19:
  700. /home/mrturcot/mitch/builds/dolphin-emu-git/src/dolphin-emu/Externals/cubeb/src/cubeb_resampler_internal.h:154:36: note: shadowed declaration is here
  701.    std::unique_ptr<InputProcessing> input_processor;
  702.                                     ^~~~~~~~~~~~~~~
  703. [  5%] Building C object Externals/cubeb/CMakeFiles/cubeb.dir/src/cubeb_strings.c.o
  704. In file included from /home/mrturcot/mitch/builds/dolphin-emu-git/src/dolphin-emu/Externals/cubeb/src/cubeb_log.cpp:10:
  705. /home/mrturcot/mitch/builds/dolphin-emu-git/src/dolphin-emu/Externals/cubeb/src/cubeb_ringbuffer.h: In constructor ‘audio_ring_buffer_base<T>::audio_ring_buffer_base(int, int)’:
  706. /home/mrturcot/mitch/builds/dolphin-emu-git/src/dolphin-emu/Externals/cubeb/src/cubeb_ringbuffer.h:368:5: warning: declaration of ‘channel_count’ shadows a member of ‘audio_ring_buffer_base<T>’ [-Wshadow]
  707.      : channel_count(channel_count)
  708.      ^
  709. /home/mrturcot/mitch/builds/dolphin-emu-git/src/dolphin-emu/Externals/cubeb/src/cubeb_ringbuffer.h:475:7: note: shadowed declaration is here
  710.    int channel_count;
  711.        ^~~~~~~~~~~~~
  712. [  5%] Building C object Externals/cubeb/CMakeFiles/cubeb.dir/src/cubeb_pulse.c.o
  713. [  5%] Building CXX object Externals/glslang/CMakeFiles/glslang.dir/glslang/MachineIndependent/intermOut.cpp.o
  714. [  5%] Built target imgui
  715. [  5%] Building C object Externals/cubeb/CMakeFiles/cubeb.dir/src/cubeb_alsa.c.o
  716. [  5%] Linking CXX static library libSoundTouch.a
  717. [  5%] Building CXX object Externals/glslang/CMakeFiles/glslang.dir/glslang/MachineIndependent/IntermTraverse.cpp.o
  718. [  5%] Building CXX object Externals/glslang/CMakeFiles/glslang.dir/glslang/MachineIndependent/iomapper.cpp.o
  719. /home/mrturcot/mitch/builds/dolphin-emu-git/src/dolphin-emu/Externals/cubeb/src/cubeb_pulse.c:599:1: warning: no previous declaration for ‘pulse_init’ [-Wmissing-declarations]
  720.  pulse_init(cubeb ** context, char const * context_name)
  721.  ^~~~~~~~~~
  722. [  5%] Building CXX object Externals/cubeb/CMakeFiles/cubeb.dir/src/cubeb_jack.cpp.o
  723. [  5%] Building CXX object Externals/glslang/CMakeFiles/glslang.dir/glslang/MachineIndependent/limits.cpp.o
  724. /home/mrturcot/mitch/builds/dolphin-emu-git/src/dolphin-emu/Externals/cubeb/src/cubeb_alsa.c:8: warning: "_DEFAULT_SOURCE" redefined
  725.  #define _DEFAULT_SOURCE
  726.  
  727. <command-line>: note: this is the location of the previous definition
  728. /home/mrturcot/mitch/builds/dolphin-emu-git/src/dolphin-emu/Externals/cubeb/src/cubeb_alsa.c:748:1: warning: no previous declaration for ‘alsa_init’ [-Wmissing-declarations]
  729.  alsa_init(cubeb ** context, char const * context_name)
  730.  ^~~~~~~~~
  731. /home/mrturcot/mitch/builds/dolphin-emu-git/src/dolphin-emu/Externals/cubeb/src/cubeb_alsa.c: In function ‘alsa_stream_stop’:
  732. /home/mrturcot/mitch/builds/dolphin-emu-git/src/dolphin-emu/Externals/cubeb/src/cubeb_alsa.c:1211:9: warning: declaration of ‘r’ shadows a previous local [-Wshadow]
  733.      int r = alsa_stream_stop(stm->other_stream);
  734.          ^
  735. /home/mrturcot/mitch/builds/dolphin-emu-git/src/dolphin-emu/Externals/cubeb/src/cubeb_alsa.c:1205:7: note: shadowed declaration is here
  736.    int r;
  737.        ^
  738. In file included from /home/mrturcot/mitch/builds/dolphin-emu-git/src/dolphin-emu/Externals/glslang/glslang/MachineIndependent/LiveTraverser.h:39,
  739.                  from /home/mrturcot/mitch/builds/dolphin-emu-git/src/dolphin-emu/Externals/glslang/glslang/MachineIndependent/iomapper.cpp:39:
  740. /home/mrturcot/mitch/builds/dolphin-emu-git/src/dolphin-emu/Externals/glslang/glslang/MachineIndependent/reflection.h:62:5: warning: type qualifiers ignored on function return type [-Wignored-qualifiers]
  741.      const TType* const getType() const { return type; }
  742.      ^~~~~
  743. [  5%] Building CXX object Externals/glslang/CMakeFiles/glslang.dir/glslang/MachineIndependent/linkValidate.cpp.o
  744. /home/mrturcot/mitch/builds/dolphin-emu-git/src/dolphin-emu/Externals/cubeb/src/cubeb_jack.cpp:9: warning: "_DEFAULT_SOURCE" redefined
  745.  #define _DEFAULT_SOURCE
  746.  
  747. <command-line>: note: this is the location of the previous definition
  748. /home/mrturcot/mitch/builds/dolphin-emu-git/src/dolphin-emu/Externals/cubeb/src/cubeb_jack.cpp: In function ‘int cbjack_enumerate_devices(cubeb*, cubeb_device_type, cubeb_device_collection*)’:
  749. /home/mrturcot/mitch/builds/dolphin-emu-git/src/dolphin-emu/Externals/cubeb/src/cubeb_jack.cpp:1034:23: warning: ‘rate’ may be used uninitialized in this function [-Wmaybe-uninitialized]
  750.      cur->default_rate = rate;
  751.      ~~~~~~~~~~~~~~~~~~^~~~~~
  752. [  5%] Linking CXX static library libcubeb.a
  753. [  5%] Building CXX object Externals/glslang/CMakeFiles/glslang.dir/glslang/MachineIndependent/parseConst.cpp.o
  754. [  5%] Building CXX object Externals/glslang/CMakeFiles/glslang.dir/glslang/MachineIndependent/preprocessor/Pp.cpp.o
  755. [  5%] Building CXX object Externals/glslang/CMakeFiles/glslang.dir/glslang/MachineIndependent/ParseContextBase.cpp.o
  756. [  6%] Building CXX object Externals/glslang/CMakeFiles/glslang.dir/glslang/MachineIndependent/ParseHelper.cpp.o
  757. [  6%] Building CXX object Externals/glslang/CMakeFiles/glslang.dir/glslang/MachineIndependent/PoolAlloc.cpp.o
  758. [  6%] Built target SoundTouch
  759. [  6%] Building CXX object Externals/glslang/CMakeFiles/glslang.dir/glslang/MachineIndependent/preprocessor/PpAtom.cpp.o
  760. [  6%] Built target cubeb
  761. Scanning dependencies of target audiocommon
  762. [  7%] Building CXX object Source/Core/AudioCommon/CMakeFiles/audiocommon.dir/AudioCommon.cpp.o
  763. [  7%] Building CXX object Source/Core/AudioCommon/CMakeFiles/audiocommon.dir/AudioStretcher.cpp.o
  764. [  7%] Building CXX object Source/Core/AudioCommon/CMakeFiles/audiocommon.dir/CubebStream.cpp.o
  765. [  7%] Building CXX object Source/Core/AudioCommon/CMakeFiles/audiocommon.dir/CubebUtils.cpp.o
  766. [  8%] Building CXX object Source/Core/DiscIO/CMakeFiles/discio.dir/Blob.cpp.o
  767. [  8%] Building CXX object Source/Core/AudioCommon/CMakeFiles/audiocommon.dir/Mixer.cpp.o
  768. [  8%] Building CXX object Source/Core/DiscIO/CMakeFiles/discio.dir/CISOBlob.cpp.o
  769. [  8%] Building CXX object Source/Core/DiscIO/CMakeFiles/discio.dir/WbfsBlob.cpp.o
  770. [  8%] Building CXX object Source/Core/AudioCommon/CMakeFiles/audiocommon.dir/SurroundDecoder.cpp.o
  771. [  8%] Building CXX object Source/Core/DiscIO/CMakeFiles/discio.dir/CompressedBlob.cpp.o
  772. [  8%] Building CXX object Source/Core/AudioCommon/CMakeFiles/audiocommon.dir/NullSoundStream.cpp.o
  773. [  8%] Building CXX object Source/Core/AudioCommon/CMakeFiles/audiocommon.dir/WaveFile.cpp.o
  774. [  8%] Building CXX object Source/Core/DiscIO/CMakeFiles/discio.dir/DirectoryBlob.cpp.o
  775. [  9%] Building CXX object Source/Core/AudioCommon/CMakeFiles/audiocommon.dir/AlsaSoundStream.cpp.o
  776. /home/mrturcot/mitch/builds/dolphin-emu-git/src/dolphin-emu/Source/Core/DiscIO/DirectoryBlob.cpp: In member function ‘void DiscIO::DirectoryBlobReader::SetWiiRegionData(const string&)’:
  777. /home/mrturcot/mitch/builds/dolphin-emu-git/src/dolphin-emu/Source/Core/DiscIO/DirectoryBlob.cpp:454:17: warning: unused variable ‘WII_REGION_DATA_SIZE’ [-Wunused-variable]
  778.    constexpr u64 WII_REGION_DATA_SIZE = 0x20;
  779.                  ^~~~~~~~~~~~~~~~~~~~
  780. [  9%] Building CXX object Source/Core/AudioCommon/CMakeFiles/audiocommon.dir/PulseAudioStream.cpp.o
  781. [  9%] Building CXX object Source/Core/DiscIO/CMakeFiles/discio.dir/DiscExtractor.cpp.o
  782. In file included from /home/mrturcot/mitch/builds/dolphin-emu-git/src/dolphin-emu/Source/Core/DiscIO/Filesystem.h:14,
  783.                  from /home/mrturcot/mitch/builds/dolphin-emu-git/src/dolphin-emu/Source/Core/DiscIO/DiscExtractor.cpp:17:
  784. /home/mrturcot/mitch/builds/dolphin-emu-git/src/dolphin-emu/Source/Core/DiscIO/Volume.h: In function ‘bool DiscIO::ExportTMD(const DiscIO::Volume&, const DiscIO::Partition&, const string&)’:
  785. /home/mrturcot/mitch/builds/dolphin-emu-git/src/dolphin-emu/Source/Core/DiscIO/Volume.h:52:15: warning: ‘<anonymous>’ may be used uninitialized in this function [-Wmaybe-uninitialized]
  786.        return {};
  787.                ^
  788. /home/mrturcot/mitch/builds/dolphin-emu-git/src/dolphin-emu/Source/Core/DiscIO/Volume.h: In function ‘bool DiscIO::ExportCertificateChain(const DiscIO::Volume&, const DiscIO::Partition&, const string&)’:
  789. /home/mrturcot/mitch/builds/dolphin-emu-git/src/dolphin-emu/Source/Core/DiscIO/Volume.h:52:15: warning: ‘<anonymous>’ may be used uninitialized in this function [-Wmaybe-uninitialized]
  790.        return {};
  791.                ^
  792. /home/mrturcot/mitch/builds/dolphin-emu-git/src/dolphin-emu/Source/Core/DiscIO/Volume.h: In function ‘std::optional<unsigned int> DiscIO::GetBootDOLSize(const DiscIO::Volume&, const DiscIO::Partition&, u64)’:
  793. /home/mrturcot/mitch/builds/dolphin-emu-git/src/dolphin-emu/Source/Core/DiscIO/Volume.h:52:15: warning: ‘<anonymous>’ may be used uninitialized in this function [-Wmaybe-uninitialized]
  794.        return {};
  795.                ^
  796. /home/mrturcot/mitch/builds/dolphin-emu-git/src/dolphin-emu/Source/Core/DiscIO/DiscExtractor.cpp:288:15: warning: ‘<anonymous>’ may be used uninitialized in this function [-Wmaybe-uninitialized]
  797.        return {};
  798.                ^
  799. /home/mrturcot/mitch/builds/dolphin-emu-git/src/dolphin-emu/Source/Core/DiscIO/DiscExtractor.cpp:298:15: warning: ‘<anonymous>’ may be used uninitialized in this function [-Wmaybe-uninitialized]
  800.        return {};
  801.                ^
  802. /home/mrturcot/mitch/builds/dolphin-emu-git/src/dolphin-emu/Source/Core/DiscIO/DiscExtractor.cpp: In function ‘bool DiscIO::ExportFST(const DiscIO::Volume&, const DiscIO::Partition&, const string&)’:
  803. /home/mrturcot/mitch/builds/dolphin-emu-git/src/dolphin-emu/Source/Core/DiscIO/DiscExtractor.cpp:324:13: warning: ‘<anonymous>’ may be used uninitialized in this function [-Wmaybe-uninitialized]
  804.      return {};
  805.              ^
  806. [  9%] Linking CXX static library libaudiocommon.a
  807. [  9%] Building CXX object Source/Core/DiscIO/CMakeFiles/discio.dir/DiscScrubber.cpp.o
  808. [  9%] Building CXX object Source/Core/DiscIO/CMakeFiles/discio.dir/DriveBlob.cpp.o
  809. [  9%] Building CXX object Source/Core/DiscIO/CMakeFiles/discio.dir/Enums.cpp.o
  810. [ 10%] Building CXX object Source/Core/Common/CMakeFiles/common.dir/Analytics.cpp.o
  811. [ 10%] Built target audiocommon
  812. [ 10%] Building CXX object Externals/glslang/CMakeFiles/glslang.dir/glslang/MachineIndependent/preprocessor/PpScanner.cpp.o
  813. [ 10%] Building CXX object Source/Core/Common/CMakeFiles/common.dir/CDUtils.cpp.o
  814. [ 10%] Building CXX object Externals/glslang/CMakeFiles/glslang.dir/glslang/MachineIndependent/preprocessor/PpContext.cpp.o
  815. [ 10%] Building CXX object Externals/glslang/CMakeFiles/glslang.dir/glslang/MachineIndependent/preprocessor/PpTokens.cpp.o
  816. [ 10%] Building CXX object Source/Core/Common/CMakeFiles/common.dir/ColorUtil.cpp.o
  817. [ 11%] Building CXX object Source/Core/DiscIO/CMakeFiles/discio.dir/FileBlob.cpp.o
  818. [ 11%] Building CXX object Source/Core/Common/CMakeFiles/common.dir/Config/Config.cpp.o
  819. [ 11%] Building CXX object Source/Core/Common/CMakeFiles/common.dir/CommonFuncs.cpp.o
  820. [ 11%] Building CXX object Source/Core/Common/CMakeFiles/common.dir/Config/ConfigInfo.cpp.o
  821. [ 11%] Building CXX object Source/Core/Common/CMakeFiles/common.dir/Crypto/AES.cpp.o
  822. [ 13%] Building CXX object Source/Core/Common/CMakeFiles/common.dir/Crypto/bn.cpp.o
  823. [ 13%] Building CXX object Source/Core/Common/CMakeFiles/common.dir/Config/Layer.cpp.o
  824. [ 13%] Building CXX object Externals/glslang/CMakeFiles/glslang.dir/glslang/MachineIndependent/propagateNoContraction.cpp.o
  825. [ 13%] Building CXX object Source/Core/DiscIO/CMakeFiles/discio.dir/FileSystemGCWii.cpp.o
  826. [ 13%] Building CXX object Externals/glslang/CMakeFiles/glslang.dir/glslang/MachineIndependent/reflection.cpp.o
  827. [ 13%] Building CXX object Source/Core/Common/CMakeFiles/common.dir/Crypto/ec.cpp.o
  828. [ 13%] Building CXX object Source/Core/Common/CMakeFiles/common.dir/Debug/MemoryPatches.cpp.o
  829. [ 13%] Building CXX object Source/Core/DiscIO/CMakeFiles/discio.dir/Filesystem.cpp.o
  830. [ 13%] Building CXX object Source/Core/DiscIO/CMakeFiles/discio.dir/NANDImporter.cpp.o
  831. [ 14%] Building CXX object Externals/glslang/CMakeFiles/glslang.dir/glslang/MachineIndependent/RemoveTree.cpp.o
  832. [ 14%] Building CXX object Externals/glslang/CMakeFiles/glslang.dir/glslang/MachineIndependent/Scan.cpp.o
  833. [ 14%] Building CXX object Source/Core/Common/CMakeFiles/common.dir/Debug/Watches.cpp.o
  834. In file included from /home/mrturcot/mitch/builds/dolphin-emu-git/src/dolphin-emu/Externals/glslang/glslang/MachineIndependent/reflection.cpp:37:
  835. /home/mrturcot/mitch/builds/dolphin-emu-git/src/dolphin-emu/Externals/glslang/glslang/MachineIndependent/reflection.h:62:5: warning: type qualifiers ignored on function return type [-Wignored-qualifiers]
  836.      const TType* const getType() const { return type; }
  837.      ^~~~~
  838. [ 14%] Building CXX object Source/Core/Common/CMakeFiles/common.dir/ENetUtil.cpp.o
  839. [ 14%] Building CXX object Source/Core/DiscIO/CMakeFiles/discio.dir/TGCBlob.cpp.o
  840. [ 14%] Building CXX object Source/Core/DiscIO/CMakeFiles/discio.dir/Volume.cpp.o
  841. [ 14%] Building CXX object Source/Core/Common/CMakeFiles/common.dir/File.cpp.o
  842. [ 14%] Building CXX object Externals/glslang/CMakeFiles/glslang.dir/glslang/MachineIndependent/ShaderLang.cpp.o
  843. [ 14%] Building CXX object Source/Core/DiscIO/CMakeFiles/discio.dir/VolumeFileBlobReader.cpp.o
  844. [ 14%] Building CXX object Source/Core/Common/CMakeFiles/common.dir/FileSearch.cpp.o
  845. [ 14%] Building CXX object Source/Core/DiscIO/CMakeFiles/discio.dir/VolumeGC.cpp.o
  846. [ 14%] Building CXX object Source/Core/Common/CMakeFiles/common.dir/FileUtil.cpp.o
  847. In file included from /home/mrturcot/mitch/builds/dolphin-emu-git/src/dolphin-emu/Externals/glslang/glslang/MachineIndependent/ShaderLang.cpp:66:
  848. /home/mrturcot/mitch/builds/dolphin-emu-git/src/dolphin-emu/Externals/glslang/glslang/MachineIndependent/reflection.h:62:5: warning: type qualifiers ignored on function return type [-Wignored-qualifiers]
  849.      const TType* const getType() const { return type; }
  850.      ^~~~~
  851. [ 15%] Building CXX object Source/Core/DiscIO/CMakeFiles/discio.dir/VolumeWad.cpp.o
  852. [ 15%] Building CXX object Externals/glslang/CMakeFiles/glslang.dir/glslang/MachineIndependent/SymbolTable.cpp.o
  853. [ 15%] Building CXX object Source/Core/DiscIO/CMakeFiles/discio.dir/VolumeWii.cpp.o
  854. In file included from /home/mrturcot/mitch/builds/dolphin-emu-git/src/dolphin-emu/Source/Core/DiscIO/VolumeWad.cpp:23:
  855. /home/mrturcot/mitch/builds/dolphin-emu-git/src/dolphin-emu/Source/Core/DiscIO/Volume.h: In member function ‘virtual std::optional<long unsigned int> DiscIO::VolumeWAD::GetTitleID(const DiscIO::Partition&) const’:
  856. /home/mrturcot/mitch/builds/dolphin-emu-git/src/dolphin-emu/Source/Core/DiscIO/Volume.h:52:15: warning: ‘<anonymous>’ may be used uninitialized in this function [-Wmaybe-uninitialized]
  857.        return {};
  858.                ^
  859. In file included from /home/mrturcot/mitch/builds/dolphin-emu-git/src/dolphin-emu/Source/Core/DiscIO/VolumeWii.cpp:26:
  860. /home/mrturcot/mitch/builds/dolphin-emu-git/src/dolphin-emu/Source/Core/DiscIO/Blob.h: In static member function ‘static _Res std::_Function_handler<_Res(_ArgTypes ...), _Functor>::_M_invoke(const std::_Any_data&, _ArgTypes&& ...) [with _Res = IOS::ES::TMDReader; _Functor = DiscIO::VolumeWii::VolumeWii(std::unique_ptr<DiscIO::BlobReader>)::<lambda()>; _ArgTypes = {}]’:
  861. /home/mrturcot/mitch/builds/dolphin-emu-git/src/dolphin-emu/Source/Core/DiscIO/Blob.h:55:15: warning: ‘<anonymous>’ may be used uninitialized in this function [-Wmaybe-uninitialized]
  862.        return {};
  863.                ^
  864. [ 15%] Building CXX object Source/Core/Common/CMakeFiles/common.dir/FloatUtils.cpp.o
  865. [ 15%] Building CXX object Source/Core/Common/CMakeFiles/common.dir/Hash.cpp.o
  866. [ 15%] Building CXX object Source/Core/DiscIO/CMakeFiles/discio.dir/WiiSaveBanner.cpp.o
  867. [ 15%] Building CXX object Source/Core/DiscIO/CMakeFiles/discio.dir/WiiWad.cpp.o
  868. [ 15%] Building CXX object Externals/glslang/CMakeFiles/glslang.dir/glslang/MachineIndependent/Versions.cpp.o
  869. [ 16%] Building CXX object Source/Core/Common/CMakeFiles/common.dir/GekkoDisassembler.cpp.o
  870. [ 16%] Building CXX object Source/Core/Common/CMakeFiles/common.dir/HttpRequest.cpp.o
  871. In file included from /home/mrturcot/mitch/builds/dolphin-emu-git/src/dolphin-emu/Source/Core/DiscIO/WiiWad.cpp:15:
  872. /home/mrturcot/mitch/builds/dolphin-emu-git/src/dolphin-emu/Source/Core/DiscIO/Blob.h: In member function ‘bool DiscIO::WiiWAD::ParseWAD()’:
  873. /home/mrturcot/mitch/builds/dolphin-emu-git/src/dolphin-emu/Source/Core/DiscIO/Blob.h:55:15: warning: ‘<anonymous>’ may be used uninitialized in this function [-Wmaybe-uninitialized]
  874.        return {};
  875.                ^
  876. /home/mrturcot/mitch/builds/dolphin-emu-git/src/dolphin-emu/Source/Core/DiscIO/Blob.h:55:15: warning: ‘<anonymous>’ may be used uninitialized in this function [-Wmaybe-uninitialized]
  877.        return {};
  878.                ^
  879. /home/mrturcot/mitch/builds/dolphin-emu-git/src/dolphin-emu/Source/Core/DiscIO/Blob.h:55:15: warning: ‘<anonymous>’ may be used uninitialized in this function [-Wmaybe-uninitialized]
  880.        return {};
  881.                ^
  882. /home/mrturcot/mitch/builds/dolphin-emu-git/src/dolphin-emu/Source/Core/DiscIO/Blob.h:55:15: warning: ‘<anonymous>’ may be used uninitialized in this function [-Wmaybe-uninitialized]
  883.        return {};
  884.                ^
  885. /home/mrturcot/mitch/builds/dolphin-emu-git/src/dolphin-emu/Source/Core/DiscIO/Blob.h:55:15: warning: ‘<anonymous>’ may be used uninitialized in this function [-Wmaybe-uninitialized]
  886.        return {};
  887.                ^
  888. [ 16%] Building CXX object Source/Core/Common/CMakeFiles/common.dir/Image.cpp.o
  889. [ 16%] Building CXX object Externals/glslang/CMakeFiles/glslang.dir/SPIRV/disassemble.cpp.o
  890. [ 16%] Building CXX object Source/Core/Common/CMakeFiles/common.dir/IniFile.cpp.o
  891. [ 16%] Building CXX object Externals/glslang/CMakeFiles/glslang.dir/OGLCompilersDLL/InitializeDll.cpp.o
  892. [ 16%] Building CXX object Source/Core/Common/CMakeFiles/common.dir/JitRegister.cpp.o
  893. [ 16%] Linking CXX static library libdiscio.a
  894. [ 16%] Building CXX object Externals/glslang/CMakeFiles/glslang.dir/SPIRV/doc.cpp.o
  895. [ 17%] Building CXX object Externals/glslang/CMakeFiles/glslang.dir/SPIRV/GlslangToSpv.cpp.o
  896. [ 17%] Building CXX object Source/Core/Common/CMakeFiles/common.dir/Logging/LogManager.cpp.o
  897. [ 17%] Building CXX object Source/Core/Common/CMakeFiles/common.dir/MathUtil.cpp.o
  898. [ 17%] Building CXX object Externals/glslang/CMakeFiles/glslang.dir/SPIRV/InReadableOrder.cpp.o
  899. [ 18%] Building CXX object Source/Core/Common/CMakeFiles/common.dir/Matrix.cpp.o
  900. [ 18%] Building CXX object Externals/glslang/CMakeFiles/glslang.dir/SPIRV/Logger.cpp.o
  901. [ 18%] Building CXX object Externals/glslang/CMakeFiles/glslang.dir/SPIRV/SpvBuilder.cpp.o
  902. [ 18%] Building CXX object Source/Core/Common/CMakeFiles/common.dir/MD5.cpp.o
  903. [ 18%] Building CXX object Source/Core/Common/CMakeFiles/common.dir/MemArena.cpp.o
  904. [ 18%] Building CXX object Source/Core/Common/CMakeFiles/common.dir/MemoryUtil.cpp.o
  905. [ 18%] Building CXX object Source/Core/Common/CMakeFiles/common.dir/MsgHandler.cpp.o
  906. [ 18%] Building CXX object Source/Core/Common/CMakeFiles/common.dir/NandPaths.cpp.o
  907. [ 18%] Built target discio
  908. [ 18%] Building CXX object Externals/glslang/CMakeFiles/glslang.dir/SPIRV/SPVRemapper.cpp.o
  909. [ 18%] Building CXX object Source/Core/Common/CMakeFiles/common.dir/Network.cpp.o
  910. [ 18%] Building CXX object Source/Core/Common/CMakeFiles/common.dir/PcapFile.cpp.o
  911. [ 19%] Building CXX object Source/Core/Common/CMakeFiles/common.dir/PerformanceCounter.cpp.o
  912. [ 19%] Building CXX object Source/Core/Common/CMakeFiles/common.dir/Profiler.cpp.o
  913. In file included from /home/mrturcot/mitch/builds/dolphin-emu-git/src/dolphin-emu/Externals/glslang/SPIRV/hex_float.h:39,
  914.                  from /home/mrturcot/mitch/builds/dolphin-emu-git/src/dolphin-emu/Externals/glslang/SPIRV/SpvBuilder.cpp:49:
  915. /home/mrturcot/mitch/builds/dolphin-emu-git/src/dolphin-emu/Externals/glslang/SPIRV/bitutils.h: In instantiation of ‘Dest spvutils::BitwiseCast(Src) [with Dest = spvutils::Float16; Src = short unsigned int]’:
  916. /home/mrturcot/mitch/builds/dolphin-emu-git/src/dolphin-emu/Externals/glslang/SPIRV/hex_float.h:138:47:   required from ‘T spvutils::FloatProxy<T>::getAsFloat() const [with T = spvutils::Float16]’
  917. /home/mrturcot/mitch/builds/dolphin-emu-git/src/dolphin-emu/Externals/glslang/SPIRV/hex_float.h:821:52:   required from here
  918. /home/mrturcot/mitch/builds/dolphin-emu-git/src/dolphin-emu/Externals/glslang/SPIRV/bitutils.h:29:14: warning: ‘void* memcpy(void*, const void*, size_t)’ writing to an object of non-trivially copyable type ‘class spvutils::Float16’; use copy-assignment or copy-initialization instead [-Wclass-memaccess]
  919.    std::memcpy(&dest, &source, sizeof(dest));
  920.    ~~~~~~~~~~~^~~~~~~~~~~~~~~~~~~~~~~~~~~~~~
  921. In file included from /home/mrturcot/mitch/builds/dolphin-emu-git/src/dolphin-emu/Externals/glslang/SPIRV/SpvBuilder.cpp:49:
  922. /home/mrturcot/mitch/builds/dolphin-emu-git/src/dolphin-emu/Externals/glslang/SPIRV/hex_float.h:43:7: note: ‘class spvutils::Float16’ declared here
  923.  class Float16 {
  924.        ^~~~~~~
  925. In file included from /home/mrturcot/mitch/builds/dolphin-emu-git/src/dolphin-emu/Externals/glslang/SPIRV/hex_float.h:39,
  926.                  from /home/mrturcot/mitch/builds/dolphin-emu-git/src/dolphin-emu/Externals/glslang/SPIRV/SpvBuilder.cpp:49:
  927. /home/mrturcot/mitch/builds/dolphin-emu-git/src/dolphin-emu/Externals/glslang/SPIRV/bitutils.h: In instantiation of ‘Dest spvutils::BitwiseCast(Src) [with Dest = spvutils::FloatProxy<spvutils::Float16>; Src = short unsigned int]’:
  928. /home/mrturcot/mitch/builds/dolphin-emu-git/src/dolphin-emu/Externals/glslang/SPIRV/hex_float.h:431:28:   required from ‘void spvutils::HexFloat<T, Traits>::setFromSignUnbiasedExponentAndNormalizedSignificand(bool, spvutils::HexFloat<T, Traits>::int_type, spvutils::HexFloat<T, Traits>::uint_type, bool) [with T = spvutils::FloatProxy<spvutils::Float16>; Traits = spvutils::HexFloatTraits<spvutils::FloatProxy<spvutils::Float16> >; spvutils::HexFloat<T, Traits>::int_type = short int; spvutils::HexFloat<T, Traits>::uint_type = short unsigned int]’
  929. /home/mrturcot/mitch/builds/dolphin-emu-git/src/dolphin-emu/Externals/glslang/SPIRV/hex_float.h:633:5:   required from ‘void spvutils::HexFloat<T, Traits>::castTo(other_T&, spvutils::round_direction) [with other_T = spvutils::HexFloat<spvutils::FloatProxy<spvutils::Float16>, spvutils::HexFloatTraits<spvutils::FloatProxy<spvutils::Float16> > >; T = spvutils::FloatProxy<float>; Traits = spvutils::HexFloatTraits<spvutils::FloatProxy<float> >]’
  930. /home/mrturcot/mitch/builds/dolphin-emu-git/src/dolphin-emu/Externals/glslang/SPIRV/hex_float.h:817:39:   required from here
  931. /home/mrturcot/mitch/builds/dolphin-emu-git/src/dolphin-emu/Externals/glslang/SPIRV/bitutils.h:29:14: warning: ‘void* memcpy(void*, const void*, size_t)’ copying an object of non-trivial type ‘class spvutils::FloatProxy<spvutils::Float16>’ from an array of ‘short unsigned int’ [-Wclass-memaccess]
  932.    std::memcpy(&dest, &source, sizeof(dest));
  933.    ~~~~~~~~~~~^~~~~~~~~~~~~~~~~~~~~~~~~~~~~~
  934. In file included from /home/mrturcot/mitch/builds/dolphin-emu-git/src/dolphin-emu/Externals/glslang/SPIRV/SpvBuilder.cpp:49:
  935. /home/mrturcot/mitch/builds/dolphin-emu-git/src/dolphin-emu/Externals/glslang/SPIRV/hex_float.h:115:7: note: ‘class spvutils::FloatProxy<spvutils::Float16>’ declared here
  936.  class FloatProxy {
  937.        ^~~~~~~~~~
  938. [ 19%] Building CXX object Externals/glslang/CMakeFiles/glslang.dir/glslang/OSDependent/Unix/ossource.cpp.o
  939. [ 19%] Building CXX object Source/Core/Common/CMakeFiles/common.dir/QoSSession.cpp.o
  940. [ 19%] Building CXX object Source/Core/Common/CMakeFiles/common.dir/Random.cpp.o
  941. [ 19%] Building CXX object Source/Core/Common/CMakeFiles/common.dir/SDCardUtil.cpp.o
  942. [ 19%] Building CXX object Source/Core/Common/CMakeFiles/common.dir/StringUtil.cpp.o
  943. [ 19%] Building CXX object Source/Core/Common/CMakeFiles/common.dir/SFMLHelper.cpp.o
  944. [ 19%] Building CXX object Source/Core/Common/CMakeFiles/common.dir/SettingsHandler.cpp.o
  945. [ 20%] Building CXX object Source/Core/Common/CMakeFiles/common.dir/SymbolDB.cpp.o
  946. [ 20%] Building CXX object Source/Core/Common/CMakeFiles/common.dir/Thread.cpp.o
  947. [ 20%] Building CXX object Source/Core/Common/CMakeFiles/common.dir/Timer.cpp.o
  948. [ 20%] Linking CXX static library libglslang.a
  949. [ 20%] Building CXX object Source/Core/Common/CMakeFiles/common.dir/TraversalClient.cpp.o
  950. [ 20%] Building CXX object Source/Core/Common/CMakeFiles/common.dir/UPnP.cpp.o
  951. [ 20%] Building CXX object Source/Core/Common/CMakeFiles/common.dir/Version.cpp.o
  952. [ 20%] Building CXX object Source/Core/Common/CMakeFiles/common.dir/Logging/ConsoleListenerNix.cpp.o
  953. [ 20%] Building CXX object Source/Core/Common/CMakeFiles/common.dir/x64ABI.cpp.o
  954. [ 20%] Building CXX object Source/Core/Common/CMakeFiles/common.dir/x64Emitter.cpp.o
  955. [ 21%] Building CXX object Source/Core/Common/CMakeFiles/common.dir/x64FPURoundMode.cpp.o
  956. [ 21%] Building CXX object Source/Core/Common/CMakeFiles/common.dir/x64CPUDetect.cpp.o
  957. [ 21%] Building CXX object Source/Core/Common/CMakeFiles/common.dir/GL/GLExtensions/GLExtensions.cpp.o
  958. [ 21%] Building CXX object Source/Core/Common/CMakeFiles/common.dir/GL/GLUtil.cpp.o
  959. [ 21%] Building CXX object Source/Core/Common/CMakeFiles/common.dir/GL/GLContext.cpp.o
  960. [ 21%] Building CXX object Source/Core/Common/CMakeFiles/common.dir/GL/GLInterface/EGLX11.cpp.o
  961. [ 21%] Building CXX object Source/Core/Common/CMakeFiles/common.dir/GL/GLInterface/EGL.cpp.o
  962. [ 21%] Building CXX object Source/Core/Common/CMakeFiles/common.dir/GL/GLX11Window.cpp.o
  963. [ 22%] Building CXX object Source/Core/Common/CMakeFiles/common.dir/GL/GLInterface/GLX.cpp.o
  964. [ 22%] Built target glslang
  965. [ 22%] Linking CXX static library libcommon.a
  966. [ 22%] Built target common
  967. Scanning dependencies of target traversal_server
  968. Scanning dependencies of target uicommon
  969. Scanning dependencies of target inputcommon
  970. [ 22%] Building CXX object Source/Core/Common/CMakeFiles/traversal_server.dir/TraversalServer.cpp.o
  971. [ 23%] Linking CXX executable ../../../Binaries/traversal_server
  972. [ 23%] Built target traversal_server
  973. [ 23%] Building CXX object Source/Core/InputCommon/CMakeFiles/inputcommon.dir/ControllerEmu/Control/Input.cpp.o
  974. [ 23%] Building CXX object Source/Core/InputCommon/CMakeFiles/inputcommon.dir/ControllerEmu/ControllerEmu.cpp.o
  975. [ 23%] Building CXX object Source/Core/InputCommon/CMakeFiles/inputcommon.dir/InputConfig.cpp.o
  976. [ 25%] Building CXX object Source/Core/InputCommon/CMakeFiles/inputcommon.dir/InputProfile.cpp.o
  977. [ 25%] Building CXX object Source/Core/InputCommon/CMakeFiles/inputcommon.dir/ControllerEmu/StickGate.cpp.o
  978. [ 25%] Building CXX object Source/Core/InputCommon/CMakeFiles/inputcommon.dir/ControllerEmu/Control/Control.cpp.o
  979. [ 25%] Building CXX object Source/Core/InputCommon/CMakeFiles/inputcommon.dir/ControllerEmu/Control/Output.cpp.o
  980. [ 26%] Building CXX object Source/Core/InputCommon/CMakeFiles/inputcommon.dir/ControllerEmu/ControlGroup/ControlGroup.cpp.o
  981. [ 26%] Building CXX object Source/Core/InputCommon/CMakeFiles/inputcommon.dir/ControllerEmu/ControlGroup/AnalogStick.cpp.o
  982. [ 26%] Building CXX object Source/Core/InputCommon/CMakeFiles/inputcommon.dir/ControllerEmu/ControlGroup/Attachments.cpp.o
  983. [ 26%] Building CXX object Source/Core/InputCommon/CMakeFiles/inputcommon.dir/ControllerEmu/ControlGroup/Buttons.cpp.o
  984. [ 26%] Building CXX object Source/Core/InputCommon/CMakeFiles/inputcommon.dir/ControllerEmu/ControlGroup/Cursor.cpp.o
  985. /home/mrturcot/mitch/builds/dolphin-emu-git/src/dolphin-emu/Source/Core/InputCommon/ControllerEmu/StickGate.cpp: In constructor ‘ControllerEmu::ReshapableInput::ReshapableInput(std::__cxx11::string, std::__cxx11::string, ControllerEmu::GroupType)’:
  986. /home/mrturcot/mitch/builds/dolphin-emu-git/src/dolphin-emu/Source/Core/InputCommon/ControllerEmu/StickGate.cpp:100:87: warning: declaration of ‘type’ shadows a member of ‘ControllerEmu::ReshapableInput’ [-Wshadow]
  987.  ReshapableInput::ReshapableInput(std::string name, std::string ui_name, GroupType type)
  988.                                                                                        ^
  989. In file included from /home/mrturcot/mitch/builds/dolphin-emu-git/src/dolphin-emu/Source/Core/InputCommon/ControllerEmu/StickGate.h:13,
  990.                  from /home/mrturcot/mitch/builds/dolphin-emu-git/src/dolphin-emu/Source/Core/InputCommon/ControllerEmu/StickGate.cpp:5:
  991. /home/mrturcot/mitch/builds/dolphin-emu-git/src/dolphin-emu/Source/Core/InputCommon/ControllerEmu/ControlGroup/ControlGroup.h:51:19: note: shadowed declaration is here
  992.    const GroupType type;
  993.                    ^~~~
  994. /home/mrturcot/mitch/builds/dolphin-emu-git/src/dolphin-emu/Source/Core/InputCommon/ControllerEmu/StickGate.cpp:100:87: warning: declaration of ‘ui_name’ shadows a member of ‘ControllerEmu::ReshapableInput’ [-Wshadow]
  995.  ReshapableInput::ReshapableInput(std::string name, std::string ui_name, GroupType type)
  996.                                                                                        ^
  997. In file included from /home/mrturcot/mitch/builds/dolphin-emu-git/src/dolphin-emu/Source/Core/InputCommon/ControllerEmu/StickGate.h:13,
  998.                  from /home/mrturcot/mitch/builds/dolphin-emu-git/src/dolphin-emu/Source/Core/InputCommon/ControllerEmu/StickGate.cpp:5:
  999. /home/mrturcot/mitch/builds/dolphin-emu-git/src/dolphin-emu/Source/Core/InputCommon/ControllerEmu/ControlGroup/ControlGroup.h:50:21: note: shadowed declaration is here
  1000.    const std::string ui_name;
  1001.                      ^~~~~~~
  1002. /home/mrturcot/mitch/builds/dolphin-emu-git/src/dolphin-emu/Source/Core/InputCommon/ControllerEmu/StickGate.cpp:100:87: warning: declaration of ‘name’ shadows a member of ‘ControllerEmu::ReshapableInput’ [-Wshadow]
  1003.  ReshapableInput::ReshapableInput(std::string name, std::string ui_name, GroupType type)
  1004.                                                                                        ^
  1005. In file included from /home/mrturcot/mitch/builds/dolphin-emu-git/src/dolphin-emu/Source/Core/InputCommon/ControllerEmu/StickGate.h:13,
  1006.                  from /home/mrturcot/mitch/builds/dolphin-emu-git/src/dolphin-emu/Source/Core/InputCommon/ControllerEmu/StickGate.cpp:5:
  1007. /home/mrturcot/mitch/builds/dolphin-emu-git/src/dolphin-emu/Source/Core/InputCommon/ControllerEmu/ControlGroup/ControlGroup.h:49:21: note: shadowed declaration is here
  1008.    const std::string name;
  1009.                      ^~~~
  1010. [ 26%] Building CXX object Source/Core/InputCommon/CMakeFiles/inputcommon.dir/ControllerEmu/ControlGroup/Force.cpp.o
  1011. [ 26%] Building CXX object Source/Core/InputCommon/CMakeFiles/inputcommon.dir/ControllerEmu/ControlGroup/MixedTriggers.cpp.o
  1012. [ 26%] Building CXX object Source/Core/InputCommon/CMakeFiles/inputcommon.dir/ControllerEmu/ControlGroup/ModifySettingsButton.cpp.o
  1013. [ 26%] Building CXX object Source/Core/InputCommon/CMakeFiles/inputcommon.dir/ControllerEmu/ControlGroup/Slider.cpp.o
  1014. [ 26%] Building CXX object Source/Core/InputCommon/CMakeFiles/inputcommon.dir/ControllerEmu/ControlGroup/Tilt.cpp.o
  1015. [ 26%] Building CXX object Source/Core/UICommon/CMakeFiles/uicommon.dir/AutoUpdate.cpp.o
  1016. [ 26%] Building CXX object Source/Core/InputCommon/CMakeFiles/inputcommon.dir/ControllerEmu/ControlGroup/Triggers.cpp.o
  1017. [ 26%] Building CXX object Source/Core/UICommon/CMakeFiles/uicommon.dir/CommandLineParse.cpp.o
  1018. /home/mrturcot/mitch/builds/dolphin-emu-git/src/dolphin-emu/Source/Core/InputCommon/ControllerEmu/ControlGroup/AnalogStick.cpp: In constructor ‘ControllerEmu::OctagonAnalogStick::OctagonAnalogStick(const char*, ControlState)’:
  1019. /home/mrturcot/mitch/builds/dolphin-emu-git/src/dolphin-emu/Source/Core/InputCommon/ControllerEmu/ControlGroup/AnalogStick.cpp:59:82: warning: declaration of ‘name’ shadows a member of ‘ControllerEmu::OctagonAnalogStick’ [-Wshadow]
  1020.  OctagonAnalogStick::OctagonAnalogStick(const char* name, ControlState gate_radius)
  1021.                                                                                   ^
  1022. In file included from /home/mrturcot/mitch/builds/dolphin-emu-git/src/dolphin-emu/Source/Core/InputCommon/ControllerEmu/ControlGroup/AnalogStick.h:7,
  1023.                  from /home/mrturcot/mitch/builds/dolphin-emu-git/src/dolphin-emu/Source/Core/InputCommon/ControllerEmu/ControlGroup/AnalogStick.cpp:5:
  1024. /home/mrturcot/mitch/builds/dolphin-emu-git/src/dolphin-emu/Source/Core/InputCommon/ControllerEmu/ControlGroup/ControlGroup.h:49:21: note: shadowed declaration is here
  1025.    const std::string name;
  1026.                      ^~~~
  1027. /home/mrturcot/mitch/builds/dolphin-emu-git/src/dolphin-emu/Source/Core/InputCommon/ControllerEmu/ControlGroup/AnalogStick.cpp: In constructor ‘ControllerEmu::OctagonAnalogStick::OctagonAnalogStick(const char*, const char*, ControlState)’:
  1028. /home/mrturcot/mitch/builds/dolphin-emu-git/src/dolphin-emu/Source/Core/InputCommon/ControllerEmu/ControlGroup/AnalogStick.cpp:65:64: warning: declaration of ‘ui_name’ shadows a member of ‘ControllerEmu::OctagonAnalogStick’ [-Wshadow]
  1029.                                         ControlState gate_radius)
  1030.                                                                 ^
  1031. In file included from /home/mrturcot/mitch/builds/dolphin-emu-git/src/dolphin-emu/Source/Core/InputCommon/ControllerEmu/ControlGroup/AnalogStick.h:7,
  1032.                  from /home/mrturcot/mitch/builds/dolphin-emu-git/src/dolphin-emu/Source/Core/InputCommon/ControllerEmu/ControlGroup/AnalogStick.cpp:5:
  1033. /home/mrturcot/mitch/builds/dolphin-emu-git/src/dolphin-emu/Source/Core/InputCommon/ControllerEmu/ControlGroup/ControlGroup.h:50:21: note: shadowed declaration is here
  1034.    const std::string ui_name;
  1035.                      ^~~~~~~
  1036. /home/mrturcot/mitch/builds/dolphin-emu-git/src/dolphin-emu/Source/Core/InputCommon/ControllerEmu/ControlGroup/AnalogStick.cpp:65:64: warning: declaration of ‘name’ shadows a member of ‘ControllerEmu::OctagonAnalogStick’ [-Wshadow]
  1037.                                         ControlState gate_radius)
  1038.                                                                 ^
  1039. In file included from /home/mrturcot/mitch/builds/dolphin-emu-git/src/dolphin-emu/Source/Core/InputCommon/ControllerEmu/ControlGroup/AnalogStick.h:7,
  1040.                  from /home/mrturcot/mitch/builds/dolphin-emu-git/src/dolphin-emu/Source/Core/InputCommon/ControllerEmu/ControlGroup/AnalogStick.cpp:5:
  1041. /home/mrturcot/mitch/builds/dolphin-emu-git/src/dolphin-emu/Source/Core/InputCommon/ControllerEmu/ControlGroup/ControlGroup.h:49:21: note: shadowed declaration is here
  1042.    const std::string name;
  1043.                      ^~~~
  1044. [ 26%] Building CXX object Source/Core/UICommon/CMakeFiles/uicommon.dir/Disassembler.cpp.o
  1045. [ 26%] Building CXX object Source/Core/UICommon/CMakeFiles/uicommon.dir/DiscordPresence.cpp.o
  1046. [ 26%] Building CXX object Source/Core/UICommon/CMakeFiles/uicommon.dir/GameFile.cpp.o
  1047. [ 26%] Building CXX object Source/Core/UICommon/CMakeFiles/uicommon.dir/GameFileCache.cpp.o
  1048. [ 26%] Building CXX object Source/Core/UICommon/CMakeFiles/uicommon.dir/ResourcePack/Manifest.cpp.o
  1049. [ 26%] Building CXX object Source/Core/UICommon/CMakeFiles/uicommon.dir/ResourcePack/Manager.cpp.o
  1050. [ 27%] Building CXX object Source/Core/UICommon/CMakeFiles/uicommon.dir/ResourcePack/ResourcePack.cpp.o
  1051. [ 28%] Building CXX object Source/Core/InputCommon/CMakeFiles/inputcommon.dir/ControllerEmu/Setting/BooleanSetting.cpp.o
  1052. [ 28%] Building CXX object Source/Core/InputCommon/CMakeFiles/inputcommon.dir/ControllerEmu/Setting/NumericSetting.cpp.o
  1053. [ 28%] Building CXX object Source/Core/UICommon/CMakeFiles/uicommon.dir/UICommon.cpp.o
  1054. [ 28%] Building CXX object Source/Core/UICommon/CMakeFiles/uicommon.dir/USBUtils.cpp.o
  1055. [ 28%] Building CXX object Source/Core/UICommon/CMakeFiles/uicommon.dir/VideoUtils.cpp.o
  1056. /home/mrturcot/mitch/builds/dolphin-emu-git/src/dolphin-emu/Source/Core/UICommon/ResourcePack/Manager.cpp:23:9: warning: no previous declaration for ‘IniFile ResourcePack::GetPackConfig()’ [-Wmissing-declarations]
  1057.  IniFile GetPackConfig()
  1058.          ^~~~~~~~~~~~~
  1059. [ 28%] Building CXX object Source/Core/UICommon/CMakeFiles/uicommon.dir/X11Utils.cpp.o
  1060. [ 28%] Building CXX object Source/Core/InputCommon/CMakeFiles/inputcommon.dir/ControllerInterface/ControllerInterface.cpp.o
  1061. [ 28%] Building CXX object Source/Core/InputCommon/CMakeFiles/inputcommon.dir/ControllerInterface/Device.cpp.o
  1062. [ 28%] Building CXX object Source/Core/InputCommon/CMakeFiles/inputcommon.dir/ControlReference/ControlReference.cpp.o
  1063. [ 28%] Building CXX object Source/Core/InputCommon/CMakeFiles/inputcommon.dir/ControlReference/ExpressionParser.cpp.o
  1064. [ 28%] Building CXX object Source/Core/InputCommon/CMakeFiles/inputcommon.dir/ControllerInterface/Xlib/XInput2.cpp.o
  1065. [ 28%] Building CXX object Source/Core/InputCommon/CMakeFiles/inputcommon.dir/GCAdapter.cpp.o
  1066. [ 29%] Building CXX object Source/Core/InputCommon/CMakeFiles/inputcommon.dir/ControllerInterface/evdev/evdev.cpp.o
  1067. [ 29%] Linking CXX static library libuicommon.a
  1068. [ 29%] Building CXX object Source/Core/InputCommon/CMakeFiles/inputcommon.dir/ControllerInterface/Pipes/Pipes.cpp.o
  1069. [ 29%] Linking CXX static library libinputcommon.a
  1070. [ 29%] Built target uicommon
  1071. [ 29%] Built target inputcommon
  1072. Scanning dependencies of target videovulkan
  1073. [ 29%] Building CXX object Source/Core/VideoBackends/Vulkan/CMakeFiles/videovulkan.dir/CommandBufferManager.cpp.o
  1074. [ 29%] Building CXX object Source/Core/VideoBackends/Vulkan/CMakeFiles/videovulkan.dir/BoundingBox.cpp.o
  1075. [ 29%] Building CXX object Source/Core/VideoBackends/Vulkan/CMakeFiles/videovulkan.dir/ObjectCache.cpp.o
  1076. [ 29%] Building CXX object Source/Core/VideoBackends/Vulkan/CMakeFiles/videovulkan.dir/PerfQuery.cpp.o
  1077. [ 30%] Building CXX object Source/Core/VideoBackends/Vulkan/CMakeFiles/videovulkan.dir/Renderer.cpp.o
  1078. [ 30%] Building CXX object Source/Core/VideoBackends/Vulkan/CMakeFiles/videovulkan.dir/StateTracker.cpp.o
  1079. [ 30%] Building CXX object Source/Core/VideoBackends/Vulkan/CMakeFiles/videovulkan.dir/ShaderCompiler.cpp.o
  1080. [ 30%] Building CXX object Source/Core/VideoBackends/Vulkan/CMakeFiles/videovulkan.dir/StagingBuffer.cpp.o
  1081. [ 30%] Building CXX object Source/Core/VideoBackends/Vulkan/CMakeFiles/videovulkan.dir/StreamBuffer.cpp.o
  1082. [ 30%] Building CXX object Source/Core/VideoBackends/Vulkan/CMakeFiles/videovulkan.dir/VertexFormat.cpp.o
  1083. [ 30%] Building CXX object Source/Core/VideoBackends/Vulkan/CMakeFiles/videovulkan.dir/SwapChain.cpp.o
  1084. [ 31%] Building CXX object Source/Core/VideoBackends/Vulkan/CMakeFiles/videovulkan.dir/VKPipeline.cpp.o
  1085. [ 31%] Building CXX object Source/Core/VideoBackends/Vulkan/CMakeFiles/videovulkan.dir/VertexManager.cpp.o
  1086. [ 31%] Building CXX object Source/Core/VideoBackends/Vulkan/CMakeFiles/videovulkan.dir/VKShader.cpp.o
  1087. [ 31%] Building CXX object Source/Core/VideoBackends/Vulkan/CMakeFiles/videovulkan.dir/VKTexture.cpp.o
  1088. [ 31%] Building CXX object Source/Core/VideoBackends/Vulkan/CMakeFiles/videovulkan.dir/VulkanContext.cpp.o
  1089. [ 31%] Building CXX object Source/Core/VideoBackends/Vulkan/CMakeFiles/videovulkan.dir/VulkanLoader.cpp.o
  1090. [ 31%] Building CXX object Source/Core/VideoBackends/Vulkan/CMakeFiles/videovulkan.dir/main.cpp.o
  1091. [ 31%] Linking CXX static library libvideovulkan.a
  1092. [ 31%] Built target videovulkan
  1093. Scanning dependencies of target videosoftware
  1094. [ 31%] Building CXX object Source/Core/VideoBackends/Software/CMakeFiles/videosoftware.dir/Clipper.cpp.o
  1095. [ 31%] Building CXX object Source/Core/VideoBackends/Software/CMakeFiles/videosoftware.dir/DebugUtil.cpp.o
  1096. [ 31%] Building CXX object Source/Core/VideoBackends/Software/CMakeFiles/videosoftware.dir/EfbCopy.cpp.o
  1097. [ 32%] Building CXX object Source/Core/VideoBackends/Software/CMakeFiles/videosoftware.dir/EfbInterface.cpp.o
  1098. [ 32%] Building CXX object Source/Core/VideoBackends/Software/CMakeFiles/videosoftware.dir/Rasterizer.cpp.o
  1099. [ 32%] Building CXX object Source/Core/VideoBackends/Software/CMakeFiles/videosoftware.dir/SWOGLWindow.cpp.o
  1100. [ 32%] Building CXX object Source/Core/VideoBackends/Software/CMakeFiles/videosoftware.dir/SWTexture.cpp.o
  1101. [ 32%] Building CXX object Source/Core/VideoBackends/Software/CMakeFiles/videosoftware.dir/SWRenderer.cpp.o
  1102. [ 32%] Building CXX object Source/Core/VideoBackends/Software/CMakeFiles/videosoftware.dir/SWVertexLoader.cpp.o
  1103. [ 32%] Building CXX object Source/Core/VideoBackends/Software/CMakeFiles/videosoftware.dir/SWmain.cpp.o
  1104. [ 32%] Building CXX object Source/Core/VideoBackends/Software/CMakeFiles/videosoftware.dir/Tev.cpp.o
  1105. [ 32%] Building CXX object Source/Core/VideoBackends/Software/CMakeFiles/videosoftware.dir/SetupUnit.cpp.o
  1106. [ 33%] Building CXX object Source/Core/VideoBackends/Software/CMakeFiles/videosoftware.dir/TextureEncoder.cpp.o
  1107. /home/mrturcot/mitch/builds/dolphin-emu-git/src/dolphin-emu/Source/Core/VideoBackends/Software/SetupUnit.cpp: In member function ‘OutputVertexData* SetupUnit::GetVertex()’:
  1108. /home/mrturcot/mitch/builds/dolphin-emu-git/src/dolphin-emu/Source/Core/VideoBackends/Software/SetupUnit.cpp:28:60: warning: ‘void* memset(void*, int, size_t)’ clearing an object of non-trivial type ‘struct OutputVertexData’; use assignment or value-initialization instead [-Wclass-memaccess]
  1109.    memset(m_VertWritePointer, 0, sizeof(*m_VertWritePointer));
  1110.                                                             ^
  1111. In file included from /home/mrturcot/mitch/builds/dolphin-emu-git/src/dolphin-emu/Source/Core/VideoBackends/Software/SetupUnit.h:8,
  1112.                  from /home/mrturcot/mitch/builds/dolphin-emu-git/src/dolphin-emu/Source/Core/VideoBackends/Software/SetupUnit.cpp:7:
  1113. /home/mrturcot/mitch/builds/dolphin-emu-git/src/dolphin-emu/Source/Core/VideoBackends/Software/NativeVertexFormat.h:32:8: note: ‘struct OutputVertexData’ declared here
  1114.  struct OutputVertexData
  1115.         ^~~~~~~~~~~~~~~~
  1116. [ 33%] Building CXX object Source/Core/VideoBackends/Software/CMakeFiles/videosoftware.dir/TransformUnit.cpp.o
  1117. [ 33%] Building CXX object Source/Core/VideoBackends/Software/CMakeFiles/videosoftware.dir/TextureSampler.cpp.o
  1118. [ 33%] Linking CXX static library libvideosoftware.a
  1119. [ 33%] Built target videosoftware
  1120. Scanning dependencies of target videonull
  1121. [ 33%] Building CXX object Source/Core/VideoBackends/Null/CMakeFiles/videonull.dir/NullTexture.cpp.o
  1122. [ 33%] Building CXX object Source/Core/VideoBackends/Null/CMakeFiles/videonull.dir/Render.cpp.o
  1123. [ 33%] Building CXX object Source/Core/VideoBackends/Null/CMakeFiles/videonull.dir/NullBackend.cpp.o
  1124. [ 33%] Building CXX object Source/Core/VideoBackends/Null/CMakeFiles/videonull.dir/VertexManager.cpp.o
  1125. [ 33%] Linking CXX static library libvideonull.a
  1126. [ 33%] Built target videonull
  1127. Scanning dependencies of target videoogl
  1128. [ 34%] Building CXX object Source/Core/VideoBackends/OGL/CMakeFiles/videoogl.dir/BoundingBox.cpp.o
  1129. [ 34%] Building CXX object Source/Core/VideoBackends/OGL/CMakeFiles/videoogl.dir/NativeVertexFormat.cpp.o
  1130. [ 34%] Building CXX object Source/Core/VideoBackends/OGL/CMakeFiles/videoogl.dir/main.cpp.o
  1131. [ 34%] Building CXX object Source/Core/VideoBackends/OGL/CMakeFiles/videoogl.dir/OGLShader.cpp.o
  1132. [ 34%] Building CXX object Source/Core/VideoBackends/OGL/CMakeFiles/videoogl.dir/OGLPipeline.cpp.o
  1133. [ 34%] Building CXX object Source/Core/VideoBackends/OGL/CMakeFiles/videoogl.dir/OGLTexture.cpp.o
  1134. [ 34%] Building CXX object Source/Core/VideoBackends/OGL/CMakeFiles/videoogl.dir/PerfQuery.cpp.o
  1135. [ 34%] Building CXX object Source/Core/VideoBackends/OGL/CMakeFiles/videoogl.dir/ProgramShaderCache.cpp.o
  1136. [ 35%] Building CXX object Source/Core/VideoBackends/OGL/CMakeFiles/videoogl.dir/Render.cpp.o
  1137. [ 35%] Building CXX object Source/Core/VideoBackends/OGL/CMakeFiles/videoogl.dir/StreamBuffer.cpp.o
  1138. [ 35%] Building CXX object Source/Core/VideoBackends/OGL/CMakeFiles/videoogl.dir/VertexManager.cpp.o
  1139. [ 35%] Building CXX object Source/Core/VideoBackends/OGL/CMakeFiles/videoogl.dir/SamplerCache.cpp.o
  1140. [ 35%] Linking CXX static library libvideoogl.a
  1141. [ 35%] Built target videoogl
  1142. Scanning dependencies of target videocommon
  1143. [ 35%] Building CXX object Source/Core/VideoCommon/CMakeFiles/videocommon.dir/AbstractFramebuffer.cpp.o
  1144. [ 36%] Building CXX object Source/Core/VideoCommon/CMakeFiles/videocommon.dir/AbstractStagingTexture.cpp.o
  1145. [ 36%] Building CXX object Source/Core/VideoCommon/CMakeFiles/videocommon.dir/AbstractTexture.cpp.o
  1146. [ 36%] Building CXX object Source/Core/VideoCommon/CMakeFiles/videocommon.dir/AsyncRequests.cpp.o
  1147. [ 36%] Building CXX object Source/Core/VideoCommon/CMakeFiles/videocommon.dir/AsyncShaderCompiler.cpp.o
  1148. [ 36%] Building CXX object Source/Core/VideoCommon/CMakeFiles/videocommon.dir/BoundingBox.cpp.o
  1149. [ 36%] Building CXX object Source/Core/VideoCommon/CMakeFiles/videocommon.dir/BPFunctions.cpp.o
  1150. [ 36%] Building CXX object Source/Core/VideoCommon/CMakeFiles/videocommon.dir/BPMemory.cpp.o
  1151. [ 36%] Building CXX object Source/Core/VideoCommon/CMakeFiles/videocommon.dir/CommandProcessor.cpp.o
  1152. [ 36%] Building CXX object Source/Core/VideoCommon/CMakeFiles/videocommon.dir/BPStructs.cpp.o
  1153. [ 36%] Building CXX object Source/Core/VideoCommon/CMakeFiles/videocommon.dir/Fifo.cpp.o
  1154. [ 38%] Building CXX object Source/Core/VideoCommon/CMakeFiles/videocommon.dir/CPMemory.cpp.o
  1155. [ 38%] Building CXX object Source/Core/VideoCommon/CMakeFiles/videocommon.dir/DriverDetails.cpp.o
  1156. [ 38%] Building CXX object Source/Core/VideoCommon/CMakeFiles/videocommon.dir/FPSCounter.cpp.o
  1157. [ 38%] Building CXX object Source/Core/VideoCommon/CMakeFiles/videocommon.dir/FramebufferManager.cpp.o
  1158. [ 38%] Building CXX object Source/Core/VideoCommon/CMakeFiles/videocommon.dir/FramebufferShaderGen.cpp.o
  1159. [ 38%] Building CXX object Source/Core/VideoCommon/CMakeFiles/videocommon.dir/GeometryShaderGen.cpp.o
  1160. [ 39%] Building CXX object Source/Core/VideoCommon/CMakeFiles/videocommon.dir/GeometryShaderManager.cpp.o
  1161. [ 39%] Building CXX object Source/Core/VideoCommon/CMakeFiles/videocommon.dir/HiresTextures.cpp.o
  1162. [ 39%] Building CXX object Source/Core/VideoCommon/CMakeFiles/videocommon.dir/HiresTextures_DDSLoader.cpp.o
  1163. /home/mrturcot/mitch/builds/dolphin-emu-git/src/dolphin-emu/Source/Core/VideoCommon/BPStructs.cpp: In function ‘void BPInit()’:
  1164. /home/mrturcot/mitch/builds/dolphin-emu-git/src/dolphin-emu/Source/Core/VideoCommon/BPStructs.cpp:43:34: warning: ‘void* memset(void*, int, size_t)’ clearing an object of type ‘struct BPMemory’ with no trivial copy-assignment; use value-initialization instead [-Wclass-memaccess]
  1165.    memset(&bpmem, 0, sizeof(bpmem));
  1166.                                   ^
  1167. In file included from /home/mrturcot/mitch/builds/dolphin-emu-git/src/dolphin-emu/Source/Core/VideoCommon/BPStructs.cpp:22:
  1168. /home/mrturcot/mitch/builds/dolphin-emu-git/src/dolphin-emu/Source/Core/VideoCommon/BPMemory.h:1030:8: note: ‘struct BPMemory’ declared here
  1169.  struct BPMemory
  1170.         ^~~~~~~~
  1171. [ 39%] Building CXX object Source/Core/VideoCommon/CMakeFiles/videocommon.dir/OnScreenDisplay.cpp.o
  1172. [ 39%] Building CXX object Source/Core/VideoCommon/CMakeFiles/videocommon.dir/LightingShaderGen.cpp.o
  1173. [ 39%] Building CXX object Source/Core/VideoCommon/CMakeFiles/videocommon.dir/IndexGenerator.cpp.o
  1174. [ 39%] Building CXX object Source/Core/VideoCommon/CMakeFiles/videocommon.dir/ImageWrite.cpp.o
  1175. [ 39%] Building CXX object Source/Core/VideoCommon/CMakeFiles/videocommon.dir/OpcodeDecoding.cpp.o
  1176. [ 39%] Building CXX object Source/Core/VideoCommon/CMakeFiles/videocommon.dir/PerfQueryBase.cpp.o
  1177. [ 40%] Building CXX object Source/Core/VideoCommon/CMakeFiles/videocommon.dir/PixelEngine.cpp.o
  1178. [ 40%] Building CXX object Source/Core/VideoCommon/CMakeFiles/videocommon.dir/PixelShaderGen.cpp.o
  1179. [ 40%] Building CXX object Source/Core/VideoCommon/CMakeFiles/videocommon.dir/PostProcessing.cpp.o
  1180. [ 40%] Building CXX object Source/Core/VideoCommon/CMakeFiles/videocommon.dir/PixelShaderManager.cpp.o
  1181. [ 41%] Building CXX object Source/Core/VideoCommon/CMakeFiles/videocommon.dir/Statistics.cpp.o
  1182. [ 41%] Building CXX object Source/Core/VideoCommon/CMakeFiles/videocommon.dir/RenderBase.cpp.o
  1183. [ 41%] Building CXX object Source/Core/VideoCommon/CMakeFiles/videocommon.dir/RenderState.cpp.o
  1184. [ 41%] Building CXX object Source/Core/VideoCommon/CMakeFiles/videocommon.dir/ShaderCache.cpp.o
  1185. [ 41%] Building CXX object Source/Core/VideoCommon/CMakeFiles/videocommon.dir/ShaderGenCommon.cpp.o
  1186. [ 41%] Building CXX object Source/Core/VideoCommon/CMakeFiles/videocommon.dir/UberShaderCommon.cpp.o
  1187. [ 41%] Building CXX object Source/Core/VideoCommon/CMakeFiles/videocommon.dir/UberShaderPixel.cpp.o
  1188. [ 41%] Building CXX object Source/Core/VideoCommon/CMakeFiles/videocommon.dir/UberShaderVertex.cpp.o
  1189. [ 41%] Building CXX object Source/Core/VideoCommon/CMakeFiles/videocommon.dir/TextureConfig.cpp.o
  1190. [ 41%] Building CXX object Source/Core/VideoCommon/CMakeFiles/videocommon.dir/TextureConversionShader.cpp.o
  1191. [ 41%] Building CXX object Source/Core/VideoCommon/CMakeFiles/videocommon.dir/TextureCacheBase.cpp.o
  1192. [ 41%] Building CXX object Source/Core/VideoCommon/CMakeFiles/videocommon.dir/TextureConverterShaderGen.cpp.o
  1193. [ 42%] Building CXX object Source/Core/VideoCommon/CMakeFiles/videocommon.dir/TextureDecoder_Common.cpp.o
  1194. [ 42%] Building CXX object Source/Core/VideoCommon/CMakeFiles/videocommon.dir/VertexLoader.cpp.o
  1195. [ 42%] Building CXX object Source/Core/VideoCommon/CMakeFiles/videocommon.dir/VertexLoaderManager.cpp.o
  1196. [ 42%] Building CXX object Source/Core/VideoCommon/CMakeFiles/videocommon.dir/VertexLoaderBase.cpp.o
  1197. [ 42%] Building CXX object Source/Core/VideoCommon/CMakeFiles/videocommon.dir/VertexLoader_Color.cpp.o
  1198. [ 42%] Building CXX object Source/Core/VideoCommon/CMakeFiles/videocommon.dir/VertexLoader_Normal.cpp.o
  1199. [ 42%] Building CXX object Source/Core/VideoCommon/CMakeFiles/videocommon.dir/VertexLoader_Position.cpp.o
  1200. [ 42%] Building CXX object Source/Core/VideoCommon/CMakeFiles/videocommon.dir/VertexLoader_TextCoord.cpp.o
  1201. [ 43%] Building CXX object Source/Core/VideoCommon/CMakeFiles/videocommon.dir/VertexManagerBase.cpp.o
  1202. [ 43%] Building CXX object Source/Core/VideoCommon/CMakeFiles/videocommon.dir/VertexShaderGen.cpp.o
  1203. [ 43%] Building CXX object Source/Core/VideoCommon/CMakeFiles/videocommon.dir/VertexShaderManager.cpp.o
  1204. [ 43%] Building CXX object Source/Core/VideoCommon/CMakeFiles/videocommon.dir/VideoConfig.cpp.o
  1205. [ 43%] Building CXX object Source/Core/VideoCommon/CMakeFiles/videocommon.dir/VideoBackendBase.cpp.o
  1206. [ 43%] Building CXX object Source/Core/VideoCommon/CMakeFiles/videocommon.dir/VideoState.cpp.o
  1207. [ 43%] Building CXX object Source/Core/VideoCommon/CMakeFiles/videocommon.dir/XFMemory.cpp.o
  1208. [ 43%] Building CXX object Source/Core/VideoCommon/CMakeFiles/videocommon.dir/XFStructs.cpp.o
  1209. /home/mrturcot/mitch/builds/dolphin-emu-git/src/dolphin-emu/Source/Core/VideoCommon/VideoBackendBase.cpp: In member function ‘void VideoBackendBase::InitializeShared()’:
  1210. /home/mrturcot/mitch/builds/dolphin-emu-git/src/dolphin-emu/Source/Core/VideoCommon/VideoBackendBase.cpp:277:54: warning: ‘void* memset(void*, int, size_t)’ clearing an object of non-trivial type ‘struct CPState’; use assignment or value-initialization instead [-Wclass-memaccess]
  1211.    memset(&g_main_cp_state, 0, sizeof(g_main_cp_state));
  1212.                                                       ^
  1213. In file included from /home/mrturcot/mitch/builds/dolphin-emu-git/src/dolphin-emu/Source/Core/VideoCommon/VideoBackendBase.cpp:32:
  1214. /home/mrturcot/mitch/builds/dolphin-emu-git/src/dolphin-emu/Source/Core/VideoCommon/CPMemory.h:243:8: note: ‘struct CPState’ declared here
  1215.  struct CPState final
  1216.         ^~~~~~~
  1217. /home/mrturcot/mitch/builds/dolphin-emu-git/src/dolphin-emu/Source/Core/VideoCommon/VideoBackendBase.cpp:278:66: warning: ‘void* memset(void*, int, size_t)’ clearing an object of non-trivial type ‘struct CPState’; use assignment or value-initialization instead [-Wclass-memaccess]
  1218.    memset(&g_preprocess_cp_state, 0, sizeof(g_preprocess_cp_state));
  1219.                                                                   ^
  1220. In file included from /home/mrturcot/mitch/builds/dolphin-emu-git/src/dolphin-emu/Source/Core/VideoCommon/VideoBackendBase.cpp:32:
  1221. /home/mrturcot/mitch/builds/dolphin-emu-git/src/dolphin-emu/Source/Core/VideoCommon/CPMemory.h:243:8: note: ‘struct CPState’ declared here
  1222.  struct CPState final
  1223.         ^~~~~~~
  1224. [ 43%] Building CXX object Source/Core/VideoCommon/CMakeFiles/videocommon.dir/TextureDecoder_x64.cpp.o
  1225. [ 44%] Building CXX object Source/Core/VideoCommon/CMakeFiles/videocommon.dir/VertexLoaderX64.cpp.o
  1226. [ 44%] Building CXX object Source/Core/VideoCommon/CMakeFiles/videocommon.dir/AVIDump.cpp.o
  1227. [ 44%] Linking CXX static library libvideocommon.a
  1228. [ 44%] Built target videocommon
  1229. Scanning dependencies of target core
  1230. [ 44%] Building CXX object Source/Core/Core/CMakeFiles/core.dir/Analytics.cpp.o
  1231. [ 44%] Building CXX object Source/Core/Core/CMakeFiles/core.dir/ActionReplay.cpp.o
  1232. [ 44%] Building CXX object Source/Core/Core/CMakeFiles/core.dir/ARDecrypt.cpp.o
  1233. [ 44%] Building CXX object Source/Core/Core/CMakeFiles/core.dir/BootManager.cpp.o
  1234. [ 44%] Building CXX object Source/Core/Core/CMakeFiles/core.dir/ConfigManager.cpp.o
  1235. [ 44%] Building CXX object Source/Core/Core/CMakeFiles/core.dir/Core.cpp.o
  1236. [ 44%] Building CXX object Source/Core/Core/CMakeFiles/core.dir/DSPEmulator.cpp.o
  1237. [ 45%] Building CXX object Source/Core/Core/CMakeFiles/core.dir/CoreTiming.cpp.o
  1238. [ 45%] Building CXX object Source/Core/Core/CMakeFiles/core.dir/GeckoCode.cpp.o
  1239. [ 45%] Building CXX object Source/Core/Core/CMakeFiles/core.dir/GeckoCodeConfig.cpp.o
  1240. [ 45%] Building CXX object Source/Core/Core/CMakeFiles/core.dir/HotkeyManager.cpp.o
  1241. [ 45%] Building CXX object Source/Core/Core/CMakeFiles/core.dir/MemTools.cpp.o
  1242. [ 45%] Building CXX object Source/Core/Core/CMakeFiles/core.dir/NetPlayClient.cpp.o
  1243. [ 45%] Building CXX object Source/Core/Core/CMakeFiles/core.dir/Movie.cpp.o
  1244. [ 46%] Building CXX object Source/Core/Core/CMakeFiles/core.dir/NetPlayServer.cpp.o
  1245. [ 46%] Building CXX object Source/Core/Core/CMakeFiles/core.dir/PatchEngine.cpp.o
  1246. [ 46%] Building CXX object Source/Core/Core/CMakeFiles/core.dir/State.cpp.o
  1247. [ 46%] Building CXX object Source/Core/Core/CMakeFiles/core.dir/TitleDatabase.cpp.o
  1248. [ 46%] Building CXX object Source/Core/Core/CMakeFiles/core.dir/SysConf.cpp.o
  1249. [ 46%] Building CXX object Source/Core/Core/CMakeFiles/core.dir/WiiRoot.cpp.o
  1250. [ 46%] Building CXX object Source/Core/Core/CMakeFiles/core.dir/WiiUtils.cpp.o
  1251. [ 46%] Building CXX object Source/Core/Core/CMakeFiles/core.dir/Boot/Boot_BS2Emu.cpp.o
  1252. [ 46%] Building CXX object Source/Core/Core/CMakeFiles/core.dir/Boot/Boot.cpp.o
  1253. [ 47%] Building CXX object Source/Core/Core/CMakeFiles/core.dir/Boot/Boot_WiiWAD.cpp.o
  1254. /home/mrturcot/mitch/builds/dolphin-emu-git/src/dolphin-emu/Source/Core/Core/State.cpp: In function ‘void State::CompressAndDumpState(State::CompressAndDumpState_args)’:
  1255. /home/mrturcot/mitch/builds/dolphin-emu-git/src/dolphin-emu/Source/Core/Core/State.cpp:340:10: warning: ‘char* strncpy(char*, const char*, size_t)’ specified bound 6 equals destination size [-Wstringop-truncation]
  1256.    strncpy(header.gameID, SConfig::GetInstance().GetGameID().c_str(), 6);
  1257.    ~~~~~~~^~~~~~~~~~~~~~~~~~~~~~~~~~~~~~~~~~~~~~~~~~~~~~~~~~~~~~~~~~~~~~
  1258. [ 47%] Building CXX object Source/Core/Core/CMakeFiles/core.dir/Boot/DolReader.cpp.o
  1259. [ 47%] Building CXX object Source/Core/Core/CMakeFiles/core.dir/Boot/ElfReader.cpp.o
  1260. In file included from /home/mrturcot/mitch/builds/dolphin-emu-git/src/dolphin-emu/Source/Core/Core/Boot/Boot.h:19,
  1261.                  from /home/mrturcot/mitch/builds/dolphin-emu-git/src/dolphin-emu/Source/Core/Core/Boot/Boot_BS2Emu.cpp:17:
  1262. /home/mrturcot/mitch/builds/dolphin-emu-git/src/dolphin-emu/Source/Core/DiscIO/Volume.h: In static member function ‘static bool CBoot::RunApploader(bool, const DiscIO::Volume&)’:
  1263. /home/mrturcot/mitch/builds/dolphin-emu-git/src/dolphin-emu/Source/Core/DiscIO/Volume.h:52:15: warning: ‘<anonymous>’ may be used uninitialized in this function [-Wmaybe-uninitialized]
  1264.        return {};
  1265.                ^
  1266. /home/mrturcot/mitch/builds/dolphin-emu-git/src/dolphin-emu/Source/Core/DiscIO/Volume.h:52:15: warning: ‘<anonymous>’ may be used uninitialized in this function [-Wmaybe-uninitialized]
  1267.        return {};
  1268.                ^
  1269. /home/mrturcot/mitch/builds/dolphin-emu-git/src/dolphin-emu/Source/Core/DiscIO/Volume.h:52:15: warning: ‘<anonymous>’ may be used uninitialized in this function [-Wmaybe-uninitialized]
  1270.        return {};
  1271.                ^
  1272. [ 47%] Building CXX object Source/Core/Core/CMakeFiles/core.dir/Config/GraphicsSettings.cpp.o
  1273. [ 47%] Building CXX object Source/Core/Core/CMakeFiles/core.dir/Config/MainSettings.cpp.o
  1274. [ 47%] Building CXX object Source/Core/Core/CMakeFiles/core.dir/Config/NetplaySettings.cpp.o
  1275. [ 47%] Building CXX object Source/Core/Core/CMakeFiles/core.dir/Config/SYSCONFSettings.cpp.o
  1276. [ 47%] Building CXX object Source/Core/Core/CMakeFiles/core.dir/Config/UISettings.cpp.o
  1277. [ 48%] Building CXX object Source/Core/Core/CMakeFiles/core.dir/Config/WiimoteInputSettings.cpp.o
  1278. [ 48%] Building CXX object Source/Core/Core/CMakeFiles/core.dir/ConfigLoaders/BaseConfigLoader.cpp.o
  1279. [ 48%] Building CXX object Source/Core/Core/CMakeFiles/core.dir/ConfigLoaders/GameConfigLoader.cpp.o
  1280. [ 48%] Building CXX object Source/Core/Core/CMakeFiles/core.dir/ConfigLoaders/IsSettingSaveable.cpp.o
  1281. [ 48%] Building CXX object Source/Core/Core/CMakeFiles/core.dir/ConfigLoaders/NetPlayConfigLoader.cpp.o
  1282. [ 48%] Building CXX object Source/Core/Core/CMakeFiles/core.dir/ConfigLoaders/MovieConfigLoader.cpp.o
  1283. [ 48%] Building CXX object Source/Core/Core/CMakeFiles/core.dir/Debugger/Debugger_SymbolMap.cpp.o
  1284. [ 48%] Building CXX object Source/Core/Core/CMakeFiles/core.dir/Debugger/Dump.cpp.o
  1285. [ 50%] Building CXX object Source/Core/Core/CMakeFiles/core.dir/Debugger/PPCDebugInterface.cpp.o
  1286. [ 50%] Building CXX object Source/Core/Core/CMakeFiles/core.dir/Debugger/RSO.cpp.o
  1287. [ 50%] Building CXX object Source/Core/Core/CMakeFiles/core.dir/DSP/DSPAccelerator.cpp.o
  1288. [ 50%] Building CXX object Source/Core/Core/CMakeFiles/core.dir/DSP/DSPAssembler.cpp.o
  1289. [ 50%] Building CXX object Source/Core/Core/CMakeFiles/core.dir/DSP/DSPCaptureLogger.cpp.o
  1290. [ 50%] Building CXX object Source/Core/Core/CMakeFiles/core.dir/DSP/DSPCore.cpp.o
  1291. [ 50%] Building CXX object Source/Core/Core/CMakeFiles/core.dir/DSP/DSPCodeUtil.cpp.o
  1292. [ 50%] Building CXX object Source/Core/Core/CMakeFiles/core.dir/DSP/DSPAnalyzer.cpp.o
  1293. [ 51%] Building CXX object Source/Core/Core/CMakeFiles/core.dir/DSP/DSPDisassembler.cpp.o
  1294. [ 51%] Building CXX object Source/Core/Core/CMakeFiles/core.dir/DSP/DSPHWInterface.cpp.o
  1295. [ 51%] Building CXX object Source/Core/Core/CMakeFiles/core.dir/DSP/DSPMemoryMap.cpp.o
  1296. [ 51%] Building CXX object Source/Core/Core/CMakeFiles/core.dir/DSP/DSPStacks.cpp.o
  1297. [ 51%] Building CXX object Source/Core/Core/CMakeFiles/core.dir/DSP/DSPTables.cpp.o
  1298. [ 51%] Building CXX object Source/Core/Core/CMakeFiles/core.dir/DSP/LabelMap.cpp.o
  1299. [ 51%] Building CXX object Source/Core/Core/CMakeFiles/core.dir/DSP/Interpreter/DSPIntArithmetic.cpp.o
  1300. [ 51%] Building CXX object Source/Core/Core/CMakeFiles/core.dir/DSP/Interpreter/DSPIntBranch.cpp.o
  1301. [ 51%] Building CXX object Source/Core/Core/CMakeFiles/core.dir/DSP/Interpreter/DSPIntCCUtil.cpp.o
  1302. [ 52%] Building CXX object Source/Core/Core/CMakeFiles/core.dir/DSP/Interpreter/DSPInterpreter.cpp.o
  1303. [ 52%] Building CXX object Source/Core/Core/CMakeFiles/core.dir/DSP/Interpreter/DSPIntExtOps.cpp.o
  1304. [ 52%] Building CXX object Source/Core/Core/CMakeFiles/core.dir/DSP/Interpreter/DSPIntLoadStore.cpp.o
  1305. [ 52%] Building CXX object Source/Core/Core/CMakeFiles/core.dir/DSP/Interpreter/DSPIntMisc.cpp.o
  1306. [ 52%] Building CXX object Source/Core/Core/CMakeFiles/core.dir/DSP/Interpreter/DSPIntMultiplier.cpp.o
  1307. [ 52%] Building CXX object Source/Core/Core/CMakeFiles/core.dir/DSP/Interpreter/DSPIntTables.cpp.o
  1308. [ 52%] Building CXX object Source/Core/Core/CMakeFiles/core.dir/DSP/Jit/DSPEmitterBase.cpp.o
  1309. [ 53%] Building CXX object Source/Core/Core/CMakeFiles/core.dir/FifoPlayer/FifoDataFile.cpp.o
  1310. [ 53%] Building CXX object Source/Core/Core/CMakeFiles/core.dir/FifoPlayer/FifoAnalyzer.cpp.o
  1311. [ 53%] Building CXX object Source/Core/Core/CMakeFiles/core.dir/FifoPlayer/FifoPlaybackAnalyzer.cpp.o
  1312. [ 53%] Building CXX object Source/Core/Core/CMakeFiles/core.dir/FifoPlayer/FifoPlayer.cpp.o
  1313. [ 53%] Building CXX object Source/Core/Core/CMakeFiles/core.dir/HLE/HLE_Misc.cpp.o
  1314. [ 53%] Building CXX object Source/Core/Core/CMakeFiles/core.dir/FifoPlayer/FifoRecorder.cpp.o
  1315. [ 53%] Building CXX object Source/Core/Core/CMakeFiles/core.dir/FifoPlayer/FifoRecordAnalyzer.cpp.o
  1316. [ 53%] Building CXX object Source/Core/Core/CMakeFiles/core.dir/HLE/HLE.cpp.o
  1317. [ 53%] Building CXX object Source/Core/Core/CMakeFiles/core.dir/HLE/HLE_OS.cpp.o
  1318. [ 54%] Building CXX object Source/Core/Core/CMakeFiles/core.dir/HLE/HLE_VarArgs.cpp.o
  1319. [ 54%] Building CXX object Source/Core/Core/CMakeFiles/core.dir/HW/AudioInterface.cpp.o
  1320. [ 54%] Building CXX object Source/Core/Core/CMakeFiles/core.dir/HW/CPU.cpp.o
  1321. [ 54%] Building CXX object Source/Core/Core/CMakeFiles/core.dir/HW/DSP.cpp.o
  1322. [ 54%] Building CXX object Source/Core/Core/CMakeFiles/core.dir/HW/DSPHLE/UCodes/AX.cpp.o
  1323. [ 54%] Building CXX object Source/Core/Core/CMakeFiles/core.dir/HW/DSPHLE/UCodes/AXWii.cpp.o
  1324. [ 54%] Building CXX object Source/Core/Core/CMakeFiles/core.dir/HW/DSPHLE/UCodes/CARD.cpp.o
  1325. [ 54%] Building CXX object Source/Core/Core/CMakeFiles/core.dir/HW/DSPHLE/UCodes/GBA.cpp.o
  1326. [ 55%] Building CXX object Source/Core/Core/CMakeFiles/core.dir/HW/DSPHLE/UCodes/ROM.cpp.o
  1327. [ 55%] Building CXX object Source/Core/Core/CMakeFiles/core.dir/HW/DSPHLE/UCodes/INIT.cpp.o
  1328. [ 55%] Building CXX object Source/Core/Core/CMakeFiles/core.dir/HW/DSPHLE/UCodes/UCodes.cpp.o
  1329. [ 55%] Building CXX object Source/Core/Core/CMakeFiles/core.dir/HW/DSPHLE/MailHandler.cpp.o
  1330. [ 55%] Building CXX object Source/Core/Core/CMakeFiles/core.dir/HW/DSPHLE/UCodes/Zelda.cpp.o
  1331. [ 55%] Building CXX object Source/Core/Core/CMakeFiles/core.dir/HW/DSPHLE/DSPHLE.cpp.o
  1332. [ 55%] Building CXX object Source/Core/Core/CMakeFiles/core.dir/HW/DSPLLE/DSPDebugInterface.cpp.o
  1333. [ 55%] Building CXX object Source/Core/Core/CMakeFiles/core.dir/HW/DSPLLE/DSPHost.cpp.o
  1334. [ 55%] Building CXX object Source/Core/Core/CMakeFiles/core.dir/HW/DSPLLE/DSPSymbols.cpp.o
  1335. [ 56%] Building CXX object Source/Core/Core/CMakeFiles/core.dir/HW/DSPLLE/DSPLLEGlobals.cpp.o
  1336. [ 56%] Building CXX object Source/Core/Core/CMakeFiles/core.dir/HW/DVD/DVDMath.cpp.o
  1337. [ 56%] Building CXX object Source/Core/Core/CMakeFiles/core.dir/HW/DVD/DVDInterface.cpp.o
  1338. [ 56%] Building CXX object Source/Core/Core/CMakeFiles/core.dir/HW/DVD/DVDThread.cpp.o
  1339. [ 56%] Building CXX object Source/Core/Core/CMakeFiles/core.dir/HW/DSPLLE/DSPLLE.cpp.o
  1340. [ 56%] Building CXX object Source/Core/Core/CMakeFiles/core.dir/HW/DVD/FileMonitor.cpp.o
  1341. [ 56%] Building CXX object Source/Core/Core/CMakeFiles/core.dir/HW/EXI/EXI.cpp.o
  1342. [ 56%] Building CXX object Source/Core/Core/CMakeFiles/core.dir/HW/EXI/EXI_Channel.cpp.o
  1343. [ 57%] Building CXX object Source/Core/Core/CMakeFiles/core.dir/HW/EXI/EXI_Device.cpp.o
  1344. [ 57%] Building CXX object Source/Core/Core/CMakeFiles/core.dir/HW/EXI/EXI_DeviceAD16.cpp.o
  1345. [ 57%] Building CXX object Source/Core/Core/CMakeFiles/core.dir/HW/EXI/EXI_DeviceAGP.cpp.o
  1346. [ 57%] Building CXX object Source/Core/Core/CMakeFiles/core.dir/HW/EXI/EXI_DeviceDummy.cpp.o
  1347. [ 57%] Building CXX object Source/Core/Core/CMakeFiles/core.dir/HW/EXI/EXI_DeviceEthernet.cpp.o
  1348. [ 57%] Building CXX object Source/Core/Core/CMakeFiles/core.dir/HW/EXI/EXI_DeviceGecko.cpp.o
  1349. [ 57%] Building CXX object Source/Core/Core/CMakeFiles/core.dir/HW/EXI/EXI_DeviceIPL.cpp.o
  1350. [ 57%] Building CXX object Source/Core/Core/CMakeFiles/core.dir/HW/GCKeyboard.cpp.o
  1351. [ 57%] Building CXX object Source/Core/Core/CMakeFiles/core.dir/HW/EXI/EXI_DeviceMemoryCard.cpp.o
  1352. [ 58%] Building CXX object Source/Core/Core/CMakeFiles/core.dir/HW/EXI/EXI_DeviceMic.cpp.o
  1353. /home/mrturcot/mitch/builds/dolphin-emu-git/src/dolphin-emu/Source/Core/Core/HW/EXI/EXI_DeviceIPL.cpp: In member function ‘virtual void ExpansionInterface::CEXIIPL::TransferByte(u8&)’:
  1354. /home/mrturcot/mitch/builds/dolphin-emu-git/src/dolphin-emu/Source/Core/Core/HW/EXI/EXI_DeviceIPL.cpp:290:30: warning: comparison of unsigned expression >= 0 is always true [-Wtype-limits]
  1355.  #define IN_RANGE(x) (address >= x##_BASE && address < x##_BASE + x##_SIZE)
  1356.                       ~~~~~~~~^~~~~~~~~~~~~~~~~~~~~~~~~~~~~~~~~~~~~~~~~~~~~
  1357.  #define DEV_ADDR(x) (address - x##_BASE)
  1358.  ~~~~~~~~~~~~~~~~~~~~~~~~~~~~~~~~~~~~~~~~
  1359.  #define DEV_ADDR_CURSOR(x) (DEV_ADDR(x) + m_cursor++)
  1360.  ~~~~~~~~~~~~~~~~~~~~~~~~~~~~~~~~~~~~~~~~~~~~~~~~~~~~~
  1361.  
  1362.                                
  1363.      auto UartFifoAccess = [&]() {
  1364.      ~~~~~~~~~~~~~~~~~~~~~~~~~~~~~
  1365.        if (m_command.is_write())
  1366.        ~~~~~~~~~~~~~~~~~~~~~~~~~
  1367.        {
  1368.        ~                      
  1369.          if (data != '\0')
  1370.          ~~~~~~~~~~~~~~~~~    
  1371.            m_buffer += data;
  1372.            ~~~~~~~~~~~~~~~~~  
  1373.  
  1374.                                
  1375.          if (data == '\r')
  1376.          ~~~~~~~~~~~~~~~~~    
  1377.          {
  1378.          ~                    
  1379.            NOTICE_LOG(OSREPORT, "%s", SHIFTJISToUTF8(m_buffer).c_str());
  1380.            ~~~~~~~~~~~~~~~~~~~~~~~~~~~~~~~~~~~~~~~~~~~~~~~~~~~~~~~~~~~~~
  1381.            m_buffer.clear();
  1382.            ~~~~~~~~~~~~~~~~~  
  1383.          }
  1384.          ~                    
  1385.        }
  1386.        ~                      
  1387.        else
  1388.        ~~~~                    
  1389.        {
  1390.        ~                      
  1391.          // "Queue Length"... return 0 cause we're instant
  1392.          ~~~~~~~~~~~~~~~~~~~~~~~~~~~~~~~~~~~~~~~~~~~~~~~~~
  1393.          data = 0;
  1394.          ~~~~~~~~~            
  1395.        }
  1396.        ~                      
  1397.      };
  1398.      ~~                        
  1399.  
  1400.                                
  1401.      if (IN_RANGE(ROM))
  1402.      ~~~~~~~~~~~~~~~~          
  1403. /home/mrturcot/mitch/builds/dolphin-emu-git/src/dolphin-emu/Source/Core/Core/HW/EXI/EXI_DeviceIPL.cpp:313:9: note: in expansion of macro ‘IN_RANGE’
  1404.      if (IN_RANGE(ROM))
  1405.          ^~~~~~~~
  1406. [ 58%] Building CXX object Source/Core/Core/CMakeFiles/core.dir/HW/GCKeyboardEmu.cpp.o
  1407. [ 58%] Building CXX object Source/Core/Core/CMakeFiles/core.dir/HW/GCMemcard/GCMemcardDirectory.cpp.o
  1408. [ 58%] Building CXX object Source/Core/Core/CMakeFiles/core.dir/HW/GCMemcard/GCMemcard.cpp.o
  1409. [ 58%] Building CXX object Source/Core/Core/CMakeFiles/core.dir/HW/GCPad.cpp.o
  1410. [ 58%] Building CXX object Source/Core/Core/CMakeFiles/core.dir/HW/GCMemcard/GCMemcardRaw.cpp.o
  1411. [ 59%] Building CXX object Source/Core/Core/CMakeFiles/core.dir/HW/GPFifo.cpp.o
  1412. [ 59%] Building CXX object Source/Core/Core/CMakeFiles/core.dir/HW/GCPadEmu.cpp.o
  1413. [ 59%] Building CXX object Source/Core/Core/CMakeFiles/core.dir/HW/HW.cpp.o
  1414. [ 59%] Building CXX object Source/Core/Core/CMakeFiles/core.dir/HW/Memmap.cpp.o
  1415. [ 59%] Building CXX object Source/Core/Core/CMakeFiles/core.dir/HW/MemoryInterface.cpp.o
  1416. [ 59%] Building CXX object Source/Core/Core/CMakeFiles/core.dir/HW/MMIO.cpp.o
  1417. /home/mrturcot/mitch/builds/dolphin-emu-git/src/dolphin-emu/Source/Core/Core/HW/GCMemcard/GCMemcard.cpp: In member function ‘u32 GCMemcard::RemoveFile(u8)’:
  1418. /home/mrturcot/mitch/builds/dolphin-emu-git/src/dolphin-emu/Source/Core/Core/HW/GCMemcard/GCMemcard.cpp:767:63: warning: ‘void* memset(void*, int, size_t)’ writing to an object of non-trivial type ‘std::array<DEntry, 127>::value_type’ {aka ‘struct DEntry’}; use assignment instead [-Wclass-memaccess]
  1419.    memset(&(UpdatedDir.m_dir_entries[index]), 0xFF, DENTRY_SIZE);
  1420.                                                                ^
  1421. In file included from /home/mrturcot/mitch/builds/dolphin-emu-git/src/dolphin-emu/Source/Core/Core/HW/GCMemcard/GCMemcard.cpp:5:
  1422. /home/mrturcot/mitch/builds/dolphin-emu-git/src/dolphin-emu/Source/Core/Core/HW/GCMemcard/GCMemcard.h:189:8: note: ‘std::array<DEntry, 127>::value_type’ {aka ‘struct DEntry’} declared here
  1423.  struct DEntry
  1424.         ^~~~~~
  1425. /home/mrturcot/mitch/builds/dolphin-emu-git/src/dolphin-emu/Source/Core/Core/HW/GCMemcard/GCMemcard.cpp: In member function ‘bool GCMemcard::Format(bool, u16)’:
  1426. /home/mrturcot/mitch/builds/dolphin-emu-git/src/dolphin-emu/Source/Core/Core/HW/GCMemcard/GCMemcard.cpp:1242:43: warning: ‘void* memset(void*, int, size_t)’ writing to an object of non-trivial type ‘struct Header’; use assignment instead [-Wclass-memaccess]
  1427.    memset(&m_header_block, 0xFF, BLOCK_SIZE);
  1428.                                            ^
  1429. In file included from /home/mrturcot/mitch/builds/dolphin-emu-git/src/dolphin-emu/Source/Core/Core/HW/GCMemcard/GCMemcard.cpp:5:
  1430. /home/mrturcot/mitch/builds/dolphin-emu-git/src/dolphin-emu/Source/Core/Core/HW/GCMemcard/GCMemcard.h:103:8: note: ‘struct Header’ declared here
  1431.  struct Header
  1432.         ^~~~~~
  1433. /home/mrturcot/mitch/builds/dolphin-emu-git/src/dolphin-emu/Source/Core/Core/HW/GCMemcard/GCMemcard.cpp:1243:50: warning: ‘void* memset(void*, int, size_t)’ writing to an object of non-trivial type ‘std::array<Directory, 2>::value_type’ {aka ‘struct Directory’}; use assignment instead [-Wclass-memaccess]
  1434.    memset(&m_directory_blocks[0], 0xFF, BLOCK_SIZE);
  1435.                                                   ^
  1436. In file included from /home/mrturcot/mitch/builds/dolphin-emu-git/src/dolphin-emu/Source/Core/Core/HW/GCMemcard/GCMemcard.cpp:5:
  1437. /home/mrturcot/mitch/builds/dolphin-emu-git/src/dolphin-emu/Source/Core/Core/HW/GCMemcard/GCMemcard.h:273:8: note: ‘std::array<Directory, 2>::value_type’ {aka ‘struct Directory’} declared here
  1438.  struct Directory
  1439.         ^~~~~~~~~
  1440. /home/mrturcot/mitch/builds/dolphin-emu-git/src/dolphin-emu/Source/Core/Core/HW/GCMemcard/GCMemcard.cpp:1244:50: warning: ‘void* memset(void*, int, size_t)’ writing to an object of non-trivial type ‘std::array<Directory, 2>::value_type’ {aka ‘struct Directory’}; use assignment instead [-Wclass-memaccess]
  1441.    memset(&m_directory_blocks[1], 0xFF, BLOCK_SIZE);
  1442.                                                   ^
  1443. In file included from /home/mrturcot/mitch/builds/dolphin-emu-git/src/dolphin-emu/Source/Core/Core/HW/GCMemcard/GCMemcard.cpp:5:
  1444. /home/mrturcot/mitch/builds/dolphin-emu-git/src/dolphin-emu/Source/Core/Core/HW/GCMemcard/GCMemcard.h:273:8: note: ‘std::array<Directory, 2>::value_type’ {aka ‘struct Directory’} declared here
  1445.  struct Directory
  1446.         ^~~~~~~~~
  1447. /home/mrturcot/mitch/builds/dolphin-emu-git/src/dolphin-emu/Source/Core/Core/HW/GCMemcard/GCMemcard.cpp:1245:41: warning: ‘void* memset(void*, int, size_t)’ clearing an object of non-trivial type ‘std::array<BlockAlloc, 2>::value_type’ {aka ‘struct BlockAlloc’}; use assignment or value-initialization instead [-Wclass-memaccess]
  1448.    memset(&m_bat_blocks[0], 0, BLOCK_SIZE);
  1449.                                          ^
  1450. In file included from /home/mrturcot/mitch/builds/dolphin-emu-git/src/dolphin-emu/Source/Core/Core/HW/GCMemcard/GCMemcard.cpp:5:
  1451. /home/mrturcot/mitch/builds/dolphin-emu-git/src/dolphin-emu/Source/Core/Core/HW/GCMemcard/GCMemcard.h:296:8: note: ‘std::array<BlockAlloc, 2>::value_type’ {aka ‘struct BlockAlloc’} declared here
  1452.  struct BlockAlloc
  1453.         ^~~~~~~~~~
  1454. /home/mrturcot/mitch/builds/dolphin-emu-git/src/dolphin-emu/Source/Core/Core/HW/GCMemcard/GCMemcard.cpp:1246:41: warning: ‘void* memset(void*, int, size_t)’ clearing an object of non-trivial type ‘std::array<BlockAlloc, 2>::value_type’ {aka ‘struct BlockAlloc’}; use assignment or value-initialization instead [-Wclass-memaccess]
  1455.    memset(&m_bat_blocks[1], 0, BLOCK_SIZE);
  1456.                                          ^
  1457. In file included from /home/mrturcot/mitch/builds/dolphin-emu-git/src/dolphin-emu/Source/Core/Core/HW/GCMemcard/GCMemcard.cpp:5:
  1458. /home/mrturcot/mitch/builds/dolphin-emu-git/src/dolphin-emu/Source/Core/Core/HW/GCMemcard/GCMemcard.h:296:8: note: ‘std::array<BlockAlloc, 2>::value_type’ {aka ‘struct BlockAlloc’} declared here
  1459.  struct BlockAlloc
  1460.         ^~~~~~~~~~
  1461. [ 59%] Building CXX object Source/Core/Core/CMakeFiles/core.dir/HW/ProcessorInterface.cpp.o
  1462. [ 59%] Building CXX object Source/Core/Core/CMakeFiles/core.dir/HW/SI/SI.cpp.o
  1463. [ 60%] Building CXX object Source/Core/Core/CMakeFiles/core.dir/HW/SI/SI_DeviceGBA.cpp.o
  1464. [ 60%] Building CXX object Source/Core/Core/CMakeFiles/core.dir/HW/SI/SI_DeviceDanceMat.cpp.o
  1465. [ 60%] Building CXX object Source/Core/Core/CMakeFiles/core.dir/HW/SI/SI_Device.cpp.o
  1466. [ 60%] Building CXX object Source/Core/Core/CMakeFiles/core.dir/HW/SI/SI_DeviceGCAdapter.cpp.o
  1467. [ 60%] Building CXX object Source/Core/Core/CMakeFiles/core.dir/HW/SI/SI_DeviceGCController.cpp.o
  1468. [ 60%] Building CXX object Source/Core/Core/CMakeFiles/core.dir/HW/SI/SI_DeviceGCSteeringWheel.cpp.o
  1469. [ 60%] Building CXX object Source/Core/Core/CMakeFiles/core.dir/HW/SI/SI_DeviceKeyboard.cpp.o
  1470. [ 60%] Building CXX object Source/Core/Core/CMakeFiles/core.dir/HW/SI/SI_DeviceNull.cpp.o
  1471. [ 60%] Building CXX object Source/Core/Core/CMakeFiles/core.dir/HW/Sram.cpp.o
  1472. [ 61%] Building CXX object Source/Core/Core/CMakeFiles/core.dir/HW/StreamADPCM.cpp.o
  1473. [ 61%] Building CXX object Source/Core/Core/CMakeFiles/core.dir/HW/SystemTimers.cpp.o
  1474. [ 61%] Building CXX object Source/Core/Core/CMakeFiles/core.dir/HW/VideoInterface.cpp.o
  1475. [ 61%] Building CXX object Source/Core/Core/CMakeFiles/core.dir/HW/WII_IPC.cpp.o
  1476. [ 61%] Building CXX object Source/Core/Core/CMakeFiles/core.dir/HW/Wiimote.cpp.o
  1477. [ 61%] Building CXX object Source/Core/Core/CMakeFiles/core.dir/HW/WiimoteCommon/DataReport.cpp.o
  1478. [ 61%] Building CXX object Source/Core/Core/CMakeFiles/core.dir/HW/WiimoteEmu/WiimoteEmu.cpp.o
  1479. [ 61%] Building CXX object Source/Core/Core/CMakeFiles/core.dir/HW/WiimoteEmu/Camera.cpp.o
  1480. [ 61%] Building CXX object Source/Core/Core/CMakeFiles/core.dir/HW/WiimoteEmu/Dynamics.cpp.o
  1481. [ 61%] Building CXX object Source/Core/Core/CMakeFiles/core.dir/HW/WiimoteEmu/Encryption.cpp.o
  1482. [ 63%] Building CXX object Source/Core/Core/CMakeFiles/core.dir/HW/WiimoteEmu/EmuSubroutines.cpp.o
  1483. [ 63%] Building CXX object Source/Core/Core/CMakeFiles/core.dir/HW/WiimoteEmu/ExtensionPort.cpp.o
  1484. [ 63%] Building CXX object Source/Core/Core/CMakeFiles/core.dir/HW/WiimoteEmu/I2CBus.cpp.o
  1485. [ 63%] Building CXX object Source/Core/Core/CMakeFiles/core.dir/HW/WiimoteEmu/MotionPlus.cpp.o
  1486. [ 63%] Building CXX object Source/Core/Core/CMakeFiles/core.dir/HW/WiimoteEmu/Speaker.cpp.o
  1487. [ 63%] Building CXX object Source/Core/Core/CMakeFiles/core.dir/HW/WiimoteEmu/Extension/Classic.cpp.o
  1488. [ 63%] Building CXX object Source/Core/Core/CMakeFiles/core.dir/HW/WiimoteEmu/Extension/Extension.cpp.o
  1489. [ 63%] Building CXX object Source/Core/Core/CMakeFiles/core.dir/HW/WiimoteEmu/Extension/Guitar.cpp.o
  1490. [ 63%] Building CXX object Source/Core/Core/CMakeFiles/core.dir/HW/WiimoteEmu/Extension/Drums.cpp.o
  1491. [ 64%] Building CXX object Source/Core/Core/CMakeFiles/core.dir/HW/WiimoteEmu/Extension/Nunchuk.cpp.o
  1492. /home/mrturcot/mitch/builds/dolphin-emu-git/src/dolphin-emu/Source/Core/Core/HW/WiimoteEmu/Camera.cpp: In instantiation of ‘WiimoteEmu::CameraLogic::Update(const Common::Matrix44&, bool)::<lambda(auto:1&)> [with auto:1 = const Common::TVec3<float>]’:
  1493. /usr/include/c++/8.2.1/bits/stl_algo.h:4304:24:   required from ‘_OIter std::transform(_IIter, _IIter, _OIter, _UnaryOperation) [with _IIter = const Common::TVec3<float>*; _OIter = WiimoteEmu::CameraLogic::Update(const Common::Matrix44&, bool)::CameraPoint*; _UnaryOperation = WiimoteEmu::CameraLogic::Update(const Common::Matrix44&, bool)::<lambda(auto:1&)>]’
  1494. /home/mrturcot/mitch/builds/dolphin-emu-git/src/dolphin-emu/Source/Core/Core/HW/WiimoteEmu/Camera.cpp:123:4:   required from here
  1495. /home/mrturcot/mitch/builds/dolphin-emu-git/src/dolphin-emu/Source/Core/Core/HW/WiimoteEmu/Camera.cpp:116:43: internal compiler error: in tsubst_copy, at cp/pt.c:15478
  1496.        const auto point_size = std::lround(MAX_POINT_SIZE / point.w / 2);
  1497.                                            ^~~~~~~~~~~~~~
  1498. Please submit a full bug report,
  1499. with preprocessed source if appropriate.
  1500. See <https://bugs.archlinux.org/> for instructions.
  1501. make[2]: *** [Source/Core/Core/CMakeFiles/core.dir/build.make:1831: Source/Core/Core/CMakeFiles/core.dir/HW/WiimoteEmu/Camera.cpp.o] Error 1
  1502. make[2]: *** Waiting for unfinished jobs....
  1503. make[1]: *** [CMakeFiles/Makefile2:934: Source/Core/Core/CMakeFiles/core.dir/all] Error 2
  1504. make: *** [Makefile:152: all] Error 2
  1505. ==> ERROR: A failure occurred in build().
  1506.     Aborting...
  1507. [1] mrturcot@GL552VW
  1508. [~/mitch/builds/dolphin-emu-git] >$
RAW Paste Data
We use cookies for various purposes including analytics. By continuing to use Pastebin, you agree to our use of cookies as described in the Cookies Policy. OK, I Understand
 
Top