SHARE
TWEET

dolphin_xubuntu_14.04_make_error

a guest Dec 14th, 2015 102 Never
Not a member of Pastebin yet? Sign Up, it unlocks many cool features!
  1. [  0%] Built target bdisasm
  2. [  1%] Built target enet
  3. [  2%] Built target xxhash
  4. [  3%] Built target SoundTouch
  5. [  4%] Built target miniupnpc
  6. [  9%] Built target mbedcrypto
  7. [ 10%] Built target mbedx509
  8. [ 11%] Built target mbedtls
  9. [ 53%] Built target wx
  10. [ 53%] Built target pch
  11. [ 54%] Built target audiocommon
  12. [ 58%] Built target common
  13. [ 58%] Built target traversal_server
  14. [ 58%] Building CXX object Source/Core/InputCommon/CMakeFiles/inputcommon.dir/ControllerEmu.cpp.o
  15. /home/tim/dolphin-emu/Source/Core/InputCommon/ControllerEmu.cpp: In constructor ‘ControllerEmu::AnalogStick::AnalogStick(const char*, const char*, ControlState)’:
  16. /home/tim/dolphin-emu/Source/Core/InputCommon/ControllerEmu.cpp:160:25: error: ‘make_unique’ is not a member of ‘std’
  17.    controls.emplace_back(std::make_unique<Input>(named_direction));
  18.                          ^
  19. /home/tim/dolphin-emu/Source/Core/InputCommon/ControllerEmu.cpp:160:47: error: expected primary-expression before ‘>’ token
  20.    controls.emplace_back(std::make_unique<Input>(named_direction));
  21.                                                ^
  22. /home/tim/dolphin-emu/Source/Core/InputCommon/ControllerEmu.cpp:162:24: error: ‘make_unique’ is not a member of ‘std’
  23.   controls.emplace_back(std::make_unique<Input>(_trans("Modifier")));
  24.                         ^
  25. /home/tim/dolphin-emu/Source/Core/InputCommon/ControllerEmu.cpp:162:46: error: expected primary-expression before ‘>’ token
  26.   controls.emplace_back(std::make_unique<Input>(_trans("Modifier")));
  27.                                               ^
  28. /home/tim/dolphin-emu/Source/Core/InputCommon/ControllerEmu.cpp:163:24: error: ‘make_unique’ is not a member of ‘std’
  29.   settings.emplace_back(std::make_unique<Setting>(_trans("Radius"), default_radius, 0, 100));
  30.                         ^
  31. /home/tim/dolphin-emu/Source/Core/InputCommon/ControllerEmu.cpp:163:48: error: expected primary-expression before ‘>’ token
  32.   settings.emplace_back(std::make_unique<Setting>(_trans("Radius"), default_radius, 0, 100));
  33.                                                 ^
  34. /home/tim/dolphin-emu/Source/Core/InputCommon/ControllerEmu.cpp:163:68: warning: left operand of comma operator has no effect [-Wunused-value]
  35.   settings.emplace_back(std::make_unique<Setting>(_trans("Radius"), default_radius, 0, 100));
  36.                                                                     ^
  37. /home/tim/dolphin-emu/Source/Core/InputCommon/ControllerEmu.cpp:163:84: warning: right operand of comma operator has no effect [-Wunused-value]
  38.   settings.emplace_back(std::make_unique<Setting>(_trans("Radius"), default_radius, 0, 100));
  39.                                                                                     ^
  40. /home/tim/dolphin-emu/Source/Core/InputCommon/ControllerEmu.cpp:163:87: warning: right operand of comma operator has no effect [-Wunused-value]
  41.   settings.emplace_back(std::make_unique<Setting>(_trans("Radius"), default_radius, 0, 100));
  42.                                                                                        ^
  43. /home/tim/dolphin-emu/Source/Core/InputCommon/ControllerEmu.cpp:164:24: error: ‘make_unique’ is not a member of ‘std’
  44.   settings.emplace_back(std::make_unique<Setting>(_trans("Dead Zone"), 0, 0, 50));
  45.                         ^
  46. /home/tim/dolphin-emu/Source/Core/InputCommon/ControllerEmu.cpp:164:48: error: expected primary-expression before ‘>’ token
  47.   settings.emplace_back(std::make_unique<Setting>(_trans("Dead Zone"), 0, 0, 50));
  48.                                                 ^
  49. /home/tim/dolphin-emu/Source/Core/InputCommon/ControllerEmu.cpp:164:71: warning: left operand of comma operator has no effect [-Wunused-value]
  50.   settings.emplace_back(std::make_unique<Setting>(_trans("Dead Zone"), 0, 0, 50));
  51.                                                                        ^
  52. /home/tim/dolphin-emu/Source/Core/InputCommon/ControllerEmu.cpp:164:74: warning: right operand of comma operator has no effect [-Wunused-value]
  53.   settings.emplace_back(std::make_unique<Setting>(_trans("Dead Zone"), 0, 0, 50));
  54.                                                                           ^
  55. /home/tim/dolphin-emu/Source/Core/InputCommon/ControllerEmu.cpp:164:77: warning: right operand of comma operator has no effect [-Wunused-value]
  56.   settings.emplace_back(std::make_unique<Setting>(_trans("Dead Zone"), 0, 0, 50));
  57.                                                                              ^
  58. /home/tim/dolphin-emu/Source/Core/InputCommon/ControllerEmu.cpp: In constructor ‘ControllerEmu::Buttons::Buttons(const string&)’:
  59. /home/tim/dolphin-emu/Source/Core/InputCommon/ControllerEmu.cpp:169:24: error: ‘make_unique’ is not a member of ‘std’
  60.   settings.emplace_back(std::make_unique<Setting>(_trans("Threshold"), 0.5));
  61.                         ^
  62. /home/tim/dolphin-emu/Source/Core/InputCommon/ControllerEmu.cpp:169:48: error: expected primary-expression before ‘>’ token
  63.   settings.emplace_back(std::make_unique<Setting>(_trans("Threshold"), 0.5));
  64.                                                 ^
  65. /home/tim/dolphin-emu/Source/Core/InputCommon/ControllerEmu.cpp:169:71: warning: left operand of comma operator has no effect [-Wunused-value]
  66.   settings.emplace_back(std::make_unique<Setting>(_trans("Threshold"), 0.5));
  67.                                                                        ^
  68. /home/tim/dolphin-emu/Source/Core/InputCommon/ControllerEmu.cpp: In constructor ‘ControllerEmu::MixedTriggers::MixedTriggers(const string&)’:
  69. /home/tim/dolphin-emu/Source/Core/InputCommon/ControllerEmu.cpp:174:24: error: ‘make_unique’ is not a member of ‘std’
  70.   settings.emplace_back(std::make_unique<Setting>(_trans("Threshold"), 0.9));
  71.                         ^
  72. /home/tim/dolphin-emu/Source/Core/InputCommon/ControllerEmu.cpp:174:48: error: expected primary-expression before ‘>’ token
  73.   settings.emplace_back(std::make_unique<Setting>(_trans("Threshold"), 0.9));
  74.                                                 ^
  75. /home/tim/dolphin-emu/Source/Core/InputCommon/ControllerEmu.cpp:174:71: warning: left operand of comma operator has no effect [-Wunused-value]
  76.   settings.emplace_back(std::make_unique<Setting>(_trans("Threshold"), 0.9));
  77.                                                                        ^
  78. /home/tim/dolphin-emu/Source/Core/InputCommon/ControllerEmu.cpp: In constructor ‘ControllerEmu::Triggers::Triggers(const string&)’:
  79. /home/tim/dolphin-emu/Source/Core/InputCommon/ControllerEmu.cpp:179:24: error: ‘make_unique’ is not a member of ‘std’
  80.   settings.emplace_back(std::make_unique<Setting>(_trans("Dead Zone"), 0, 0, 50));
  81.                         ^
  82. /home/tim/dolphin-emu/Source/Core/InputCommon/ControllerEmu.cpp:179:48: error: expected primary-expression before ‘>’ token
  83.   settings.emplace_back(std::make_unique<Setting>(_trans("Dead Zone"), 0, 0, 50));
  84.                                                 ^
  85. /home/tim/dolphin-emu/Source/Core/InputCommon/ControllerEmu.cpp:179:71: warning: left operand of comma operator has no effect [-Wunused-value]
  86.   settings.emplace_back(std::make_unique<Setting>(_trans("Dead Zone"), 0, 0, 50));
  87.                                                                        ^
  88. /home/tim/dolphin-emu/Source/Core/InputCommon/ControllerEmu.cpp:179:74: warning: right operand of comma operator has no effect [-Wunused-value]
  89.   settings.emplace_back(std::make_unique<Setting>(_trans("Dead Zone"), 0, 0, 50));
  90.                                                                           ^
  91. /home/tim/dolphin-emu/Source/Core/InputCommon/ControllerEmu.cpp:179:77: warning: right operand of comma operator has no effect [-Wunused-value]
  92.   settings.emplace_back(std::make_unique<Setting>(_trans("Dead Zone"), 0, 0, 50));
  93.                                                                              ^
  94. /home/tim/dolphin-emu/Source/Core/InputCommon/ControllerEmu.cpp: In constructor ‘ControllerEmu::Slider::Slider(const string&)’:
  95. /home/tim/dolphin-emu/Source/Core/InputCommon/ControllerEmu.cpp:184:24: error: ‘make_unique’ is not a member of ‘std’
  96.   controls.emplace_back(std::make_unique<Input>("Left"));
  97.                         ^
  98. /home/tim/dolphin-emu/Source/Core/InputCommon/ControllerEmu.cpp:184:46: error: expected primary-expression before ‘>’ token
  99.   controls.emplace_back(std::make_unique<Input>("Left"));
  100.                                               ^
  101. /home/tim/dolphin-emu/Source/Core/InputCommon/ControllerEmu.cpp:185:24: error: ‘make_unique’ is not a member of ‘std’
  102.   controls.emplace_back(std::make_unique<Input>("Right"));
  103.                         ^
  104. /home/tim/dolphin-emu/Source/Core/InputCommon/ControllerEmu.cpp:185:46: error: expected primary-expression before ‘>’ token
  105.   controls.emplace_back(std::make_unique<Input>("Right"));
  106.                                               ^
  107. /home/tim/dolphin-emu/Source/Core/InputCommon/ControllerEmu.cpp:187:24: error: ‘make_unique’ is not a member of ‘std’
  108.   settings.emplace_back(std::make_unique<Setting>(_trans("Dead Zone"), 0, 0, 50));
  109.                         ^
  110. /home/tim/dolphin-emu/Source/Core/InputCommon/ControllerEmu.cpp:187:48: error: expected primary-expression before ‘>’ token
  111.   settings.emplace_back(std::make_unique<Setting>(_trans("Dead Zone"), 0, 0, 50));
  112.                                                 ^
  113. /home/tim/dolphin-emu/Source/Core/InputCommon/ControllerEmu.cpp:187:71: warning: left operand of comma operator has no effect [-Wunused-value]
  114.   settings.emplace_back(std::make_unique<Setting>(_trans("Dead Zone"), 0, 0, 50));
  115.                                                                        ^
  116. /home/tim/dolphin-emu/Source/Core/InputCommon/ControllerEmu.cpp:187:74: warning: right operand of comma operator has no effect [-Wunused-value]
  117.   settings.emplace_back(std::make_unique<Setting>(_trans("Dead Zone"), 0, 0, 50));
  118.                                                                           ^
  119. /home/tim/dolphin-emu/Source/Core/InputCommon/ControllerEmu.cpp:187:77: warning: right operand of comma operator has no effect [-Wunused-value]
  120.   settings.emplace_back(std::make_unique<Setting>(_trans("Dead Zone"), 0, 0, 50));
  121.                                                                              ^
  122. /home/tim/dolphin-emu/Source/Core/InputCommon/ControllerEmu.cpp: In constructor ‘ControllerEmu::Force::Force(const string&)’:
  123. /home/tim/dolphin-emu/Source/Core/InputCommon/ControllerEmu.cpp:194:24: error: ‘make_unique’ is not a member of ‘std’
  124.   controls.emplace_back(std::make_unique<Input>(_trans("Up")));
  125.                         ^
  126. /home/tim/dolphin-emu/Source/Core/InputCommon/ControllerEmu.cpp:194:46: error: expected primary-expression before ‘>’ token
  127.   controls.emplace_back(std::make_unique<Input>(_trans("Up")));
  128.                                               ^
  129. /home/tim/dolphin-emu/Source/Core/InputCommon/ControllerEmu.cpp:195:24: error: ‘make_unique’ is not a member of ‘std’
  130.   controls.emplace_back(std::make_unique<Input>(_trans("Down")));
  131.                         ^
  132. /home/tim/dolphin-emu/Source/Core/InputCommon/ControllerEmu.cpp:195:46: error: expected primary-expression before ‘>’ token
  133.   controls.emplace_back(std::make_unique<Input>(_trans("Down")));
  134.                                               ^
  135. /home/tim/dolphin-emu/Source/Core/InputCommon/ControllerEmu.cpp:196:24: error: ‘make_unique’ is not a member of ‘std’
  136.   controls.emplace_back(std::make_unique<Input>(_trans("Left")));
  137.                         ^
  138. /home/tim/dolphin-emu/Source/Core/InputCommon/ControllerEmu.cpp:196:46: error: expected primary-expression before ‘>’ token
  139.   controls.emplace_back(std::make_unique<Input>(_trans("Left")));
  140.                                               ^
  141. /home/tim/dolphin-emu/Source/Core/InputCommon/ControllerEmu.cpp:197:24: error: ‘make_unique’ is not a member of ‘std’
  142.   controls.emplace_back(std::make_unique<Input>(_trans("Right")));
  143.                         ^
  144. /home/tim/dolphin-emu/Source/Core/InputCommon/ControllerEmu.cpp:197:46: error: expected primary-expression before ‘>’ token
  145.   controls.emplace_back(std::make_unique<Input>(_trans("Right")));
  146.                                               ^
  147. /home/tim/dolphin-emu/Source/Core/InputCommon/ControllerEmu.cpp:198:24: error: ‘make_unique’ is not a member of ‘std’
  148.   controls.emplace_back(std::make_unique<Input>(_trans("Forward")));
  149.                         ^
  150. /home/tim/dolphin-emu/Source/Core/InputCommon/ControllerEmu.cpp:198:46: error: expected primary-expression before ‘>’ token
  151.   controls.emplace_back(std::make_unique<Input>(_trans("Forward")));
  152.                                               ^
  153. /home/tim/dolphin-emu/Source/Core/InputCommon/ControllerEmu.cpp:199:24: error: ‘make_unique’ is not a member of ‘std’
  154.   controls.emplace_back(std::make_unique<Input>(_trans("Backward")));
  155.                         ^
  156. /home/tim/dolphin-emu/Source/Core/InputCommon/ControllerEmu.cpp:199:46: error: expected primary-expression before ‘>’ token
  157.   controls.emplace_back(std::make_unique<Input>(_trans("Backward")));
  158.                                               ^
  159. /home/tim/dolphin-emu/Source/Core/InputCommon/ControllerEmu.cpp:201:24: error: ‘make_unique’ is not a member of ‘std’
  160.   settings.emplace_back(std::make_unique<Setting>(_trans("Dead Zone"), 0, 0, 50));
  161.                         ^
  162. /home/tim/dolphin-emu/Source/Core/InputCommon/ControllerEmu.cpp:201:48: error: expected primary-expression before ‘>’ token
  163.   settings.emplace_back(std::make_unique<Setting>(_trans("Dead Zone"), 0, 0, 50));
  164.                                                 ^
  165. /home/tim/dolphin-emu/Source/Core/InputCommon/ControllerEmu.cpp:201:71: warning: left operand of comma operator has no effect [-Wunused-value]
  166.   settings.emplace_back(std::make_unique<Setting>(_trans("Dead Zone"), 0, 0, 50));
  167.                                                                        ^
  168. /home/tim/dolphin-emu/Source/Core/InputCommon/ControllerEmu.cpp:201:74: warning: right operand of comma operator has no effect [-Wunused-value]
  169.   settings.emplace_back(std::make_unique<Setting>(_trans("Dead Zone"), 0, 0, 50));
  170.                                                                           ^
  171. /home/tim/dolphin-emu/Source/Core/InputCommon/ControllerEmu.cpp:201:77: warning: right operand of comma operator has no effect [-Wunused-value]
  172.   settings.emplace_back(std::make_unique<Setting>(_trans("Dead Zone"), 0, 0, 50));
  173.                                                                              ^
  174. /home/tim/dolphin-emu/Source/Core/InputCommon/ControllerEmu.cpp: In constructor ‘ControllerEmu::Tilt::Tilt(const string&)’:
  175. /home/tim/dolphin-emu/Source/Core/InputCommon/ControllerEmu.cpp:208:24: error: ‘make_unique’ is not a member of ‘std’
  176.   controls.emplace_back(std::make_unique<Input>("Forward"));
  177.                         ^
  178. /home/tim/dolphin-emu/Source/Core/InputCommon/ControllerEmu.cpp:208:46: error: expected primary-expression before ‘>’ token
  179.   controls.emplace_back(std::make_unique<Input>("Forward"));
  180.                                               ^
  181. /home/tim/dolphin-emu/Source/Core/InputCommon/ControllerEmu.cpp:209:24: error: ‘make_unique’ is not a member of ‘std’
  182.   controls.emplace_back(std::make_unique<Input>("Backward"));
  183.                         ^
  184. /home/tim/dolphin-emu/Source/Core/InputCommon/ControllerEmu.cpp:209:46: error: expected primary-expression before ‘>’ token
  185.   controls.emplace_back(std::make_unique<Input>("Backward"));
  186.                                               ^
  187. /home/tim/dolphin-emu/Source/Core/InputCommon/ControllerEmu.cpp:210:24: error: ‘make_unique’ is not a member of ‘std’
  188.   controls.emplace_back(std::make_unique<Input>("Left"));
  189.                         ^
  190. /home/tim/dolphin-emu/Source/Core/InputCommon/ControllerEmu.cpp:210:46: error: expected primary-expression before ‘>’ token
  191.   controls.emplace_back(std::make_unique<Input>("Left"));
  192.                                               ^
  193. /home/tim/dolphin-emu/Source/Core/InputCommon/ControllerEmu.cpp:211:24: error: ‘make_unique’ is not a member of ‘std’
  194.   controls.emplace_back(std::make_unique<Input>("Right"));
  195.                         ^
  196. /home/tim/dolphin-emu/Source/Core/InputCommon/ControllerEmu.cpp:211:46: error: expected primary-expression before ‘>’ token
  197.   controls.emplace_back(std::make_unique<Input>("Right"));
  198.                                               ^
  199. /home/tim/dolphin-emu/Source/Core/InputCommon/ControllerEmu.cpp:213:24: error: ‘make_unique’ is not a member of ‘std’
  200.   controls.emplace_back(std::make_unique<Input>(_trans("Modifier")));
  201.                         ^
  202. /home/tim/dolphin-emu/Source/Core/InputCommon/ControllerEmu.cpp:213:46: error: expected primary-expression before ‘>’ token
  203.   controls.emplace_back(std::make_unique<Input>(_trans("Modifier")));
  204.                                               ^
  205. /home/tim/dolphin-emu/Source/Core/InputCommon/ControllerEmu.cpp:215:24: error: ‘make_unique’ is not a member of ‘std’
  206.   settings.emplace_back(std::make_unique<Setting>(_trans("Dead Zone"), 0, 0, 50));
  207.                         ^
  208. /home/tim/dolphin-emu/Source/Core/InputCommon/ControllerEmu.cpp:215:48: error: expected primary-expression before ‘>’ token
  209.   settings.emplace_back(std::make_unique<Setting>(_trans("Dead Zone"), 0, 0, 50));
  210.                                                 ^
  211. /home/tim/dolphin-emu/Source/Core/InputCommon/ControllerEmu.cpp:215:71: warning: left operand of comma operator has no effect [-Wunused-value]
  212.   settings.emplace_back(std::make_unique<Setting>(_trans("Dead Zone"), 0, 0, 50));
  213.                                                                        ^
  214. /home/tim/dolphin-emu/Source/Core/InputCommon/ControllerEmu.cpp:215:74: warning: right operand of comma operator has no effect [-Wunused-value]
  215.   settings.emplace_back(std::make_unique<Setting>(_trans("Dead Zone"), 0, 0, 50));
  216.                                                                           ^
  217. /home/tim/dolphin-emu/Source/Core/InputCommon/ControllerEmu.cpp:215:77: warning: right operand of comma operator has no effect [-Wunused-value]
  218.   settings.emplace_back(std::make_unique<Setting>(_trans("Dead Zone"), 0, 0, 50));
  219.                                                                              ^
  220. /home/tim/dolphin-emu/Source/Core/InputCommon/ControllerEmu.cpp:216:24: error: ‘make_unique’ is not a member of ‘std’
  221.   settings.emplace_back(std::make_unique<Setting>(_trans("Circle Stick"), 0));
  222.                         ^
  223. /home/tim/dolphin-emu/Source/Core/InputCommon/ControllerEmu.cpp:216:48: error: expected primary-expression before ‘>’ token
  224.   settings.emplace_back(std::make_unique<Setting>(_trans("Circle Stick"), 0));
  225.                                                 ^
  226. /home/tim/dolphin-emu/Source/Core/InputCommon/ControllerEmu.cpp:216:74: warning: left operand of comma operator has no effect [-Wunused-value]
  227.   settings.emplace_back(std::make_unique<Setting>(_trans("Circle Stick"), 0));
  228.                                                                           ^
  229. /home/tim/dolphin-emu/Source/Core/InputCommon/ControllerEmu.cpp:217:24: error: ‘make_unique’ is not a member of ‘std’
  230.   settings.emplace_back(std::make_unique<Setting>(_trans("Angle"), 0.9, 0, 180));
  231.                         ^
  232. /home/tim/dolphin-emu/Source/Core/InputCommon/ControllerEmu.cpp:217:48: error: expected primary-expression before ‘>’ token
  233.   settings.emplace_back(std::make_unique<Setting>(_trans("Angle"), 0.9, 0, 180));
  234.                                                 ^
  235. /home/tim/dolphin-emu/Source/Core/InputCommon/ControllerEmu.cpp:217:67: warning: left operand of comma operator has no effect [-Wunused-value]
  236.   settings.emplace_back(std::make_unique<Setting>(_trans("Angle"), 0.9, 0, 180));
  237.                                                                    ^
  238. /home/tim/dolphin-emu/Source/Core/InputCommon/ControllerEmu.cpp:217:72: warning: right operand of comma operator has no effect [-Wunused-value]
  239.   settings.emplace_back(std::make_unique<Setting>(_trans("Angle"), 0.9, 0, 180));
  240.                                                                         ^
  241. /home/tim/dolphin-emu/Source/Core/InputCommon/ControllerEmu.cpp:217:75: warning: right operand of comma operator has no effect [-Wunused-value]
  242.   settings.emplace_back(std::make_unique<Setting>(_trans("Angle"), 0.9, 0, 180));
  243.                                                                            ^
  244. /home/tim/dolphin-emu/Source/Core/InputCommon/ControllerEmu.cpp: In constructor ‘ControllerEmu::Cursor::Cursor(const string&)’:
  245. /home/tim/dolphin-emu/Source/Core/InputCommon/ControllerEmu.cpp:225:25: error: ‘make_unique’ is not a member of ‘std’
  246.    controls.emplace_back(std::make_unique<Input>(named_direction));
  247.                          ^
  248. /home/tim/dolphin-emu/Source/Core/InputCommon/ControllerEmu.cpp:225:47: error: expected primary-expression before ‘>’ token
  249.    controls.emplace_back(std::make_unique<Input>(named_direction));
  250.                                                ^
  251. /home/tim/dolphin-emu/Source/Core/InputCommon/ControllerEmu.cpp:226:24: error: ‘make_unique’ is not a member of ‘std’
  252.   controls.emplace_back(std::make_unique<Input>("Forward"));
  253.                         ^
  254. /home/tim/dolphin-emu/Source/Core/InputCommon/ControllerEmu.cpp:226:46: error: expected primary-expression before ‘>’ token
  255.   controls.emplace_back(std::make_unique<Input>("Forward"));
  256.                                               ^
  257. /home/tim/dolphin-emu/Source/Core/InputCommon/ControllerEmu.cpp:227:24: error: ‘make_unique’ is not a member of ‘std’
  258.   controls.emplace_back(std::make_unique<Input>("Backward"));
  259.                         ^
  260. /home/tim/dolphin-emu/Source/Core/InputCommon/ControllerEmu.cpp:227:46: error: expected primary-expression before ‘>’ token
  261.   controls.emplace_back(std::make_unique<Input>("Backward"));
  262.                                               ^
  263. /home/tim/dolphin-emu/Source/Core/InputCommon/ControllerEmu.cpp:228:24: error: ‘make_unique’ is not a member of ‘std’
  264.   controls.emplace_back(std::make_unique<Input>(_trans("Hide")));
  265.                         ^
  266. /home/tim/dolphin-emu/Source/Core/InputCommon/ControllerEmu.cpp:228:46: error: expected primary-expression before ‘>’ token
  267.   controls.emplace_back(std::make_unique<Input>(_trans("Hide")));
  268.                                               ^
  269. /home/tim/dolphin-emu/Source/Core/InputCommon/ControllerEmu.cpp:230:24: error: ‘make_unique’ is not a member of ‘std’
  270.   settings.emplace_back(std::make_unique<Setting>(_trans("Center"), 0.5));
  271.                         ^
  272. /home/tim/dolphin-emu/Source/Core/InputCommon/ControllerEmu.cpp:230:48: error: expected primary-expression before ‘>’ token
  273.   settings.emplace_back(std::make_unique<Setting>(_trans("Center"), 0.5));
  274.                                                 ^
  275. /home/tim/dolphin-emu/Source/Core/InputCommon/ControllerEmu.cpp:230:68: warning: left operand of comma operator has no effect [-Wunused-value]
  276.   settings.emplace_back(std::make_unique<Setting>(_trans("Center"), 0.5));
  277.                                                                     ^
  278. /home/tim/dolphin-emu/Source/Core/InputCommon/ControllerEmu.cpp:231:24: error: ‘make_unique’ is not a member of ‘std’
  279.   settings.emplace_back(std::make_unique<Setting>(_trans("Width"), 0.5));
  280.                         ^
  281. /home/tim/dolphin-emu/Source/Core/InputCommon/ControllerEmu.cpp:231:48: error: expected primary-expression before ‘>’ token
  282.   settings.emplace_back(std::make_unique<Setting>(_trans("Width"), 0.5));
  283.                                                 ^
  284. /home/tim/dolphin-emu/Source/Core/InputCommon/ControllerEmu.cpp:231:67: warning: left operand of comma operator has no effect [-Wunused-value]
  285.   settings.emplace_back(std::make_unique<Setting>(_trans("Width"), 0.5));
  286.                                                                    ^
  287. /home/tim/dolphin-emu/Source/Core/InputCommon/ControllerEmu.cpp:232:24: error: ‘make_unique’ is not a member of ‘std’
  288.   settings.emplace_back(std::make_unique<Setting>(_trans("Height"), 0.5));
  289.                         ^
  290. /home/tim/dolphin-emu/Source/Core/InputCommon/ControllerEmu.cpp:232:48: error: expected primary-expression before ‘>’ token
  291.   settings.emplace_back(std::make_unique<Setting>(_trans("Height"), 0.5));
  292.                                                 ^
  293. /home/tim/dolphin-emu/Source/Core/InputCommon/ControllerEmu.cpp:232:68: warning: left operand of comma operator has no effect [-Wunused-value]
  294.   settings.emplace_back(std::make_unique<Setting>(_trans("Height"), 0.5));
  295.                                                                     ^
  296. make[2]: *** [Source/Core/InputCommon/CMakeFiles/inputcommon.dir/ControllerEmu.cpp.o] Error 1
  297. make[1]: *** [Source/Core/InputCommon/CMakeFiles/inputcommon.dir/all] Error 2
  298. make: *** [all] Error 2
RAW Paste Data
We use cookies for various purposes including analytics. By continuing to use Pastebin, you agree to our use of cookies as described in the Cookies Policy. OK, I Understand
Top