Guest User

Untitled

a guest
Nov 8th, 2012
39
Never
Not a member of Pastebin yet? Sign Up, it unlocks many cool features!
  1. replaceafill@system76:~/sandboxes/cando_missing_scores_justas_fix/schooltool.cando$ make run
  2. bin/start-schooltool-instance instance
  3. Leyendo configuración de /home/replaceafill/sandboxes/cando_missing_scores_justas_fix/schooltool.cando/instance/schooltool.conf
  4. 2012-11-08 06:02:07,915 (2847) Blob directory /home/replaceafill/sandboxes/cando_missing_scores_justas_fix/schooltool.cando/instance/var/blobs does not exist. Selected `bushy` layout.
  5. 2012-11-08 06:02:07,916 (2847) Blob directory '/home/replaceafill/sandboxes/cando_missing_scores_justas_fix/schooltool.cando/instance/var/blobs/' does not exist. Created new directory.
  6. 2012-11-08 06:02:07,916 (2847) Blob temporary directory '/home/replaceafill/sandboxes/cando_missing_scores_justas_fix/schooltool.cando/instance/var/blobs/tmp' does not exist. Created new directory.
  7. 2012-11-08 06:02:07,917 main db: evolving in mode EVOLVEMINIMUM
  8. 2012-11-08 06:02:07,917 main db/schooltool.cando: currently at generation 1, targetting generation 2
  9. 2012-11-08 06:02:08,188 main db/schooltool.cando: failed to evolve to generation 2
  10. Traceback (most recent call last):
  11. File "/home/replaceafill/.buildout/eggs/zope.app.generations-3.6.1-py2.7.egg/zope/app/generations/generations.py", line 494, in evolve
  12. manager.evolve(context, generation)
  13. File "/home/replaceafill/.buildout/eggs/zope.app.generations-3.6.1-py2.7.egg/zope/app/generations/generations.py", line 145, in evolve
  14. evolver.evolve(context)
  15. File "/home/replaceafill/sandboxes/cando_missing_scores_justas_fix/schooltool.cando/src/schooltool/cando/generations/evolve2.py", line 185, in evolve
  16. fixSkillScores(app, person)
  17. File "/home/replaceafill/sandboxes/cando_missing_scores_justas_fix/schooltool.cando/src/schooltool/cando/generations/evolve2.py", line 145, in fixSkillScores
  18. if ref in evaluations._history:
  19. TypeError: argument of type 'NoneType' is not iterable
  20. Traceback (most recent call last):
  21. File "bin/start-schooltool-instance", line 152, in <module>
  22. schooltool.paste.run.main()
  23. File "/home/replaceafill/.buildout/eggs/schooltool-2.3.0-py2.7.egg/schooltool/paste/run.py", line 175, in main
  24. paste.script.command.run(['serve', conf_file] + extra_options)
  25. File "/home/replaceafill/.buildout/eggs/PasteScript-1.7.5-py2.7.egg/paste/script/command.py", line 104, in run
  26. invoke(command, command_name, options, args[1:])
  27. File "/home/replaceafill/.buildout/eggs/PasteScript-1.7.5-py2.7.egg/paste/script/command.py", line 143, in invoke
  28. exit_code = runner.run(args)
  29. File "/home/replaceafill/.buildout/eggs/PasteScript-1.7.5-py2.7.egg/paste/script/command.py", line 238, in run
  30. result = self.command()
  31. File "/home/replaceafill/.buildout/eggs/PasteScript-1.7.5-py2.7.egg/paste/script/serve.py", line 284, in command
  32. relative_to=base, global_conf=vars)
  33. File "/home/replaceafill/.buildout/eggs/PasteScript-1.7.5-py2.7.egg/paste/script/serve.py", line 321, in loadapp
  34. **kw)
  35. File "/home/replaceafill/.buildout/eggs/PasteDeploy-1.5.0-py2.7.egg/paste/deploy/loadwsgi.py", line 247, in loadapp
  36. return loadobj(APP, uri, name=name, **kw)
  37. File "/home/replaceafill/.buildout/eggs/PasteDeploy-1.5.0-py2.7.egg/paste/deploy/loadwsgi.py", line 272, in loadobj
  38. return context.create()
  39. File "/home/replaceafill/.buildout/eggs/PasteDeploy-1.5.0-py2.7.egg/paste/deploy/loadwsgi.py", line 710, in create
  40. return self.object_type.invoke(self)
  41. File "/home/replaceafill/.buildout/eggs/PasteDeploy-1.5.0-py2.7.egg/paste/deploy/loadwsgi.py", line 146, in invoke
  42. return fix_call(context.object, context.global_conf, **context.local_conf)
  43. File "/home/replaceafill/.buildout/eggs/PasteDeploy-1.5.0-py2.7.egg/paste/deploy/util.py", line 56, in fix_call
  44. val = callable(*args, **kw)
  45. File "/home/replaceafill/.buildout/eggs/schooltool-2.3.0-py2.7.egg/schooltool/paste/main.py", line 48, in schooltool_app_factory
  46. os.path.join(global_conf['here'], config_file))
  47. File "/home/replaceafill/.buildout/eggs/schooltool-2.3.0-py2.7.egg/schooltool/paste/main.py", line 37, in __init__
  48. db = self.setup(options)
  49. File "/home/replaceafill/.buildout/eggs/schooltool-2.3.0-py2.7.egg/schooltool/app/main.py", line 693, in setup
  50. notify(DatabaseOpened(db))
  51. File "/home/replaceafill/.buildout/eggs/zope.event-3.5.1-py2.7.egg/zope/event/__init__.py", line 31, in notify
  52. subscriber(event)
  53. File "/home/replaceafill/.buildout/eggs/zope.component-3.10.0-py2.7.egg/zope/component/event.py", line 24, in dispatch
  54. zope.component.subscribers(event, None)
  55. File "/home/replaceafill/.buildout/eggs/zope.component-3.10.0-py2.7.egg/zope/component/_api.py", line 136, in subscribers
  56. return sitemanager.subscribers(objects, interface)
  57. File "/home/replaceafill/.buildout/eggs/zope.component-3.10.0-py2.7.egg/zope/component/registry.py", line 321, in subscribers
  58. return self.adapters.subscribers(objects, provided)
  59. File "/home/replaceafill/.buildout/eggs/zope.interface-3.6.1-py2.7-linux-x86_64.egg/zope/interface/adapter.py", line 585, in subscribers
  60. subscription(*objects)
  61. File "/home/replaceafill/.buildout/eggs/zope.app.appsetup-3.14.0-py2.7.egg/zope/app/appsetup/bootstrap.py", line 175, in bootStrapSubscriber
  62. zope.event.notify(zope.processlifetime.DatabaseOpenedWithRoot(db))
  63. File "/home/replaceafill/.buildout/eggs/zope.event-3.5.1-py2.7.egg/zope/event/__init__.py", line 31, in notify
  64. subscriber(event)
  65. File "/home/replaceafill/.buildout/eggs/zope.component-3.10.0-py2.7.egg/zope/component/event.py", line 24, in dispatch
  66. zope.component.subscribers(event, None)
  67. File "/home/replaceafill/.buildout/eggs/zope.component-3.10.0-py2.7.egg/zope/component/_api.py", line 136, in subscribers
  68. return sitemanager.subscribers(objects, interface)
  69. File "/home/replaceafill/.buildout/eggs/zope.component-3.10.0-py2.7.egg/zope/component/registry.py", line 321, in subscribers
  70. return self.adapters.subscribers(objects, provided)
  71. File "/home/replaceafill/.buildout/eggs/zope.interface-3.6.1-py2.7-linux-x86_64.egg/zope/interface/adapter.py", line 585, in subscribers
  72. subscription(*objects)
  73. File "/home/replaceafill/.buildout/eggs/zope.app.generations-3.6.1-py2.7.egg/zope/app/generations/generations.py", line 521, in evolveMinimumSubscriber
  74. evolve(event.database, EVOLVEMINIMUM)
  75. File "/home/replaceafill/.buildout/eggs/zope.app.generations-3.6.1-py2.7.egg/zope/app/generations/generations.py", line 506, in evolve
  76. manager.generation)
  77. zope.app.generations.interfaces.UnableToEvolve: (2, u'schooltool.cando', 2)
  78. make: *** [run] Error 1
  79. replaceafill@system76:~/sandboxes/cando_missing_scores_justas_fix/schooltool.cando$
RAW Paste Data