daily pastebin goal
44%
SHARE
TWEET

Untitled

a guest Mar 15th, 2015 200 Never
Not a member of Pastebin yet? Sign Up, it unlocks many cool features!
  1. 2015-03-15 16:18:01 (284 KB/s) - ‘openssl-1.0.1l.tar.gz’ saved [4429979/4429979]
  2.  
  3. [armeabi-v7a-hard] Compile thumb  : freetype2-static <= ftpic.c
  4. [armeabi-v7a-hard] Compile thumb  : freetype2-static <= ftstroke.c
  5. patching file Configure
  6. [armeabi-v7a-hard] Compile thumb  : freetype2-static <= ftsynth.c
  7. changed timestamp for leveldb detected building...
  8. WARNING: The shell running this script isn't bash.  Although we try to avoid bashism in scripts, things can happen.
  9. [armeabi-v7a-hard] Compile thumb  : freetype2-static <= ftsystem.c
  10. [armeabi-v7a-hard] Compile thumb  : freetype2-static <= cff.c
  11. [armeabi-v7a-hard] Compile thumb  : freetype2-static <= pshinter.c
  12. Host system 'linux-x86_64' is not supported by the source NDK!
  13. Try --system=<name> with one of:  linux-x86
  14. make[2]: Entering directory '/home/devmarth/minetest/build/android/deps/leveldb'
  15. make[2]: warning: -jN forced in submake: disabling jobserver mode.
  16. make[2]: arm-linux-androideabi-g++: Command not found
  17. Makefile:87: recipe for target 'libleveldb.so.1.17' failed
  18. make[2]: *** [libleveldb.so.1.17] Error 127
  19. make[2]: arm-linux-androideabi-g++: Command not found
  20. make[2]: *** Waiting for unfinished jobs....
  21. Makefile:211: recipe for target 'db/builder.o' failed
  22. make[2]: *** [db/builder.o] Error 127
  23. make[2]: Leaving directory '/home/devmarth/minetest/build/android/deps/leveldb'
  24. Makefile:354: recipe for target '/home/devmarth/minetest/build/android/deps/leveldb/libleveldb.a' failed
  25. make[1]: *** [/home/devmarth/minetest/build/android/deps/leveldb/libleveldb.a] Error 1
  26. make[1]: *** Waiting for unfinished jobs....
  27. [armeabi-v7a-hard] Compile thumb  : freetype2-static <= psnames.c
  28. [armeabi-v7a-hard] Compile thumb  : freetype2-static <= raster.c
  29. [armeabi-v7a-hard] Compile thumb  : freetype2-static <= sfnt.c
  30. [armeabi-v7a-hard] Compile thumb  : freetype2-static <= smooth.c
  31. [armeabi-v7a-hard] Compile thumb  : freetype2-static <= truetype.c
  32. [armeabi-v7a-hard] StaticLibrary  : libfreetype2-static.a
  33. make[2]: Leaving directory `/home/devmarth/minetest/build/android/deps/freetype2-android/Android/jni'
  34. make[1]: Leaving directory '/home/devmarth/minetest/build/android'
  35. Makefile:160: recipe for target 'debug' failed
  36. make: *** [debug] Error 2
  37. devmarth@devmarth-PC:~/minetest/build/android$
RAW Paste Data
We use cookies for various purposes including analytics. By continuing to use Pastebin, you agree to our use of cookies as described in the Cookies Policy. OK, I Understand
 
Top