SHARE
TWEET

Untitled

a guest Dec 26th, 2013 112 Never
Not a member of Pastebin yet? Sign Up, it unlocks many cool features!
  1. ./run_tests.sh  \
  2.     test/unit/cartodb/*.js \
  3.     test/acceptance/*.js
  4. /root/Windshaft-cartodb
  5. Starting redis on port 6335
  6. Preparing the environment
  7. PUBLICUSER: testpublicuser
  8. PUBLICPASS: public
  9. TESTUSER: test_cartodb_user_1
  10. TESTPASS: test_cartodb_user_1_pass
  11. preparing postgres...
  12. SET
  13. SET
  14. SET
  15. SET
  16. SET
  17. SET
  18. SET
  19. SET
  20. SET
  21. DROP ROLE
  22. CREATE ROLE
  23. ERROR:  role "test_cartodb_user_1" cannot be dropped because some objects depend on it
  24. DETAIL:  5 objects in database cartodb_test_user_1_db
  25. ERROR:  role "test_cartodb_user_1" already exists
  26. CREATE TABLE
  27. CREATE SEQUENCE
  28. ALTER SEQUENCE
  29.  setval
  30. --------
  31.      60
  32. (1 row)
  33.  
  34. ALTER TABLE
  35. INSERT 0 5
  36. ALTER TABLE
  37. CREATE INDEX
  38. CREATE INDEX
  39. GRANT
  40. GRANT
  41. CREATE TABLE
  42. CREATE SEQUENCE
  43. ALTER SEQUENCE
  44.  setval
  45. --------
  46.      60
  47. (1 row)
  48.  
  49. ALTER TABLE
  50. INSERT 0 5
  51. ALTER TABLE
  52. CREATE INDEX
  53. CREATE INDEX
  54. GRANT
  55. GRANT
  56. CREATE TABLE
  57. CREATE SEQUENCE
  58. ALTER SEQUENCE
  59.  setval
  60. --------
  61.      60
  62. (1 row)
  63.  
  64. ALTER TABLE
  65. INSERT 0 5
  66. ALTER TABLE
  67. CREATE INDEX
  68. CREATE INDEX
  69. GRANT
  70. GRANT
  71. CREATE TABLE
  72. GRANT
  73. SET
  74. SET
  75. SET
  76. SET
  77. SET
  78. SET
  79. SET
  80. SET
  81. CREATE TABLE
  82. GRANT
  83. CREATE SEQUENCE
  84.  setval
  85. --------
  86.      58
  87. (1 row)
  88.  
  89. ALTER TABLE
  90. INSERT 0 57
  91. ALTER TABLE
  92. CREATE INDEX
  93. GRANT
  94. GRANT
  95. preparing redis...
  96. OK
  97. (integer) 1
  98. OK
  99. (integer) 1
  100. (integer) 1
  101. Finished preparing data. Ready to run tests
  102. /root/Windshaft-cartodb
  103. Running tests
  104.  
  105.   ․․․․․Check auth from signer 'sig1' on map 'map1' with auth 'tok1'
  106. Map 'map1' is signed by 0 certificates of user 'sig1':
  107. Adding bb4716be55a791f39695afcc118eb2af to map_sig|sig1|map1
  108. Check auth from signer 'sig1' on map 'map1' with auth ''
  109. Map 'map1' is signed by 1 certificates of user 'sig1': bb4716be55a791f39695afcc118eb2af
  110. Check auth from signer 'sig1' on map 'map1' with auth 'tok1'
  111. Map 'map1' is signed by 1 certificates of user 'sig1': bb4716be55a791f39695afcc118eb2af
  112. Access to map 'map1' authorized by cert 'bb4716be55a791f39695afcc118eb2af' of user 'sig1'
  113. Adding b2299984db7672058a8cbf6bba4f08d5 to map_sig|sig1|map1
  114. Check auth from signer 'sig1' on map 'map1' with auth 'arbitrary'
  115. Map 'map1' is signed by 2 certificates of user 'sig1': bb4716be55a791f39695afcc118eb2af,b2299984db7672058a8cbf6bba4f08d5
  116. Access to map 'map1' authorized by cert 'b2299984db7672058a8cbf6bba4f08d5' of user 'sig1'
  117. Certificate 'b2299984db7672058a8cbf6bba4f08d5' from user 'sig1' was used to sign 1 maps
  118. Signature with certificate 'b2299984db7672058a8cbf6bba4f08d5' of user 'sig1' removed from map 'map1'
  119. Check auth from signer 'sig1' on map 'map1' with auth 'arbitrary'
  120. Map 'map1' is signed by 1 certificates of user 'sig1': bb4716be55a791f39695afcc118eb2af
  121. Certificate 'bb4716be55a791f39695afcc118eb2af' from user 'sig1' was used to sign 1 maps
  122. Signature with certificate 'bb4716be55a791f39695afcc118eb2af' of user 'sig1' removed from map 'map1'
  123. ․․․․․․․Certificate 'be33653928ccba45780d1655055f6946' from user 'me' was used to sign 0 maps
  124. ․Certificate 'be33653928ccba45780d1655055f6946' from user 'me' was used to sign 0 maps
  125. Certificate '4678611746ed12ba6b1b03cb39918960' from user 'me' was used to sign 0 maps
  126. ․Certificate '5678d052727b070727471c37d28d4476' from user 'me' was used to sign 0 maps
  127. Certificate '8d667adf9a0183f0e1e891af95916ac9' from user 'me' was used to sign 0 maps
  128. ․․VARNISH: connection
  129. [SUCCESS FLUSHING CACHE]
  130. VARNISH: connected
  131. sending pending
  132. ․[millstone] processing style 'style0'
  133. [millstone] processing style 'style1'
  134. [millstone] finished processing '/tmp/cdb-tiler-test/millstone/test_cartodb_user_1_db/~e34dd7e235138a062f8ba7ad051aa3a7/base'
  135. [millstone] processing style 'style0'
  136. [millstone] processing style 'style1'
  137. [millstone] finished processing '/tmp/cdb-tiler-test/millstone/test_cartodb_user_1_db/~e34dd7e235138a062f8ba7ad051aa3a7/base'
  138. Layergroup e34dd7e235138a062f8ba7ad051aa3a7: {"version":"1.0.0","layers":[{"options":{"sql":"select cartodb_id, ST_Translate(the_geom_webmercator, 5e6, 0) as the_geom_webmercator from test_table limit 2","cartocss":"#layer { marker-fill:red; marker-width:32; marker-allow-overlap:true; }","cartocss_version":"2.0.1","interactivity":"cartodb_id"}},{"options":{"sql":"select cartodb_id, ST_Translate(the_geom_webmercator, -5e6, 0) as the_geom_webmercator from test_table limit 2 offset 2","cartocss":"#layer { marker-fill:blue; marker-allow-overlap:true; }","cartocss_version":"2.0.2","interactivity":"cartodb_id"}}]}
  139. ․[millstone] processing style 'style0'
  140. [millstone] finished processing '/tmp/cdb-tiler-test/millstone/test_cartodb_user_1_db/~6d8e4ad5458e2d25cf0eef38e38717a6/base'
  141. Layergroup 6d8e4ad5458e2d25cf0eef38e38717a6: {"version":"1.0.0","layers":[{"options":{"sql":"select 1 as cartodb_id, ST_Buffer(!bbox!, -32*greatest(!pixel_width!,!pixel_height!)) as the_geom_webmercator","cartocss":"#layer { polygon-fill:red; }","cartocss_version":"2.0.1","interactivity":"cartodb_id"}}]}
  142. [Fri, 27 Dec 2013 00:44:43 GMT] - POST localhost/tiles/layergroup 200 315 ms -> application/json; charset=utf-8 (-)
  143. [Fri, 27 Dec 2013 00:44:43 GMT] - GET localhost/tiles/layergroup/e34dd7e235138a062f8ba7ad051aa3a7:cb0/0/0/0.png 200 45 ms -> image/png (-)
  144. [Fri, 27 Dec 2013 00:44:43 GMT] - GET localhost/tiles/layergroup/e34dd7e235138a062f8ba7ad051aa3a7/0/0/0/0.grid.json 200 31 ms -> text/javascript; charset=utf-8; charset=utf-8 (-)
  145. [Fri, 27 Dec 2013 00:44:43 GMT] - GET localhost/tiles/layergroup/e34dd7e235138a062f8ba7ad051aa3a7/1/0/0/0.grid.json 200 23 ms -> text/javascript; charset=utf-8; charset=utf-8 (-)
  146. [Fri, 27 Dec 2013 00:44:43 GMT] - POST localhost/tiles/layergroup 200 157 ms -> application/json; charset=utf-8 (-)
  147. [Fri, 27 Dec 2013 00:44:43 GMT] - GET localhost/tiles/layergroup/6d8e4ad5458e2d25cf0eef38e38717a6:cb10/1/0/0.png 200 45 ms -> image/png (-)
  148. ․[millstone] processing style 'style0'
  149. [millstone] finished processing '/tmp/cdb-tiler-test/millstone/test_cartodb_user_1_db/~1c38c4b21136012b09746b830d83e862/base'
  150. Layergroup 1c38c4b21136012b09746b830d83e862: {"stat_tag":"random_tag","version":"1.0.0","layers":[{"options":{"sql":"select 1 as cartodb_id, !pixel_height! as h, ST_Buffer(!bbox!, -32*greatest(!pixel_width!,!pixel_height!)) as the_geom_webmercator","cartocss":"#layer { polygon-fill:red; }","cartocss_version":"2.0.1"}}]}
  151. [millstone] processing style 'style0'
  152. [millstone] finished processing '/tmp/cdb-tiler-test/millstone/test_cartodb_user_1_db/~1c38c4b21136012b09746b830d83e862/base'
  153. ․[millstone] processing style 'style0'
  154. [millstone] finished processing '/tmp/cdb-tiler-test/millstone/test_cartodb_user_1_db/~f7f9e730369ed7ae648e6d54abfb8565/base'
  155. [POST LAYERGROUP ERROR] -- 400: style0:1:10 Unrecognized rule: polygon-fit. Did you mean polygon-fill?
  156. ․[millstone] processing style 'style0'
  157. [millstone] processing style 'style1'
  158. [millstone] finished processing '/tmp/cdb-tiler-test/millstone/test_cartodb_user_1_db/~b4ed64d93a411a59f330ab3d798e4009/base'
  159. [millstone] processing style 'style0'
  160. [millstone] processing style 'style1'
  161. [millstone] finished processing '/tmp/cdb-tiler-test/millstone/test_cartodb_user_1_db/~b4ed64d93a411a59f330ab3d798e4009/base'
  162. Layergroup b4ed64d93a411a59f330ab3d798e4009: {"version":"1.0.0","layers":[{"options":{"sql":"select * from test_table_private_1 where cartodb_id=1","cartocss":"#layer { marker-fill:red; marker-width:32; marker-allow-overlap:true; }","cartocss_version":"2.1.0","interactivity":"cartodb_id"}},{"options":{"sql":"select * from test_table_private_1 where cartodb_id=2","cartocss":"#layer { marker-fill:blue; marker-allow-overlap:true; }","cartocss_version":"2.1.0","interactivity":"cartodb_id"}}]}
  163. getRenderer ERROR:
  164. [Error: Postgis Plugin: PSQL error:
  165. ERROR:  permission denied for relation test_table_private_1
  166. Full sql was: 'SELECT * FROM (select * from test_table_private_1 where cartodb_id=1) as cdbq LIMIT 0'
  167.   encountered during parsing of layer 'layer0' in Layer at line 17]
  168. get{Tile,Grid} ERROR:
  169. [Error: Postgis Plugin: PSQL error:
  170. ERROR:  permission denied for relation test_table_private_1
  171. Full sql was: 'SELECT * FROM (select * from test_table_private_1 where cartodb_id=1) as cdbq LIMIT 0'
  172.   encountered during parsing of layer 'layer0' in Layer at line 17]
  173. [TILE RENDER ERROR] -- 401: Error: Postgis Plugin: PSQL error:
  174. ERROR:  permission denied for relation test_table_private_1
  175. Full sql was: 'SELECT * FROM (select * from test_table_private_1 where cartodb_id=1) as cdbq LIMIT 0'
  176.   encountered during parsing of layer 'layer0' in Layer at line 17
  177. getRenderer ERROR:
  178. [Error: Postgis Plugin: PSQL error:
  179. ERROR:  permission denied for relation test_table_private_1
  180. Full sql was: 'SELECT * FROM (select * from test_table_private_1 where cartodb_id=1) as cdbq LIMIT 0'
  181.   encountered during parsing of layer 'layer0' in Layer at line 17]
  182. get{Tile,Grid} ERROR:
  183. [Error: Postgis Plugin: PSQL error:
  184. ERROR:  permission denied for relation test_table_private_1
  185. Full sql was: 'SELECT * FROM (select * from test_table_private_1 where cartodb_id=1) as cdbq LIMIT 0'
  186.   encountered during parsing of layer 'layer0' in Layer at line 17]
  187. [TILE RENDER ERROR] -- 401: Error: Postgis Plugin: PSQL error:
  188. ERROR:  permission denied for relation test_table_private_1
  189. Full sql was: 'SELECT * FROM (select * from test_table_private_1 where cartodb_id=1) as cdbq LIMIT 0'
  190.   encountered during parsing of layer 'layer0' in Layer at line 17
  191. getRenderer ERROR:
  192. [Error: Postgis Plugin: PSQL error:
  193. ERROR:  permission denied for relation test_table_private_1
  194. Full sql was: 'SELECT * FROM (select * from test_table_private_1 where cartodb_id=1) as cdbq LIMIT 0'
  195.   encountered during parsing of layer 'layer0' in Layer at line 17]
  196. get{Tile,Grid} ERROR:
  197. [Error: Postgis Plugin: PSQL error:
  198. ERROR:  permission denied for relation test_table_private_1
  199. Full sql was: 'SELECT * FROM (select * from test_table_private_1 where cartodb_id=1) as cdbq LIMIT 0'
  200.   encountered during parsing of layer 'layer0' in Layer at line 17]
  201. [TILE RENDER ERROR] -- 401: Error: Postgis Plugin: PSQL error:
  202. ERROR:  permission denied for relation test_table_private_1
  203. Full sql was: 'SELECT * FROM (select * from test_table_private_1 where cartodb_id=1) as cdbq LIMIT 0'
  204.   encountered during parsing of layer 'layer0' in Layer at line 17
  205. ․[millstone] processing style 'style0'
  206. [millstone] finished processing '/tmp/cdb-tiler-test/millstone/test_cartodb_user_1_db/~e6f9ee64c8686565f0cd673df71d059d/base'
  207. [POST LAYERGROUP ERROR] -- 400: style0:1:10 Invalid value for text-name, the type expression is expected. cartodb_id (of type keyword)  was given.
  208. style0:1:33 Invalid value for text-face-name, the type font is expected. Dejagnu (of type string)  was given.
  209. ․[millstone] processing style 'style0'
  210. [millstone] processing style 'style1'
  211. [millstone] finished processing '/tmp/cdb-tiler-test/millstone/test_cartodb_user_1_db/~3f2b292010f9522fc014797144720fdb/base'
  212. Layergroup 3f2b292010f9522fc014797144720fdb: {"version":"1.0.1","layers":[{"options":{"sql":"select 'single''quote' as n, 'SRID=3857;POINT(0 0)'::geometry as the_geom_webmercator","cartocss":"#s [n=\"single'quote\" ] { marker-fill:red; }","cartocss_version":"2.1.0"}},{"options":{"sql":"select 'double\"quote' as n, 'SRID=3857;POINT(2 0)'::geometry as the_geom_webmercator","cartocss":"#s [n=\"double\\\"quote\" ] { marker-fill:red; }","cartocss_version":"2.1.0"}}]}
  213. ․[millstone] processing style 'style0'
  214. [millstone] finished processing '/tmp/cdb-tiler-test/millstone/test_cartodb_user_1_db/~f21aefdc8a92f0c5ae13fe6bf06084ff/base'
  215. [Fri, 27 Dec 2013 00:44:43 GMT] - GET localhost/tiles/layergroup/6d8e4ad5458e2d25cf0eef38e38717a6:cb11/4/0/0.png 200 92 ms -> image/png (-)
  216. [Fri, 27 Dec 2013 00:44:43 GMT] - GET localhost/tiles/layergroup/6d8e4ad5458e2d25cf0eef38e38717a6/0/1/0/0.grid.json 200 22 ms -> text/javascript; charset=utf-8; charset=utf-8 (-)
  217. [Fri, 27 Dec 2013 00:44:44 GMT] - GET localhost/tiles/layergroup/6d8e4ad5458e2d25cf0eef38e38717a6/0/4/0/0.grid.json 200 26 ms -> text/javascript; charset=utf-8; charset=utf-8 (-)
  218. [Fri, 27 Dec 2013 00:44:44 GMT] - POST localhost/tiles/layergroup 200 114 ms -> application/json; charset=utf-8 (-)
  219. [Fri, 27 Dec 2013 00:44:44 GMT] - POST localhost/tiles/layergroup 200 134 ms -> application/json; charset=utf-8 (-)
  220. [Fri, 27 Dec 2013 00:44:44 GMT] - POST localhost/tiles/layergroup 400 31 ms -> application/json; charset=utf-8 (-)
  221. [Fri, 27 Dec 2013 00:44:44 GMT] - POST localhost/tiles/layergroup?map_key=1234 200 241 ms -> application/json; charset=utf-8 (-)
  222. [Fri, 27 Dec 2013 00:44:44 GMT] - GET localhost/tiles/layergroup/b4ed64d93a411a59f330ab3d798e4009:cb0/0/0/0.png?map_key=1234 200 33 ms -> image/png (-)
  223. [Fri, 27 Dec 2013 00:44:44 GMT] - GET localhost/tiles/layergroup/b4ed64d93a411a59f330ab3d798e4009/0/0/0/0.grid.json?map_key=1234 200 18 ms -> text/javascript; charset=utf-8; charset=utf-8 (-)
  224. [Fri, 27 Dec 2013 00:44:44 GMT] - GET localhost/tiles/layergroup/b4ed64d93a411a59f330ab3d798e4009/1/0/0/0.grid.json?map_key=1234 200 19 ms -> text/javascript; charset=utf-8; charset=utf-8 (-)
  225. [Fri, 27 Dec 2013 00:44:44 GMT] - GET localhost/tiles/layergroup/b4ed64d93a411a59f330ab3d798e4009:cb0/0/0/0.png 401 20 ms -> application/json; charset=utf-8 (-)
  226. [Fri, 27 Dec 2013 00:44:44 GMT] - GET localhost/tiles/layergroup/b4ed64d93a411a59f330ab3d798e4009/0/0/0/0.grid.json 401 19 ms -> application/json; charset=utf-8 (-)
  227. [Fri, 27 Dec 2013 00:44:44 GMT] - GET localhost/tiles/layergroup/b4ed64d93a411a59f330ab3d798e4009/1/0/0/0.grid.json 401 21 ms -> application/json; charset=utf-8 (-)
  228. [Fri, 27 Dec 2013 00:44:44 GMT] - POST localhost/tiles/layergroup? 400 21 ms -> application/json; charset=utf-8 (-)
  229. [Fri, 27 Dec 2013 00:44:44 GMT] - POST localhost/tiles/layergroup? 200 118 ms -> application/json; charset=utf-8 (-)
  230. Layergroup f21aefdc8a92f0c5ae13fe6bf06084ff: {"version":"1.0.1","layers":[{"options":{"sql":"select .4 as n, 'SRID=3857;POINT(0 0)'::geometry as the_geom_webmercator","cartocss":"#s [n<=.2e-2] { marker-fill:red; }","cartocss_version":"2.1.0"}}]}
  231. ․[millstone] processing style 'style0'
  232. [millstone] finished processing '/tmp/cdb-tiler-test/millstone/test_cartodb_user_1_db/~838ad0cb51cabd04dc69b75508c63aad/base'
  233. Layergroup 838ad0cb51cabd04dc69b75508c63aad: {"version":"1.0.0","layers":[{"options":{"sql":"select 'SRID=3857;POINT(0 0)'::geometry as the_geom_webmercator","cartocss":"#layer { point-transform:\"scale(20)\"; }","cartocss_version":"2.0.1"}}]}
  234. ․[millstone] processing style 'style0'
  235. [millstone] finished processing '/tmp/cdb-tiler-test/millstone/test_cartodb_user_1_db/~ecb48402fefe097200ce119a1c265b94/base'
  236. Layergroup ecb48402fefe097200ce119a1c265b94: {"version":"1.0.0","layers":[{"options":{"sql":"select * from test_table_private_1 LIMIT 0","cartocss":"#layer { marker-fill:red; }","cartocss_version":"2.0.1"}}]}
  237. ․․Windshaft-cartodb: 1.6.0
  238. Windshaft: 0.14.5
  239. Grainstore: 0.15.2
  240. Node-mapnik: 0.7.25
  241. Mapnik: 2.1.1
  242. ․[millstone] processing style 'style.mss'
  243. [millstone] finished processing '/tmp/cdb-tiler-test/millstone/test_cartodb_user_1_db/my_table/base'
  244. ․[GET STYLE ERROR] -- 400: Error: Sorry, you are unauthorized (permission denied)
  245. ․[GET STYLE ERROR] -- 400: Error: missing unknown_user's database_name in redis (try CARTODB/script/restore_redis)
  246. ․[millstone] processing style 'style.mss'
  247. [millstone] finished processing '/tmp/cdb-tiler-test/millstone/test_cartodb_user_1_db/test_table_private_1/base'
  248. ․[millstone] processing style 'style.mss'
  249. [millstone] finished processing '/tmp/cdb-tiler-test/millstone/test_cartodb_user_1_db/issue94/base'
  250. Invalid style: #s{bogus} -- Error: style.mss:1:4 Invalid code: bogus;
  251. [millstone] processing style 'style.mss'
  252. [millstone] finished processing '/tmp/cdb-tiler-test/millstone/test_cartodb_user_1_db/issue94/base'
  253. Invalid style: #s{bogus} -- Error: style.mss:1:4 Invalid code: bogus;
  254. ․[POST STYLE ERROR] -- 400: must send style information
  255. ․[millstone] processing style 'style.mss'
  256. [millstone] finished processing '/tmp/cdb-tiler-test/millstone/test_cartodb_user_1_db/my_table3/base'
  257. [millstone] processing style 'style.mss'
  258. [millstone] finished processing '/tmp/cdb-tiler-test/millstone/test_cartodb_user_1_db/my_table3/base'
  259. [POST STYLE ERROR] -- 400: Error: style.mss:1:12 Unrecognized rule: backgxxxxxround-color
  260. ․[millstone] processing style 'style.mss'
  261. [millstone] finished processing '/tmp/cdb-tiler-test/millstone/test_cartodb_user_1_db/my_table3/base'
  262. [POST STYLE ERROR] -- 400: Error: style.mss:1:10 missing closing `}`
  263. ․[millstone] processing style 'style.mss'
  264. [millstone] finished processing '/tmp/cdb-tiler-test/millstone/test_cartodb_user_1_db/my_table4/base'
  265. [millstone] processing style 'style.mss'
  266. [millstone] finished processing '/tmp/cdb-tiler-test/millstone/test_cartodb_user_1_db/my_table4/base'
  267. [POST STYLE ERROR] -- 400: Error: style.mss:1:12 Unrecognized rule: backgxxxxxround-color
  268. style.mss:1:39 Unrecognized rule: foo
  269. ․[millstone] processing style 'style.mss'
  270. [millstone] finished processing '/tmp/cdb-tiler-test/millstone/test_cartodb_user_1_db/my_table5/base'
  271. [millstone] processing style 'style.mss'
  272. [millstone] finished processing '/tmp/cdb-tiler-test/millstone/test_cartodb_user_1_db/my_table5/base'
  273. ․[millstone] processing style 'style.mss'
  274. [millstone] finished processing '/tmp/cdb-tiler-test/millstone/test_cartodb_user_1_db/my_table5/base'
  275. [millstone] processing style 'style.mss'
  276. [millstone] finished processing '/tmp/cdb-tiler-test/millstone/test_cartodb_user_1_db/my_table5/base'
  277. ․[millstone] processing style 'style.mss'
  278. [millstone] finished processing '/tmp/cdb-tiler-test/millstone/test_cartodb_user_1_db/my_table5/base'
  279. [millstone] processing style 'style.mss'
  280. [millstone] finished processing '/tmp/cdb-tiler-test/millstone/test_cartodb_user_1_db/my_table5/base'
  281. [POST STYLE ERROR] -- 400: Error: map state cannot be changed by unauthenticated request!
  282. [millstone] processing style 'style.mss'
  283. [millstone] finished processing '/tmp/cdb-tiler-test/millstone/test_cartodb_user_1_db/my_table5/base'
  284. ․[millstone] processing style 'style.mss'
  285. [millstone] finished processing '/tmp/cdb-tiler-test/millstone/test_cartodb_user_1_db/my_table5/base'
  286. [millstone] processing style 'style.mss'
  287. [millstone] finished processing '/tmp/cdb-tiler-test/millstone/test_cartodb_user_1_db/my_table5/base'
  288. ․[millstone] processing style 'style.mss'
  289. [millstone] finished processing '/tmp/cdb-tiler-test/millstone/test_cartodb_user_1_db/my_table5/base'
  290. [millstone] processing style 'style.mss'
  291. [millstone] finished processing '/tmp/cdb-tiler-test/millstone/test_cartodb_user_1_db/my_table5/base'
  292. ․[DELETE STYLE ERROR] -- 500: Error: map state cannot be changed by unauthenticated request!
  293. ․[millstone] processing style 'style.mss'
  294. [millstone] finished processing '/tmp/cdb-tiler-test/millstone/test_cartodb_user_1_db/my_table5/base'
  295. ․․․․․[GET INFOWINDOW ERROR] -- 500: [object Object]
  296. ․[GET INFOWINDOW ERROR] -- 500: [object Object]
  297. ․․[millstone] processing style 'style.mss'
  298. [millstone] finished processing '/tmp/cdb-tiler-test/millstone/test_cartodb_user_1_db/gadm4/base'
  299. [Fri, 27 Dec 2013 00:44:44 GMT] - POST localhost/tiles/layergroup? 200 86 ms -> application/json; charset=utf-8 (-)
  300. [Fri, 27 Dec 2013 00:44:45 GMT] - POST localhost/tiles/layergroup 200 85 ms -> application/json; charset=utf-8 (-)
  301. [Fri, 27 Dec 2013 00:44:45 GMT] - GET localhost/tiles/layergroup/838ad0cb51cabd04dc69b75508c63aad:cb0/0/0/0.png 200 20 ms -> image/png (-)
  302. [Fri, 27 Dec 2013 00:44:45 GMT] - POST localhost/tiles/layergroup?api_key=1234 200 87 ms -> application/json; charset=utf-8 (-)
  303. [Fri, 27 Dec 2013 00:44:45 GMT] - GET localhost/tiles/layergroup/ecb48402fefe097200ce119a1c265b94:cb0/0/0/0.png?api_key=1234 200 16 ms -> image/png (-)
  304. [Fri, 27 Dec 2013 00:44:45 GMT] - GET 127.0.0.1:5555/ 200 - ms -> text/html; charset=utf-8 (-)
  305. [Fri, 27 Dec 2013 00:44:45 GMT] - GET 127.0.0.1:5555/version 200 2 ms -> application/json; charset=utf-8 (-)
  306. [Fri, 27 Dec 2013 00:44:45 GMT] - GET localhost/tiles/my_table/style 200 16 ms -> application/json; charset=utf-8 (-)
  307. [Fri, 27 Dec 2013 00:44:45 GMT] - GET localhost/tiles/test_table_private_1/style 400 4 ms -> application/json; charset=utf-8 (-)
  308. [Fri, 27 Dec 2013 00:44:45 GMT] - GET unknown_user/tiles/test_table_private_1/style 400 2 ms -> application/json; charset=utf-8 (-)
  309. [Fri, 27 Dec 2013 00:44:45 GMT] - GET localhost/tiles/test_table_private_1/style?map_key=1234 200 81 ms -> application/json; charset=utf-8 (-)
  310. [Fri, 27 Dec 2013 00:44:45 GMT] - GET localhost/tiles/issue94/style 200 18 ms -> application/json; charset=utf-8 (-)
  311. [Fri, 27 Dec 2013 00:44:45 GMT] - POST localhost/tiles/my_table/style 400 7 ms -> application/json; charset=utf-8 (-)
  312. [Fri, 27 Dec 2013 00:44:45 GMT] - POST localhost/tiles/my_table3/style?map_key=1234 400 22 ms -> application/json; charset=utf-8 (-)
  313. [Fri, 27 Dec 2013 00:44:45 GMT] - POST localhost/tiles/my_table3/style?map_key=1234 400 10 ms -> application/json; charset=utf-8 (-)
  314. [Fri, 27 Dec 2013 00:44:45 GMT] - POST localhost/tiles/my_table4/style?map_key=1234 400 21 ms -> application/json; charset=utf-8 (-)
  315. [Fri, 27 Dec 2013 00:44:45 GMT] - POST localhost/tiles/my_table5/style?map_key=1234 200 17 ms -> text/plain (-)
  316. [Fri, 27 Dec 2013 00:44:45 GMT] - POST localhost/tiles/my_table5/style?api_key=1234 200 14 ms -> text/plain (-)
  317. [Fri, 27 Dec 2013 00:44:45 GMT] - POST localhost/tiles/my_table5/style?map_key=1234 200 15 ms -> text/plain (-)
  318. [Fri, 27 Dec 2013 00:44:45 GMT] - POST localhost/tiles/my_table5/style 400 7 ms -> application/json; charset=utf-8 (-)
  319. [Fri, 27 Dec 2013 00:44:45 GMT] - GET localhost/tiles/my_table5/style 200 15 ms -> application/json; charset=utf-8 (-)
  320. [Fri, 27 Dec 2013 00:44:45 GMT] - POST localhost/tiles/my_table5/style?map_key=1234 200 10 ms -> text/plain (-)
  321. [Fri, 27 Dec 2013 00:44:45 GMT] - GET localhost/tiles/my_table5/style 200 13 ms -> application/json; charset=utf-8 (-)
  322. [Fri, 27 Dec 2013 00:44:45 GMT] - GET localhost/tiles/my_table5/style?style_convert=true 200 10 ms -> application/json; charset=utf-8 (-)
  323. [Fri, 27 Dec 2013 00:44:45 GMT] - POST localhost/tiles/my_table5/style?map_key=1234 200 12 ms -> text/plain (-)
  324. [Fri, 27 Dec 2013 00:44:45 GMT] - GET localhost/tiles/my_table5/style 200 13 ms -> application/json; charset=utf-8 (-)
  325. [Fri, 27 Dec 2013 00:44:45 GMT] - DELETE localhost/tiles/my_table5/style 500 7 ms -> application/json; charset=utf-8 (-)
  326. [Fri, 27 Dec 2013 00:44:45 GMT] - GET localhost/tiles/my_table5/style?map_key=1234 200 9 ms -> application/json; charset=utf-8 (-)
  327. [Fri, 27 Dec 2013 00:44:45 GMT] - DELETE localhost/tiles/my_table5/style?map_key=1234 200 10 ms -> text/plain (-)
  328. [Fri, 27 Dec 2013 00:44:45 GMT] - GET localhost/tiles/my_table5/style?map_key=1234 200 19 ms -> application/json; charset=utf-8 (-)
  329. [Fri, 27 Dec 2013 00:44:45 GMT] - GET localhost/tiles/my_table5/style 200 13 ms -> application/json; charset=utf-8 (-)
  330. [Fri, 27 Dec 2013 00:44:45 GMT] - DELETE localhost/tiles/my_table5/style?api_key=1234 200 9 ms -> text/plain (-)
  331. [Fri, 27 Dec 2013 00:44:45 GMT] - GET localhost/tiles/my_tablez/infowindow 200 16 ms -> application/json; charset=utf-8 (-)
  332. [Fri, 27 Dec 2013 00:44:45 GMT] - GET localhost/tiles/my_tablez/infowindow?callback=simon 200 13 ms -> text/javascript; charset=utf-8 (-)
  333. [Fri, 27 Dec 2013 00:44:45 GMT] - GET localhost/tiles/my_table/infowindow?callback=simon 200 21 ms -> text/javascript; charset=utf-8 (-)
  334. [Fri, 27 Dec 2013 00:44:45 GMT] - GET localhost/tiles/test_table_private_1/infowindow 500 5 ms -> application/json; charset=utf-8 (-)
  335. [Fri, 27 Dec 2013 00:44:45 GMT] - GET unknown_user/tiles/test_table_private_1/infowindow 500 3 ms -> application/json; charset=utf-8 (-)
  336. [Fri, 27 Dec 2013 00:44:45 GMT] - GET localhost/tiles/test_table_private_1/infowindow?map_key=1234 200 12 ms -> application/json; charset=utf-8 (-)
  337. ․․[millstone] processing style 'style.mss'
  338. [millstone] finished processing '/tmp/cdb-tiler-test/millstone/test_cartodb_user_1_db/gadm4/base'
  339. ․req2params ERROR:
  340. [Error: Sorry, you are unauthorized (permission denied)]
  341. beforeTileRender ERROR:
  342. [Error: Sorry, you are unauthorized (permission denied)]
  343. getRenderer ERROR:
  344. [Error: Sorry, you are unauthorized (permission denied)]
  345. get{Tile,Grid} ERROR:
  346. [Error: Sorry, you are unauthorized (permission denied)]
  347. [TILE RENDER ERROR] -- 401: Error: Sorry, you are unauthorized (permission denied)
  348. ․req2params ERROR:
  349. [Error: missing unknown_user's database_name in redis (try CARTODB/script/restore_redis)]
  350. beforeTileRender ERROR:
  351. [Error: missing unknown_user's database_name in redis (try CARTODB/script/restore_redis)]
  352. getRenderer ERROR:
  353. [Error: missing unknown_user's database_name in redis (try CARTODB/script/restore_redis)]
  354. get{Tile,Grid} ERROR:
  355. [Error: missing unknown_user's database_name in redis (try CARTODB/script/restore_redis)]
  356. [TILE RENDER ERROR] -- 400: Error: missing unknown_user's database_name in redis (try CARTODB/script/restore_redis)
  357. ․․․․[Fri, 27 Dec 2013 00:44:45 GMT] - GET localhost/tiles/gadm4/6/31/24.grid.json 200 212 ms -> text/javascript; charset=utf-8; charset=utf-8 (-)
  358. [Fri, 27 Dec 2013 00:44:46 GMT] - GET localhost/tiles/gadm4/6/31/24.grid.json 200 246 ms -> text/javascript; charset=utf-8; charset=utf-8 (-)
  359. [Fri, 27 Dec 2013 00:44:46 GMT] - GET localhost/tiles/gadm4/6/31/24.grid.json?sql=SELECT%20*%20FROM%20gadm4%20WHERE%20codineprov%20%3D%20'08' 200 59 ms -> text/javascript; charset=utf-8; charset=utf-8 (-)
  360. [Fri, 27 Dec 2013 00:44:46 GMT] - GET localhost/tiles/test_table_private_1/6/31/24.grid.json 401 7 ms -> application/json; charset=utf-8 (-)
  361. [Fri, 27 Dec 2013 00:44:46 GMT] - GET unknown_user/tiles/test_table_private_1/6/31/24.grid.json 400 5 ms -> application/json; charset=utf-8 (-)
  362. [Fri, 27 Dec 2013 00:44:46 GMT] - GET localhost/tiles/test_table_private_1/6/31/24.grid.json?map_key=1234 200 31 ms -> text/javascript; charset=utf-8; charset=utf-8 (-)
  363. [Fri, 27 Dec 2013 00:44:46 GMT] - GET localhost/tiles/gadm4/6/31/24.png 200 290 ms -> image/png (-)
  364. [Fri, 27 Dec 2013 00:44:46 GMT] - GET localhost/tiles/gadm4/6/31/24.png?cache_policy=persist 200 267 ms -> image/png (-)
  365. ․․[millstone] processing style 'style.mss'
  366. [millstone] finished processing '/tmp/cdb-tiler-test/millstone/test_cartodb_user_1_db/gadm4/base'
  367. ․[millstone] processing style 'style.mss'
  368. [millstone] finished processing '/tmp/cdb-tiler-test/millstone/test_cartodb_user_1_db/gadm4/base'
  369. ․․getRenderer ERROR:
  370. [Error: Postgis Plugin: PSQL error:
  371. ERROR:  permission denied for relation test_table_private_1
  372. Full sql was: 'SELECT * FROM (SELECT * FROM test_table_private_1) as cdbq LIMIT 0'
  373.   encountered during parsing of layer 'gadm4' in Layer at line 27]
  374. get{Tile,Grid} ERROR:
  375. [Error: Postgis Plugin: PSQL error:
  376. ERROR:  permission denied for relation test_table_private_1
  377. Full sql was: 'SELECT * FROM (SELECT * FROM test_table_private_1) as cdbq LIMIT 0'
  378.   encountered during parsing of layer 'gadm4' in Layer at line 27]
  379. [TILE RENDER ERROR] -- 401: Error: Postgis Plugin: PSQL error:
  380. ERROR:  permission denied for relation test_table_private_1
  381. Full sql was: 'SELECT * FROM (SELECT * FROM test_table_private_1) as cdbq LIMIT 0'
  382.   encountered during parsing of layer 'gadm4' in Layer at line 27
  383. ․req2params ERROR:
  384. [Error: missing unknown_user's database_name in redis (try CARTODB/script/restore_redis)]
  385. beforeTileRender ERROR:
  386. [Error: missing unknown_user's database_name in redis (try CARTODB/script/restore_redis)]
  387. getRenderer ERROR:
  388. [Error: missing unknown_user's database_name in redis (try CARTODB/script/restore_redis)]
  389. get{Tile,Grid} ERROR:
  390. [Error: missing unknown_user's database_name in redis (try CARTODB/script/restore_redis)]
  391. [TILE RENDER ERROR] -- 400: Error: missing unknown_user's database_name in redis (try CARTODB/script/restore_redis)
  392. ․getRenderer ERROR:
  393. [Error: Postgis Plugin: PSQL error:
  394. ERROR:  permission denied for relation test_table_private_1
  395. Full sql was: 'SELECT * FROM (SELECT * FROM test_table_private_1) as cdbq LIMIT 0'
  396.   encountered during parsing of layer 'gadm4' in Layer at line 27]
  397. get{Tile,Grid} ERROR:
  398. [Error: Postgis Plugin: PSQL error:
  399. ERROR:  permission denied for relation test_table_private_1
  400. Full sql was: 'SELECT * FROM (SELECT * FROM test_table_private_1) as cdbq LIMIT 0'
  401.   encountered during parsing of layer 'gadm4' in Layer at line 27]
  402. [TILE RENDER ERROR] -- 401: Error: Postgis Plugin: PSQL error:
  403. ERROR:  permission denied for relation test_table_private_1
  404. Full sql was: 'SELECT * FROM (SELECT * FROM test_table_private_1) as cdbq LIMIT 0'
  405.   encountered during parsing of layer 'gadm4' in Layer at line 27
  406. ․[millstone] processing style 'style.mss'
  407. [millstone] finished processing '/tmp/cdb-tiler-test/millstone/test_cartodb_user_1_db/test_table/base'
  408. ․․[Fri, 27 Dec 2013 00:44:47 GMT] - GET localhost/tiles/gadm4/6/31/24.png?geom_type=polygon 200 283 ms -> image/png (-)
  409. [Fri, 27 Dec 2013 00:44:47 GMT] - GET localhost/tiles/gadm4/6/31/24.png?sql=SELECT%20*%20FROM%20gadm4%20WHERE%20codineprov%20%3D%20'08' 200 65 ms -> image/png (-)
  410. [Fri, 27 Dec 2013 00:44:47 GMT] - GET localhost/tiles/gadm4/6/31/24.png?sql=SELECT%20*%20FROM%20gadm4%20WHERE%20%20codineprov%20%3D%20'08'%20AND%20codccaa%20%3E%2060 200 77 ms -> image/png (-)
  411. [Fri, 27 Dec 2013 00:44:47 GMT] - GET localhost/tiles/gadm4/6/31/24.png?sql=SELECT%20*%20FROM%20test_table_private_1&map_key=1234 200 70 ms -> image/png (-)
  412. [Fri, 27 Dec 2013 00:44:47 GMT] - GET localhost/tiles/gadm4/6/31/24.png?sql=SELECT%20*%20FROM%20test_table_private_1&api_key=1234 200 19 ms -> image/png (-)
  413. [Fri, 27 Dec 2013 00:44:47 GMT] - GET localhost/tiles/gadm4/6/31/24.png?sql=SELECT%20*%20FROM%20test_table_private_1&cache_buster=2 401 20 ms -> application/json; charset=utf-8 (-)
  414. [Fri, 27 Dec 2013 00:44:47 GMT] - GET unknown_user/tiles/gadm4/6/31/24.png?sql=SELECT%20*%20FROM%20test_table_private_1&cache_buster=2 400 4 ms -> application/json; charset=utf-8 (-)
  415. [Fri, 27 Dec 2013 00:44:47 GMT] - GET localhost/tiles/gadm4/6/31/24.png?sql=SELECT%20*%20FROM%20test_table_private_1&cache_buster=3&map_key=1235 401 17 ms -> application/json; charset=utf-8 (-)
  416. [Fri, 27 Dec 2013 00:44:47 GMT] - GET localhost/tiles/test_table/15/16046/12354.png?cache_buster=4&style=%23test_table%7Bmarker-fill%3Ablack%3Bmarker-line-color%3Ared%3Bmarker-width%3A10%7D&style_version=2.0.0 200 86 ms -> image/png (-)
  417. [Fri, 27 Dec 2013 00:44:47 GMT] - GET cartodb250user/tiles/test_table/15/16046/12354.png?cache_buster=4.10&style=%23test_table%7Bmarker-fill%3Ablack%3Bmarker-line-color%3Ared%3Bmarker-width%3A10%7D&style_version=2.0.0 200 112 ms -> image/png (-)
  418. [Fri, 27 Dec 2013 00:44:47 GMT] - GET cartodb250user/tiles/test_table/15/16046/12354.png?cache_buster=4.20&api_key=4321&style=%23test_table%7Bmarker-fill%3Ablack%3Bmarker-line-color%3Ared%3Bmarker-width%3A10%7D&style_version=2.0.0 200 100 ms -> image/png (-)
  419. ․[millstone] processing style 'style.mss'
  420. [millstone] finished processing '/tmp/cdb-tiler-test/millstone/test_cartodb_user_1_db/test_table/base'
  421. ․․[millstone] processing style 'style.mss'
  422. [millstone] finished processing '/tmp/cdb-tiler-test/millstone/test_cartodb_user_1_db/test_table/base'
  423. [millstone] processing style 'style.mss'
  424. [millstone] finished processing '/tmp/cdb-tiler-test/millstone/test_cartodb_user_1_db/test_table/base'
  425. [millstone] processing style 'style.mss'
  426. [millstone] finished processing '/tmp/cdb-tiler-test/millstone/test_cartodb_user_1_db/test_table/base'
  427. [millstone] processing style 'style.mss'
  428. [millstone] finished processing '/tmp/cdb-tiler-test/millstone/test_cartodb_user_1_db/test_table/base'
  429. [millstone] processing style 'style.mss'
  430. [millstone] finished processing '/tmp/cdb-tiler-test/millstone/test_cartodb_user_1_db/test_table/base'
  431. [millstone] processing style 'style.mss'
  432. [millstone] finished processing '/tmp/cdb-tiler-test/millstone/test_cartodb_user_1_db/test_table/base'
  433. ․[millstone] processing style 'style.mss'
  434. [millstone] finished processing '/tmp/cdb-tiler-test/millstone/test_cartodb_user_1_db/gadm4/base'
  435. [Fri, 27 Dec 2013 00:44:47 GMT] - GET localhost/tiles/test_table/15/16046/12354.png?cache_buster=4&style=%23test_table%7Bmarker-fill%3Ablack%3Bmarker-line-color%3Ared%3Bmarker-width%3A20%7D&style_version=2.1.0 200 59 ms -> image/png (-)
  436. [Fri, 27 Dec 2013 00:44:48 GMT] - GET localhost/tiles/test_table/15/16046/12354.png?lzma=3YCAgYD5gICAgICAgIC9CArnBNJMOER3AKLyhUQsiz8S4eVXhGvbqbYpOlb6NKqiK1YN1LvAAINO1YExhyYKG5mJNTajIfKcORRLQpsi9Prs9ad5XY%2BrN7lKpCl0Zb%2FduHu%2B01A4zEbmeZtQVOyzsuzb52nIe2N7XQQA 200 70 ms -> image/png (-)
  437. [Fri, 27 Dec 2013 00:44:48 GMT] - POST localhost/tiles/test_table/style 200 38 ms -> text/plain (-)
  438. [Fri, 27 Dec 2013 00:44:48 GMT] - GET localhost/tiles/test_table/15/16046/12354.png 200 76 ms -> image/png (-)
  439. [Fri, 27 Dec 2013 00:44:48 GMT] - GET localhost/tiles/test_table/15/16046/12354.png?map_key=1234 200 63 ms -> image/png (-)
  440. [Fri, 27 Dec 2013 00:44:48 GMT] - POST localhost/tiles/test_table/style 200 22 ms -> text/plain (-)
  441. [Fri, 27 Dec 2013 00:44:48 GMT] - GET localhost/tiles/test_table/15/16046/12354.png 200 83 ms -> image/png (-)
  442. [Fri, 27 Dec 2013 00:44:48 GMT] - DELETE localhost/tiles/test_table/style?map_key=1234 200 11 ms -> text/plain (-)
  443. [Fri, 27 Dec 2013 00:44:48 GMT] - GET localhost/tiles/test_table/15/16046/12354.png?cache_buster=2314 200 84 ms -> image/png (-)
  444. ․ERROR generating cache channel: could not fetch source tables: Some error occurred
  445. unexpected response status (400) for sql query: SELECT CDB_QueryTables($windshaft$SELECT g.cartodb_id, g.codineprov, t.the_geom_webmercator , 'SQLAPIERROR' is not null FROM gadm4 g, test_table t WHERE g.cartodb_id = t.cartodb_id$windshaft$): Some error occurred
  446. [millstone] processing style 'style.mss'
  447. [millstone] finished processing '/tmp/cdb-tiler-test/millstone/test_cartodb_user_1_db/gadm4/base'
  448. ․[millstone] processing style 'style.mss'
  449. [millstone] finished processing '/tmp/cdb-tiler-test/millstone/test_cartodb_user_1_db/gadm4/base'
  450. ․․․[GET MAP_METADATA ERROR] -- 500: [object Object]
  451. ․․․․․․․․․․․․․
  452.  
  453.   83 passing (6s)
  454.   9 failing
  455.  
  456.   1) server get'ing blank style returns default style:
  457.  
  458.       + expected - actual
  459.  
  460.       +2.1.1
  461.       -2.1.0
  462.      
  463.   AssertionError: "2.1.0" == "2.1.1"
  464.       at assert.response.headers.host (/root/Windshaft-cartodb/test/acceptance/server.js:110:20)
  465.       at IncomingMessage.assert.response (/root/Windshaft-cartodb/test/support/assert.js:256:17)
  466.       at IncomingMessage.EventEmitter.emit (events.js:115:20)
  467.       at IncomingMessage._emitEnd (http.js:366:10)
  468.       at HTTPParser.parserOnMessageComplete [as onMessageComplete] (http.js:149:23)
  469.       at Socket.socketOnData [as ondata] (http.js:1366:20)
  470.       at TCP.onread (net.js:403:27)
  471.  
  472.   2) server get'ing style of private table should succeed when authenticated:
  473.  
  474.       + expected - actual
  475.  
  476.       +2.1.1
  477.       -2.1.0
  478.      
  479.   AssertionError: "2.1.0" == "2.1.1"
  480.       at base_key (/root/Windshaft-cartodb/test/acceptance/server.js:161:18)
  481.       at IncomingMessage.assert.response (/root/Windshaft-cartodb/test/support/assert.js:256:17)
  482.       at IncomingMessage.EventEmitter.emit (events.js:115:20)
  483.       at IncomingMessage._emitEnd (http.js:366:10)
  484.       at HTTPParser.parserOnMessageComplete [as onMessageComplete] (http.js:149:23)
  485.       at Socket.socketOnData [as ondata] (http.js:1366:20)
  486.       at TCP.onread (net.js:403:27)
  487.  
  488.   3) template_api can add template, returning id:
  489.      Uncaught Error: listen EADDRINUSE
  490.       at errnoException (net.js:769:11)
  491.       at HTTPServer.Server._listen2 (net.js:909:14)
  492.       at listen (net.js:936:10)
  493.       at Server.listen (net.js:993:9)
  494.       at dns.js:71:18
  495.       at process.startup.processNextTick.process._tickCallback (node.js:244:9)
  496.  
  497.   4) template_api can list templates:
  498.      Uncaught Error: listen EADDRINUSE
  499.       at errnoException (net.js:769:11)
  500.       at HTTPServer.Server._listen2 (net.js:909:14)
  501.       at listen (net.js:936:10)
  502.       at Server.listen (net.js:993:9)
  503.       at dns.js:71:18
  504.       at process.startup.processNextTick.process._tickCallback (node.js:244:9)
  505.  
  506.   5) template_api can update template:
  507.      Uncaught Error: listen EADDRINUSE
  508.       at errnoException (net.js:769:11)
  509.       at HTTPServer.Server._listen2 (net.js:909:14)
  510.       at listen (net.js:936:10)
  511.       at Server.listen (net.js:993:9)
  512.       at dns.js:71:18
  513.       at process.startup.processNextTick.process._tickCallback (node.js:244:9)
  514.  
  515.   6) template_api can get a template by id:
  516.      Uncaught Error: listen EADDRINUSE
  517.       at errnoException (net.js:769:11)
  518.       at HTTPServer.Server._listen2 (net.js:909:14)
  519.       at listen (net.js:936:10)
  520.       at Server.listen (net.js:993:9)
  521.       at dns.js:71:18
  522.       at process.startup.processNextTick.process._tickCallback (node.js:244:9)
  523.  
  524.   7) template_api can delete a template by id:
  525.      Uncaught Error: listen EADDRINUSE
  526.       at errnoException (net.js:769:11)
  527.       at HTTPServer.Server._listen2 (net.js:909:14)
  528.       at listen (net.js:936:10)
  529.       at Server.listen (net.js:993:9)
  530.       at dns.js:71:18
  531.       at process.startup.processNextTick.process._tickCallback (node.js:244:9)
  532.  
  533.   8) template_api can instanciate a template by id:
  534.      Uncaught Error: listen EADDRINUSE
  535.       at errnoException (net.js:769:11)
  536.       at HTTPServer.Server._listen2 (net.js:909:14)
  537.       at listen (net.js:936:10)
  538.       at Server.listen (net.js:993:9)
  539.       at dns.js:71:18
  540.       at process.startup.processNextTick.process._tickCallback (node.js:244:9)
  541.  
  542.   9) template_api template instantiation raises mapviews counter:
  543.      Uncaught Error: listen EADDRINUSE
  544.       at errnoException (net.js:769:11)
  545.       at HTTPServer.Server._listen2 (net.js:909:14)
  546.       at listen (net.js:936:10)
  547.       at Server.listen (net.js:993:9)
  548.       at dns.js:71:18
  549.       at process.startup.processNextTick.process._tickCallback (node.js:244:9)
  550.  
  551.  
  552.  
  553. Killing test redis pid 12294
  554. Dropping PostgreSQL test database isn't implemented yet
  555. make: *** [check-local] Error 9
RAW Paste Data
We use cookies for various purposes including analytics. By continuing to use Pastebin, you agree to our use of cookies as described in the Cookies Policy. OK, I Understand
 
Top