daily pastebin goal
25%
SHARE
TWEET

knowrob_installation_problems

a guest Mar 6th, 2019 55 Never
Not a member of Pastebin yet? Sign Up, it unlocks many cool features!
  1. make[1]: Leaving directory '/home/kmanivannan/hmi/knowrob_ws/build/knowrob_common'
  2. /usr/bin/cmake -E cmake_progress_start /home/kmanivannan/hmi/knowrob_ws/build/knowrob_common/CMakeFiles 0
  3. cd /home/kmanivannan/hmi/knowrob_ws/build/knowrob_common; catkin build --get-env knowrob_common | catkin env -si  /usr/bin/make --jobserver-fds=6,7 -j; cd -
  4. Finished   << knowrob_common:make                                                                                                                                                                                                    
  5. Starting   >> knowrob_common:symlink                                                                                                                                                                                                  
  6. Output     << knowrob_common:symlink /home/kmanivannan/hmi/knowrob_ws/logs/knowrob_common/build.symlink.000.log                                                                                                                      
  7. Symlinking /home/kmanivannan/hmi/knowrob_ws/devel/lib/pkgconfig/knowrob_common.pc
  8. Symlinking /home/kmanivannan/hmi/knowrob_ws/devel/share/knowrob_common/cmake/knowrob_commonConfig.cmake
  9. Symlinking /home/kmanivannan/hmi/knowrob_ws/devel/share/knowrob_common/cmake/knowrob_commonConfig-version.cmake
  10. Finished   << knowrob_common:symlink                                                                                                                                                                                                  
  11. Finished  <<< knowrob_common                             [ 5.7 seconds ]                                                                                                                                                              
  12. Starting  >>> comp_orgprinciples                                                                                                                                                                                                      
  13. Starting  >>> comp_temporal                                                                                                                                                                                                          
  14. Starting  >>> json_prolog                                                                                                                                                                                                            
  15. Starting  >>> knowrob_objects                                                                                                                                                                                                        
  16. Starting   >> knowrob_objects:loadenv                                                                                                                                                                                                
  17. Output     << knowrob_objects:loadenv /home/kmanivannan/hmi/knowrob_ws/logs/knowrob_objects/build.loadenv.000.log                                                                                                                    
  18. Loading environment from: /home/kmanivannan/hmi/knowrob_ws/devel/env.sh
  19. Finished   << knowrob_objects:loadenv                                                                                                                                                                                                
  20. Starting   >> knowrob_objects:mkdir                                                                                                                                                                                                  
  21. Starting   >> comp_temporal:loadenv                                                                                                                                                                                                  
  22. Starting   >> knowrob_objects:mkdir                                                                                                                                                                                                  
  23. Starting   >> knowrob_objects:cache-manifest                                                                                                                                                                                          
  24. Starting   >> knowrob_objects:ctr-nuke                                                                                                                                                                                                
  25. Starting   >> knowrob_objects:cmake                                                                                                                                                                                                  
  26. Subprocess  > knowrob_objects:cmake `cd /home/kmanivannan/hmi/knowrob_ws/build/knowrob_objects; catkin build --get-env knowrob_objects | catkin env -si  /usr/bin/cmake /home/kmanivannan/hmi/knowrob_ws/src/knowrob/knowrob_objects --no-warn-unused-cli -DCATKIN_DEVEL_PREFIX=/home/kmanivannan/hmi/knowrob_ws/devel/.private/knowrob_objects -DCMAKE_INSTALL_PREFIX=/home/kmanivannan/hmi/knowrob_ws/install; cd -`
  27. Output     << comp_temporal:loadenv /home/kmanivannan/hmi/knowrob_ws/logs/comp_temporal/build.loadenv.000.log                                                                                                                        
  28. Loading environment from: /home/kmanivannan/hmi/knowrob_ws/devel/env.sh
  29. Finished   << comp_temporal:loadenv                                                                                                                                                                                                  
  30. Starting   >> comp_temporal:mkdir                                                                                                                                                                                                    
  31. Starting   >> comp_orgprinciples:loadenv                                                                                                                                                                                              
  32. Starting   >> comp_temporal:mkdir                                                                                                                                                                                                    
  33. Starting   >> comp_temporal:cache-manifest                                                                                                                                                                                            
  34. Starting   >> comp_temporal:ctr-nuke                                                                                                                                                                                                  
  35. Starting   >> comp_temporal:cmake                                                                                                                                                                                                    
  36. Subprocess  > comp_temporal:cmake `cd /home/kmanivannan/hmi/knowrob_ws/build/comp_temporal; catkin build --get-env comp_temporal | catkin env -si  /usr/bin/cmake /home/kmanivannan/hmi/knowrob_ws/src/knowrob/comp_temporal --no-warn-unused-cli -DCATKIN_DEVEL_PREFIX=/home/kmanivannan/hmi/knowrob_ws/devel/.private/comp_temporal -DCMAKE_INSTALL_PREFIX=/home/kmanivannan/hmi/knowrob_ws/install; cd -`
  37. Output     << tfjava:make /home/kmanivannan/hmi/knowrob_ws/logs/tfjava/build.make.000.log                                                                                                                                            
  38. /usr/bin/cmake -H/home/kmanivannan/hmi/knowrob_ws/src/knowrob/tfjava -B/home/kmanivannan/hmi/knowrob_ws/build/tfjava --check-build-system CMakeFiles/Makefile.cmake 0
  39. /usr/bin/cmake -E cmake_progress_start /home/kmanivannan/hmi/knowrob_ws/build/tfjava/CMakeFiles /home/kmanivannan/hmi/knowrob_ws/build/tfjava/CMakeFiles/progress.marks
  40. /usr/bin/make -f CMakeFiles/Makefile2 all
  41. make[1]: Entering directory '/home/kmanivannan/hmi/knowrob_ws/build/tfjava'
  42. /usr/bin/make -f CMakeFiles/gradle-tfjava.dir/build.make CMakeFiles/gradle-tfjava.dir/depend
  43. make[2]: Entering directory '/home/kmanivannan/hmi/knowrob_ws/build/tfjava'
  44. cd /home/kmanivannan/hmi/knowrob_ws/build/tfjava && /usr/bin/cmake -E cmake_depends "Unix Makefiles" /home/kmanivannan/hmi/knowrob_ws/src/knowrob/tfjava /home/kmanivannan/hmi/knowrob_ws/src/knowrob/tfjava /home/kmanivannan/hmi/knowrob_ws/build/tfjava /home/kmanivannan/hmi/knowrob_ws/build/tfjava /home/kmanivannan/hmi/knowrob_ws/build/tfjava/CMakeFiles/gradle-tfjava.dir/DependInfo.cmake --color=
  45. Dependee "/home/kmanivannan/hmi/knowrob_ws/build/tfjava/CMakeFiles/gradle-tfjava.dir/DependInfo.cmake" is newer than depender "/home/kmanivannan/hmi/knowrob_ws/build/tfjava/CMakeFiles/gradle-tfjava.dir/depend.internal".
  46. Dependee "/home/kmanivannan/hmi/knowrob_ws/build/tfjava/CMakeFiles/CMakeDirectoryInformation.cmake" is newer than depender "/home/kmanivannan/hmi/knowrob_ws/build/tfjava/CMakeFiles/gradle-tfjava.dir/depend.internal".
  47. Scanning dependencies of target gradle-tfjava
  48. make[2]: Leaving directory '/home/kmanivannan/hmi/knowrob_ws/build/tfjava'
  49. /usr/bin/make -f CMakeFiles/gradle-tfjava.dir/build.make CMakeFiles/gradle-tfjava.dir/build
  50. make[2]: Entering directory '/home/kmanivannan/hmi/knowrob_ws/build/tfjava'
  51. [100%] Gradling tasks for tfjava
  52. cd /home/kmanivannan/hmi/knowrob_ws/src/knowrob/tfjava && ROS_MAVEN_REPOSITORY=https://github.com/rosjava/rosjava_mvn_repo/raw/master /home/kmanivannan/hmi/knowrob_ws/build/tfjava/catkin_generated/env_cached.sh /home/kmanivannan/hmi/knowrob_ws/src/knowrob/tfjava/gradlew -q publishMavenJavaPublicationToMavenRepository writeClasspath
  53. make[2]: Leaving directory '/home/kmanivannan/hmi/knowrob_ws/build/tfjava'
  54. [100%] Built target gradle-tfjava
  55. make[1]: Leaving directory '/home/kmanivannan/hmi/knowrob_ws/build/tfjava'
  56. /usr/bin/cmake -E cmake_progress_start /home/kmanivannan/hmi/knowrob_ws/build/tfjava/CMakeFiles 0
  57. cd /home/kmanivannan/hmi/knowrob_ws/build/tfjava; catkin build --get-env tfjava | catkin env -si  /usr/bin/make --jobserver-fds=6,7 -j; cd -
  58. Finished   << tfjava:make                                                                                                                                                                                                            
  59. Starting   >> tfjava:symlink                                                                                                                                                                                                          
  60. Output     << tfjava:symlink /home/kmanivannan/hmi/knowrob_ws/logs/tfjava/build.symlink.000.log                                                                                                                                      
  61. Symlinking /home/kmanivannan/hmi/knowrob_ws/devel/lib/pkgconfig/tfjava.pc
  62. Symlinking /home/kmanivannan/hmi/knowrob_ws/devel/share/tfjava/cmake/tfjavaConfig.cmake
  63. Symlinking /home/kmanivannan/hmi/knowrob_ws/devel/share/tfjava/cmake/tfjavaConfig-version.cmake
  64. Finished   << tfjava:symlink                                                                                                                                                                                                          
  65. Finished  <<< tfjava                                     [ 5.9 seconds ]                                                                                                                                                              
  66. Output     << comp_orgprinciples:loadenv /home/kmanivannan/hmi/knowrob_ws/logs/comp_orgprinciples/build.loadenv.000.log                                                                                                              
  67. Loading environment from: /home/kmanivannan/hmi/knowrob_ws/devel/env.sh
  68. Finished   << comp_orgprinciples:loadenv                                                                                                                                                                                              
  69. Starting   >> comp_orgprinciples:mkdir                                                                                                                                                                                                
  70. Starting   >> json_prolog:loadenv                                                                                                                                                                                                    
  71. Starting   >> comp_orgprinciples:mkdir                                                                                                                                                                                                
  72. Starting   >> comp_orgprinciples:cache-manifest                                                                                                                                                                                      
  73. Starting   >> comp_orgprinciples:ctr-nuke                                                                                                                                                                                            
  74. Starting   >> comp_orgprinciples:cmake                                                                                                                                                                                                
  75. Subprocess  > comp_orgprinciples:cmake `cd /home/kmanivannan/hmi/knowrob_ws/build/comp_orgprinciples; catkin build --get-env comp_orgprinciples | catkin env -si  /usr/bin/cmake /home/kmanivannan/hmi/knowrob_ws/src/knowrob/comp_orgprinciples --no-warn-unused-cli -DCATKIN_DEVEL_PREFIX=/home/kmanivannan/hmi/knowrob_ws/devel/.private/comp_orgprinciples -DCMAKE_INSTALL_PREFIX=/home/kmanivannan/hmi/knowrob_ws/install; cd -`
  76. Output     << json_prolog:loadenv /home/kmanivannan/hmi/knowrob_ws/logs/json_prolog/build.loadenv.000.log                                                                                                                            
  77. Loading environment from: /home/kmanivannan/hmi/knowrob_ws/devel/env.sh
  78. Finished   << json_prolog:loadenv                                                                                                                                                                                                    
  79. Starting   >> json_prolog:mkdir                                                                                                                                                                                                      
  80. Starting   >> json_prolog:mkdir                                                                                                                                                                                                      
  81. Starting   >> json_prolog:cache-manifest                                                                                                                                                                                              
  82. Starting   >> json_prolog:ctr-nuke                                                                                                                                                                                                    
  83. Starting   >> json_prolog:cmake                                                                                                                                                                                                      
  84. Subprocess  > json_prolog:cmake `cd /home/kmanivannan/hmi/knowrob_ws/build/json_prolog; catkin build --get-env json_prolog | catkin env -si  /usr/bin/cmake /home/kmanivannan/hmi/knowrob_ws/src/knowrob/json_prolog --no-warn-unused-cli -DCATKIN_DEVEL_PREFIX=/home/kmanivannan/hmi/knowrob_ws/devel/.private/json_prolog -DCMAKE_INSTALL_PREFIX=/home/kmanivannan/hmi/knowrob_ws/install; cd -`
  85. Output     << comp_temporal:cmake /home/kmanivannan/hmi/knowrob_ws/logs/comp_temporal/build.cmake.000.log                                                                                                                            
  86. Not searching for unused variables given on the command line.
  87. Re-run cmake no build system arguments
  88. -- The C compiler identification is GNU 5.4.0
  89. -- The CXX compiler identification is GNU 5.4.0
  90. -- Check for working C compiler: /usr/bin/cc
  91. -- Check for working C compiler: /usr/bin/cc -- works
  92. -- Detecting C compiler ABI info
  93. -- Detecting C compiler ABI info - done
  94. -- Detecting C compile features
  95. -- Detecting C compile features - done
  96. -- Check for working CXX compiler: /usr/bin/c++
  97. -- Check for working CXX compiler: /usr/bin/c++ -- works
  98. -- Detecting CXX compiler ABI info
  99. -- Detecting CXX compiler ABI info - done
  100. -- Detecting CXX compile features
  101. -- Detecting CXX compile features - done
  102. -- Using CATKIN_DEVEL_PREFIX: /home/kmanivannan/hmi/knowrob_ws/devel/.private/comp_temporal
  103. -- Using CMAKE_PREFIX_PATH: /home/kmanivannan/hmi/knowrob_ws/devel;/home/kmanivannan/aquanaut_ws/install;/opt/ros/kinetic
  104. -- This workspace overlays: /home/kmanivannan/hmi/knowrob_ws/devel;/home/kmanivannan/aquanaut_ws/install;/opt/ros/kinetic
  105. -- Found PythonInterp: /usr/bin/python (found version "2.7.12")
  106. -- Using PYTHON_EXECUTABLE: /usr/bin/python
  107. -- Using Debian Python package layout
  108. -- Using empy: /usr/bin/empy
  109. -- Using CATKIN_ENABLE_TESTING: ON
  110. -- Call enable_testing()
  111. -- Using CATKIN_TEST_RESULTS_DIR: /home/kmanivannan/hmi/knowrob_ws/build/comp_temporal/test_results
  112. -- Found gmock sources under '/usr/src/gmock': gmock will be built
  113. -- Looking for pthread.h
  114. -- Looking for pthread.h - found
  115. -- Looking for pthread_create
  116. -- Looking for pthread_create - not found
  117. -- Looking for pthread_create in pthreads
  118. -- Looking for pthread_create in pthreads - not found
  119. -- Looking for pthread_create in pthread
  120. -- Looking for pthread_create in pthread - found
  121. -- Found Threads: TRUE
  122. -- Found gtest sources under '/usr/src/gmock': gtests will be built
  123. -- Using Python nosetests: /usr/bin/nosetests-2.7
  124. -- catkin 0.7.14
  125. -- Configuring done
  126. -- Generating done
  127. -- Build files have been written to: /home/kmanivannan/hmi/knowrob_ws/build/comp_temporal
  128. cd /home/kmanivannan/hmi/knowrob_ws/build/comp_temporal; catkin build --get-env comp_temporal | catkin env -si  /usr/bin/cmake /home/kmanivannan/hmi/knowrob_ws/src/knowrob/comp_temporal --no-warn-unused-cli -DCATKIN_DEVEL_PREFIX=/home/kmanivannan/hmi/knowrob_ws/devel/.private/comp_temporal -DCMAKE_INSTALL_PREFIX=/home/kmanivannan/hmi/knowrob_ws/install; cd -
  129. Finished   << comp_temporal:cmake                                                                                                                                                                                                    
  130. Starting   >> comp_temporal:make                                                                                                                                                                                                      
  131. Subprocess  > comp_temporal:make `cd /home/kmanivannan/hmi/knowrob_ws/build/comp_temporal; catkin build --get-env comp_temporal | catkin env -si  /usr/bin/make --jobserver-fds=6,7 -j; cd -`                                        
  132. Output     << comp_temporal:make /home/kmanivannan/hmi/knowrob_ws/logs/comp_temporal/build.make.000.log                                                                                                                              
  133. /usr/bin/cmake -H/home/kmanivannan/hmi/knowrob_ws/src/knowrob/comp_temporal -B/home/kmanivannan/hmi/knowrob_ws/build/comp_temporal --check-build-system CMakeFiles/Makefile.cmake 0
  134. /usr/bin/cmake -E cmake_progress_start /home/kmanivannan/hmi/knowrob_ws/build/comp_temporal/CMakeFiles /home/kmanivannan/hmi/knowrob_ws/build/comp_temporal/CMakeFiles/progress.marks
  135. /usr/bin/make -f CMakeFiles/Makefile2 all
  136. make[1]: Entering directory '/home/kmanivannan/hmi/knowrob_ws/build/comp_temporal'
  137. make[1]: Nothing to be done for 'all'.
  138. make[1]: Leaving directory '/home/kmanivannan/hmi/knowrob_ws/build/comp_temporal'
  139. /usr/bin/cmake -E cmake_progress_start /home/kmanivannan/hmi/knowrob_ws/build/comp_temporal/CMakeFiles 0
  140. cd /home/kmanivannan/hmi/knowrob_ws/build/comp_temporal; catkin build --get-env comp_temporal | catkin env -si  /usr/bin/make --jobserver-fds=6,7 -j; cd -
  141. Finished   << comp_temporal:make                                                                                                                                                                                                      
  142. Starting   >> comp_temporal:symlink                                                                                                                                                                                                  
  143. Output     << comp_temporal:symlink /home/kmanivannan/hmi/knowrob_ws/logs/comp_temporal/build.symlink.000.log                                                                                                                        
  144. Symlinking /home/kmanivannan/hmi/knowrob_ws/devel/lib/pkgconfig/comp_temporal.pc
  145. Symlinking /home/kmanivannan/hmi/knowrob_ws/devel/share/comp_temporal/cmake/comp_temporalConfig-version.cmake
  146. Symlinking /home/kmanivannan/hmi/knowrob_ws/devel/share/comp_temporal/cmake/comp_temporalConfig.cmake
  147. Finished   << comp_temporal:symlink                                                                                                                                                                                                  
  148. Finished  <<< comp_temporal                              [ 2.3 seconds ]                                                                                                                                                              
  149. Output     << comp_orgprinciples:cmake /home/kmanivannan/hmi/knowrob_ws/logs/comp_orgprinciples/build.cmake.000.log                                                                                                                  
  150. Not searching for unused variables given on the command line.
  151. Re-run cmake no build system arguments
  152. -- The C compiler identification is GNU 5.4.0
  153. -- The CXX compiler identification is GNU 5.4.0
  154. -- Check for working C compiler: /usr/bin/cc
  155. -- Check for working C compiler: /usr/bin/cc -- works
  156. -- Detecting C compiler ABI info
  157. -- Detecting C compiler ABI info - done
  158. -- Detecting C compile features
  159. -- Detecting C compile features - done
  160. -- Check for working CXX compiler: /usr/bin/c++
  161. -- Check for working CXX compiler: /usr/bin/c++ -- works
  162. -- Detecting CXX compiler ABI info
  163. -- Detecting CXX compiler ABI info - done
  164. -- Detecting CXX compile features
  165. -- Detecting CXX compile features - done
  166. -- Using CATKIN_DEVEL_PREFIX: /home/kmanivannan/hmi/knowrob_ws/devel/.private/comp_orgprinciples
  167. -- Using CMAKE_PREFIX_PATH: /home/kmanivannan/hmi/knowrob_ws/devel;/home/kmanivannan/aquanaut_ws/install;/opt/ros/kinetic
  168. -- This workspace overlays: /home/kmanivannan/hmi/knowrob_ws/devel;/home/kmanivannan/aquanaut_ws/install;/opt/ros/kinetic
  169. -- Found PythonInterp: /usr/bin/python (found version "2.7.12")
  170. -- Using PYTHON_EXECUTABLE: /usr/bin/python
  171. -- Using Debian Python package layout
  172. -- Using empy: /usr/bin/empy
  173. -- Using CATKIN_ENABLE_TESTING: ON
  174. -- Call enable_testing()
  175. -- Using CATKIN_TEST_RESULTS_DIR: /home/kmanivannan/hmi/knowrob_ws/build/comp_orgprinciples/test_results
  176. -- Found gmock sources under '/usr/src/gmock': gmock will be built
  177. -- Looking for pthread.h
  178. -- Looking for pthread.h - found
  179. -- Looking for pthread_create
  180. -- Looking for pthread_create - not found
  181. -- Looking for pthread_create in pthreads
  182. -- Looking for pthread_create in pthreads - not found
  183. -- Looking for pthread_create in pthread
  184. -- Looking for pthread_create in pthread - found
  185. -- Found Threads: TRUE
  186. -- Found gtest sources under '/usr/src/gmock': gtests will be built
  187. -- Using Python nosetests: /usr/bin/nosetests-2.7
  188. -- catkin 0.7.14
  189. -- Configuring done
  190. -- Generating done
  191. -- Build files have been written to: /home/kmanivannan/hmi/knowrob_ws/build/comp_orgprinciples
  192. cd /home/kmanivannan/hmi/knowrob_ws/build/comp_orgprinciples; catkin build --get-env comp_orgprinciples | catkin env -si  /usr/bin/cmake /home/kmanivannan/hmi/knowrob_ws/src/knowrob/comp_orgprinciples --no-warn-unused-cli -DCATKIN_DEVEL_PREFIX=/home/kmanivannan/hmi/knowrob_ws/devel/.private/comp_orgprinciples -DCMAKE_INSTALL_PREFIX=/home/kmanivannan/hmi/knowrob_ws/install; cd -
  193. Finished   << comp_orgprinciples:cmake                                                                                                                                                                                                
  194. Starting   >> comp_orgprinciples:make                                                                                                                                                                                                
  195. Subprocess  > comp_orgprinciples:make `cd /home/kmanivannan/hmi/knowrob_ws/build/comp_orgprinciples; catkin build --get-env comp_orgprinciples | catkin env -si  /usr/bin/make --jobserver-fds=6,7 -j; cd -`                          
  196. Output     << comp_orgprinciples:make /home/kmanivannan/hmi/knowrob_ws/logs/comp_orgprinciples/build.make.000.log                                                                                                                    
  197. /usr/bin/cmake -H/home/kmanivannan/hmi/knowrob_ws/src/knowrob/comp_orgprinciples -B/home/kmanivannan/hmi/knowrob_ws/build/comp_orgprinciples --check-build-system CMakeFiles/Makefile.cmake 0
  198. /usr/bin/cmake -E cmake_progress_start /home/kmanivannan/hmi/knowrob_ws/build/comp_orgprinciples/CMakeFiles /home/kmanivannan/hmi/knowrob_ws/build/comp_orgprinciples/CMakeFiles/progress.marks
  199. /usr/bin/make -f CMakeFiles/Makefile2 all
  200. make[1]: Entering directory '/home/kmanivannan/hmi/knowrob_ws/build/comp_orgprinciples'
  201. make[1]: Nothing to be done for 'all'.
  202. make[1]: Leaving directory '/home/kmanivannan/hmi/knowrob_ws/build/comp_orgprinciples'
  203. /usr/bin/cmake -E cmake_progress_start /home/kmanivannan/hmi/knowrob_ws/build/comp_orgprinciples/CMakeFiles 0
  204. cd /home/kmanivannan/hmi/knowrob_ws/build/comp_orgprinciples; catkin build --get-env comp_orgprinciples | catkin env -si  /usr/bin/make --jobserver-fds=6,7 -j; cd -
  205. Finished   << comp_orgprinciples:make                                                                                                                                                                                                
  206. Starting   >> comp_orgprinciples:symlink                                                                                                                                                                                              
  207. Output     << comp_orgprinciples:symlink /home/kmanivannan/hmi/knowrob_ws/logs/comp_orgprinciples/build.symlink.000.log                                                                                                              
  208. Symlinking /home/kmanivannan/hmi/knowrob_ws/devel/lib/pkgconfig/comp_orgprinciples.pc
  209. Symlinking /home/kmanivannan/hmi/knowrob_ws/devel/share/comp_orgprinciples/cmake/comp_orgprinciplesConfig-version.cmake
  210. Symlinking /home/kmanivannan/hmi/knowrob_ws/devel/share/comp_orgprinciples/cmake/comp_orgprinciplesConfig.cmake
  211. Finished   << comp_orgprinciples:symlink                                                                                                                                                                                              
  212. Finished  <<< comp_orgprinciples                         [ 2.3 seconds ]                                                                                                                                                              
  213. Output     << knowrob_objects:cmake /home/kmanivannan/hmi/knowrob_ws/logs/knowrob_objects/build.cmake.000.log                                                                                                                        
  214. Not searching for unused variables given on the command line.
  215. Re-run cmake no build system arguments
  216. -- The C compiler identification is GNU 5.4.0
  217. -- The CXX compiler identification is GNU 5.4.0
  218. -- Check for working C compiler: /usr/bin/cc
  219. -- Check for working C compiler: /usr/bin/cc -- works
  220. -- Detecting C compiler ABI info
  221. -- Detecting C compiler ABI info - done
  222. -- Detecting C compile features
  223. -- Detecting C compile features - done
  224. -- Check for working CXX compiler: /usr/bin/c++
  225. -- Check for working CXX compiler: /usr/bin/c++ -- works
  226. -- Detecting CXX compiler ABI info
  227. -- Detecting CXX compiler ABI info - done
  228. -- Detecting CXX compile features
  229. -- Detecting CXX compile features - done
  230. -- Using CATKIN_DEVEL_PREFIX: /home/kmanivannan/hmi/knowrob_ws/devel/.private/knowrob_objects
  231. -- Using CMAKE_PREFIX_PATH: /home/kmanivannan/hmi/knowrob_ws/devel;/home/kmanivannan/aquanaut_ws/install;/opt/ros/kinetic
  232. -- This workspace overlays: /home/kmanivannan/hmi/knowrob_ws/devel;/home/kmanivannan/aquanaut_ws/install;/opt/ros/kinetic
  233. -- Found PythonInterp: /usr/bin/python (found version "2.7.12")
  234. -- Using PYTHON_EXECUTABLE: /usr/bin/python
  235. -- Using Debian Python package layout
  236. -- Using empy: /usr/bin/empy
  237. -- Using CATKIN_ENABLE_TESTING: ON
  238. -- Call enable_testing()
  239. -- Using CATKIN_TEST_RESULTS_DIR: /home/kmanivannan/hmi/knowrob_ws/build/knowrob_objects/test_results
  240. -- Found gmock sources under '/usr/src/gmock': gmock will be built
  241. -- Looking for pthread.h
  242. -- Looking for pthread.h - found
  243. -- Looking for pthread_create
  244. -- Looking for pthread_create - not found
  245. -- Looking for pthread_create in pthreads
  246. -- Looking for pthread_create in pthreads - not found
  247. -- Looking for pthread_create in pthread
  248. -- Looking for pthread_create in pthread - found
  249. -- Found Threads: TRUE
  250. -- Found gtest sources under '/usr/src/gmock': gtests will be built
  251. -- Using Python nosetests: /usr/bin/nosetests-2.7
  252. -- catkin 0.7.14
  253. -- Using these message generators: gencpp;geneus;genjava;genlisp;gennodejs;genpy
  254. -- knowrob_objects: 1 messages, 2 services
  255. -- Found PkgConfig: /usr/bin/pkg-config (found version "0.29.1")
  256. -- Checking for module 'swipl'
  257. --   Found swipl, version 7.2.3
  258. -- SWIPL found.
  259. -- Configuring done
  260. -- Generating done
  261. -- Build files have been written to: /home/kmanivannan/hmi/knowrob_ws/build/knowrob_objects
  262. cd /home/kmanivannan/hmi/knowrob_ws/build/knowrob_objects; catkin build --get-env knowrob_objects | catkin env -si  /usr/bin/cmake /home/kmanivannan/hmi/knowrob_ws/src/knowrob/knowrob_objects --no-warn-unused-cli -DCATKIN_DEVEL_PREFIX=/home/kmanivannan/hmi/knowrob_ws/devel/.private/knowrob_objects -DCMAKE_INSTALL_PREFIX=/home/kmanivannan/hmi/knowrob_ws/install; cd -
  263. Finished   << knowrob_objects:cmake                                                                                                                                                                                                  
  264. Starting   >> knowrob_objects:make                                                                                                                                                                                                    
  265. Subprocess  > knowrob_objects:make `cd /home/kmanivannan/hmi/knowrob_ws/build/knowrob_objects; catkin build --get-env knowrob_objects | catkin env -si  /usr/bin/make --jobserver-fds=6,7 -j; cd -`                                  
  266. Output     << json_prolog:cmake /home/kmanivannan/hmi/knowrob_ws/logs/json_prolog/build.cmake.000.log                                                                                                                                
  267. Not searching for unused variables given on the command line.
  268. Re-run cmake no build system arguments
  269. -- The C compiler identification is GNU 5.4.0
  270. -- The CXX compiler identification is GNU 5.4.0
  271. -- Check for working C compiler: /usr/bin/cc
  272. -- Check for working C compiler: /usr/bin/cc -- works
  273. -- Detecting C compiler ABI info
  274. -- Detecting C compiler ABI info - done
  275. -- Detecting C compile features
  276. -- Detecting C compile features - done
  277. -- Check for working CXX compiler: /usr/bin/c++
  278. -- Check for working CXX compiler: /usr/bin/c++ -- works
  279. -- Detecting CXX compiler ABI info
  280. -- Detecting CXX compiler ABI info - done
  281. -- Detecting CXX compile features
  282. -- Detecting CXX compile features - done
  283. -- Using CATKIN_DEVEL_PREFIX: /home/kmanivannan/hmi/knowrob_ws/devel/.private/json_prolog
  284. -- Using CMAKE_PREFIX_PATH: /home/kmanivannan/hmi/knowrob_ws/devel;/home/kmanivannan/aquanaut_ws/install;/opt/ros/kinetic
  285. -- This workspace overlays: /home/kmanivannan/hmi/knowrob_ws/devel;/home/kmanivannan/aquanaut_ws/install;/opt/ros/kinetic
  286. -- Found PythonInterp: /usr/bin/python (found version "2.7.12")
  287. -- Using PYTHON_EXECUTABLE: /usr/bin/python
  288. -- Using Debian Python package layout
  289. -- Using empy: /usr/bin/empy
  290. -- Using CATKIN_ENABLE_TESTING: ON
  291. -- Call enable_testing()
  292. -- Using CATKIN_TEST_RESULTS_DIR: /home/kmanivannan/hmi/knowrob_ws/build/json_prolog/test_results
  293. -- Found gmock sources under '/usr/src/gmock': gmock will be built
  294. -- Looking for pthread.h
  295. -- Looking for pthread.h - found
  296. -- Looking for pthread_create
  297. -- Looking for pthread_create - not found
  298. -- Looking for pthread_create in pthreads
  299. -- Looking for pthread_create in pthreads - not found
  300. -- Looking for pthread_create in pthread
  301. -- Looking for pthread_create in pthread - found
  302. -- Found Threads: TRUE
  303. -- Found gtest sources under '/usr/src/gmock': gtests will be built
  304. -- Using Python nosetests: /usr/bin/nosetests-2.7
  305. -- catkin 0.7.14
  306. -- Found PkgConfig: /usr/bin/pkg-config (found version "0.29.1")
  307. -- Checking for module 'swipl'
  308. --   Found swipl, version 7.2.3
  309. -- Checking for module 'json-glib-1.0'
  310. --   Found json-glib-1.0, version 1.1.2
  311. -- Configuring done
  312. -- Generating done
  313. -- Build files have been written to: /home/kmanivannan/hmi/knowrob_ws/build/json_prolog
  314. cd /home/kmanivannan/hmi/knowrob_ws/build/json_prolog; catkin build --get-env json_prolog | catkin env -si  /usr/bin/cmake /home/kmanivannan/hmi/knowrob_ws/src/knowrob/json_prolog --no-warn-unused-cli -DCATKIN_DEVEL_PREFIX=/home/kmanivannan/hmi/knowrob_ws/devel/.private/json_prolog -DCMAKE_INSTALL_PREFIX=/home/kmanivannan/hmi/knowrob_ws/install; cd -
  315. Finished   << json_prolog:cmake                                                                                                                                                                                                      
  316. Starting   >> json_prolog:make                                                                                                                                                                                                        
  317. Subprocess  > json_prolog:make `cd /home/kmanivannan/hmi/knowrob_ws/build/json_prolog; catkin build --get-env json_prolog | catkin env -si  /usr/bin/make --jobserver-fds=6,7 -j; cd -`                                              
  318. Output     << knowrob_objects:make /home/kmanivannan/hmi/knowrob_ws/logs/knowrob_objects/build.make.000.log                                                                                                                          
  319. /usr/bin/cmake -H/home/kmanivannan/hmi/knowrob_ws/src/knowrob/knowrob_objects -B/home/kmanivannan/hmi/knowrob_ws/build/knowrob_objects --check-build-system CMakeFiles/Makefile.cmake 0
  320. /usr/bin/cmake -E cmake_progress_start /home/kmanivannan/hmi/knowrob_ws/build/knowrob_objects/CMakeFiles /home/kmanivannan/hmi/knowrob_ws/build/knowrob_objects/CMakeFiles/progress.marks
  321. /usr/bin/make -f CMakeFiles/Makefile2 all
  322. make[1]: Entering directory '/home/kmanivannan/hmi/knowrob_ws/build/knowrob_objects'
  323. /usr/bin/make -f CMakeFiles/_knowrob_objects_generate_messages_check_deps_UpdateObjectState.dir/build.make CMakeFiles/_knowrob_objects_generate_messages_check_deps_UpdateObjectState.dir/depend
  324. /usr/bin/make -f CMakeFiles/_knowrob_objects_generate_messages_check_deps_DirtyObject.dir/build.make CMakeFiles/_knowrob_objects_generate_messages_check_deps_DirtyObject.dir/depend
  325. /usr/bin/make -f CMakeFiles/geometry_msgs_generate_messages_py.dir/build.make CMakeFiles/geometry_msgs_generate_messages_py.dir/depend
  326. /usr/bin/make -f CMakeFiles/_knowrob_objects_generate_messages_check_deps_ObjectState.dir/build.make CMakeFiles/_knowrob_objects_generate_messages_check_deps_ObjectState.dir/depend
  327. /usr/bin/make -f CMakeFiles/geometry_msgs_generate_messages_cpp.dir/build.make CMakeFiles/geometry_msgs_generate_messages_cpp.dir/depend
  328. /usr/bin/make -f CMakeFiles/geometry_msgs_generate_messages_nodejs.dir/build.make CMakeFiles/geometry_msgs_generate_messages_nodejs.dir/depend
  329. /usr/bin/make -f CMakeFiles/geometry_msgs_generate_messages_eus.dir/build.make CMakeFiles/geometry_msgs_generate_messages_eus.dir/depend
  330. make[2]: Entering directory '/home/kmanivannan/hmi/knowrob_ws/build/knowrob_objects'
  331. make[2]: Entering directory '/home/kmanivannan/hmi/knowrob_ws/build/knowrob_objects'
  332. cd /home/kmanivannan/hmi/knowrob_ws/build/knowrob_objects && /usr/bin/cmake -E cmake_depends "Unix Makefiles" /home/kmanivannan/hmi/knowrob_ws/src/knowrob/knowrob_objects /home/kmanivannan/hmi/knowrob_ws/src/knowrob/knowrob_objects /home/kmanivannan/hmi/knowrob_ws/build/knowrob_objects /home/kmanivannan/hmi/knowrob_ws/build/knowrob_objects /home/kmanivannan/hmi/knowrob_ws/build/knowrob_objects/CMakeFiles/geometry_msgs_generate_messages_py.dir/DependInfo.cmake --color=
  333. cd /home/kmanivannan/hmi/knowrob_ws/build/knowrob_objects && /usr/bin/cmake -E cmake_depends "Unix Makefiles" /home/kmanivannan/hmi/knowrob_ws/src/knowrob/knowrob_objects /home/kmanivannan/hmi/knowrob_ws/src/knowrob/knowrob_objects /home/kmanivannan/hmi/knowrob_ws/build/knowrob_objects /home/kmanivannan/hmi/knowrob_ws/build/knowrob_objects /home/kmanivannan/hmi/knowrob_ws/build/knowrob_objects/CMakeFiles/_knowrob_objects_generate_messages_check_deps_UpdateObjectState.dir/DependInfo.cmake --color=
  334. make[2]: Entering directory '/home/kmanivannan/hmi/knowrob_ws/build/knowrob_objects'
  335. make[2]: Entering directory '/home/kmanivannan/hmi/knowrob_ws/build/knowrob_objects'
  336. cd /home/kmanivannan/hmi/knowrob_ws/build/knowrob_objects && /usr/bin/cmake -E cmake_depends "Unix Makefiles" /home/kmanivannan/hmi/knowrob_ws/src/knowrob/knowrob_objects /home/kmanivannan/hmi/knowrob_ws/src/knowrob/knowrob_objects /home/kmanivannan/hmi/knowrob_ws/build/knowrob_objects /home/kmanivannan/hmi/knowrob_ws/build/knowrob_objects /home/kmanivannan/hmi/knowrob_ws/build/knowrob_objects/CMakeFiles/_knowrob_objects_generate_messages_check_deps_DirtyObject.dir/DependInfo.cmake --color=
  337. cd /home/kmanivannan/hmi/knowrob_ws/build/knowrob_objects && /usr/bin/cmake -E cmake_depends "Unix Makefiles" /home/kmanivannan/hmi/knowrob_ws/src/knowrob/knowrob_objects /home/kmanivannan/hmi/knowrob_ws/src/knowrob/knowrob_objects /home/kmanivannan/hmi/knowrob_ws/build/knowrob_objects /home/kmanivannan/hmi/knowrob_ws/build/knowrob_objects /home/kmanivannan/hmi/knowrob_ws/build/knowrob_objects/CMakeFiles/_knowrob_objects_generate_messages_check_deps_ObjectState.dir/DependInfo.cmake --color=
  338. make[2]: Entering directory '/home/kmanivannan/hmi/knowrob_ws/build/knowrob_objects'
  339. cd /home/kmanivannan/hmi/knowrob_ws/build/knowrob_objects && /usr/bin/cmake -E cmake_depends "Unix Makefiles" /home/kmanivannan/hmi/knowrob_ws/src/knowrob/knowrob_objects /home/kmanivannan/hmi/knowrob_ws/src/knowrob/knowrob_objects /home/kmanivannan/hmi/knowrob_ws/build/knowrob_objects /home/kmanivannan/hmi/knowrob_ws/build/knowrob_objects /home/kmanivannan/hmi/knowrob_ws/build/knowrob_objects/CMakeFiles/geometry_msgs_generate_messages_cpp.dir/DependInfo.cmake --color=
  340. make[2]: Entering directory '/home/kmanivannan/hmi/knowrob_ws/build/knowrob_objects'
  341. cd /home/kmanivannan/hmi/knowrob_ws/build/knowrob_objects && /usr/bin/cmake -E cmake_depends "Unix Makefiles" /home/kmanivannan/hmi/knowrob_ws/src/knowrob/knowrob_objects /home/kmanivannan/hmi/knowrob_ws/src/knowrob/knowrob_objects /home/kmanivannan/hmi/knowrob_ws/build/knowrob_objects /home/kmanivannan/hmi/knowrob_ws/build/knowrob_objects /home/kmanivannan/hmi/knowrob_ws/build/knowrob_objects/CMakeFiles/geometry_msgs_generate_messages_eus.dir/DependInfo.cmake --color=
  342. make[2]: Entering directory '/home/kmanivannan/hmi/knowrob_ws/build/knowrob_objects'
  343. cd /home/kmanivannan/hmi/knowrob_ws/build/knowrob_objects && /usr/bin/cmake -E cmake_depends "Unix Makefiles" /home/kmanivannan/hmi/knowrob_ws/src/knowrob/knowrob_objects /home/kmanivannan/hmi/knowrob_ws/src/knowrob/knowrob_objects /home/kmanivannan/hmi/knowrob_ws/build/knowrob_objects /home/kmanivannan/hmi/knowrob_ws/build/knowrob_objects /home/kmanivannan/hmi/knowrob_ws/build/knowrob_objects/CMakeFiles/geometry_msgs_generate_messages_nodejs.dir/DependInfo.cmake --color=
  344. Dependee "/home/kmanivannan/hmi/knowrob_ws/build/knowrob_objects/CMakeFiles/geometry_msgs_generate_messages_py.dir/DependInfo.cmake" is newer than depender "/home/kmanivannan/hmi/knowrob_ws/build/knowrob_objects/CMakeFiles/geometry_msgs_generate_messages_py.dir/depend.internal".
  345. Dependee "/home/kmanivannan/hmi/knowrob_ws/build/knowrob_objects/CMakeFiles/CMakeDirectoryInformation.cmake" is newer than depender "/home/kmanivannan/hmi/knowrob_ws/build/knowrob_objects/CMakeFiles/geometry_msgs_generate_messages_py.dir/depend.internal".
  346. Scanning dependencies of target geometry_msgs_generate_messages_py
  347. Dependee "/home/kmanivannan/hmi/knowrob_ws/build/knowrob_objects/CMakeFiles/_knowrob_objects_generate_messages_check_deps_UpdateObjectState.dir/DependInfo.cmake" is newer than depender "/home/kmanivannan/hmi/knowrob_ws/build/knowrob_objects/CMakeFiles/_knowrob_objects_generate_messages_check_deps_UpdateObjectState.dir/depend.internal".
  348. Dependee "/home/kmanivannan/hmi/knowrob_ws/build/knowrob_objects/CMakeFiles/CMakeDirectoryInformation.cmake" is newer than depender "/home/kmanivannan/hmi/knowrob_ws/build/knowrob_objects/CMakeFiles/_knowrob_objects_generate_messages_check_deps_UpdateObjectState.dir/depend.internal".
  349. Scanning dependencies of target _knowrob_objects_generate_messages_check_deps_UpdateObjectState
  350. Dependee "/home/kmanivannan/hmi/knowrob_ws/build/knowrob_objects/CMakeFiles/_knowrob_objects_generate_messages_check_deps_DirtyObject.dir/DependInfo.cmake" is newer than depender "/home/kmanivannan/hmi/knowrob_ws/build/knowrob_objects/CMakeFiles/_knowrob_objects_generate_messages_check_deps_DirtyObject.dir/depend.internal".
  351. Dependee "/home/kmanivannan/hmi/knowrob_ws/build/knowrob_objects/CMakeFiles/CMakeDirectoryInformation.cmake" is newer than depender "/home/kmanivannan/hmi/knowrob_ws/build/knowrob_objects/CMakeFiles/_knowrob_objects_generate_messages_check_deps_DirtyObject.dir/depend.internal".
  352. Scanning dependencies of target _knowrob_objects_generate_messages_check_deps_DirtyObject
  353. Dependee "/home/kmanivannan/hmi/knowrob_ws/build/knowrob_objects/CMakeFiles/geometry_msgs_generate_messages_eus.dir/DependInfo.cmake" is newer than depender "/home/kmanivannan/hmi/knowrob_ws/build/knowrob_objects/CMakeFiles/geometry_msgs_generate_messages_eus.dir/depend.internal".
  354. Dependee "/home/kmanivannan/hmi/knowrob_ws/build/knowrob_objects/CMakeFiles/CMakeDirectoryInformation.cmake" is newer than depender "/home/kmanivannan/hmi/knowrob_ws/build/knowrob_objects/CMakeFiles/geometry_msgs_generate_messages_eus.dir/depend.internal".
  355. Scanning dependencies of target geometry_msgs_generate_messages_eus
  356. make[2]: Leaving directory '/home/kmanivannan/hmi/knowrob_ws/build/knowrob_objects'
  357. make[2]: Leaving directory '/home/kmanivannan/hmi/knowrob_ws/build/knowrob_objects'
  358. /usr/bin/make -f CMakeFiles/_knowrob_objects_generate_messages_check_deps_UpdateObjectState.dir/build.make CMakeFiles/_knowrob_objects_generate_messages_check_deps_UpdateObjectState.dir/build
  359. /usr/bin/make -f CMakeFiles/geometry_msgs_generate_messages_py.dir/build.make CMakeFiles/geometry_msgs_generate_messages_py.dir/build
  360. make[2]: Leaving directory '/home/kmanivannan/hmi/knowrob_ws/build/knowrob_objects'
  361. Dependee "/home/kmanivannan/hmi/knowrob_ws/build/knowrob_objects/CMakeFiles/_knowrob_objects_generate_messages_check_deps_ObjectState.dir/DependInfo.cmake" is newer than depender "/home/kmanivannan/hmi/knowrob_ws/build/knowrob_objects/CMakeFiles/_knowrob_objects_generate_messages_check_deps_ObjectState.dir/depend.internal".
  362. Dependee "/home/kmanivannan/hmi/knowrob_ws/build/knowrob_objects/CMakeFiles/CMakeDirectoryInformation.cmake" is newer than depender "/home/kmanivannan/hmi/knowrob_ws/build/knowrob_objects/CMakeFiles/_knowrob_objects_generate_messages_check_deps_ObjectState.dir/depend.internal".
  363. Scanning dependencies of target _knowrob_objects_generate_messages_check_deps_ObjectState
  364. /usr/bin/make -f CMakeFiles/_knowrob_objects_generate_messages_check_deps_DirtyObject.dir/build.make CMakeFiles/_knowrob_objects_generate_messages_check_deps_DirtyObject.dir/build
  365. Dependee "/home/kmanivannan/hmi/knowrob_ws/build/knowrob_objects/CMakeFiles/geometry_msgs_generate_messages_nodejs.dir/DependInfo.cmake" is newer than depender "/home/kmanivannan/hmi/knowrob_ws/build/knowrob_objects/CMakeFiles/geometry_msgs_generate_messages_nodejs.dir/depend.internal".
  366. Dependee "/home/kmanivannan/hmi/knowrob_ws/build/knowrob_objects/CMakeFiles/CMakeDirectoryInformation.cmake" is newer than depender "/home/kmanivannan/hmi/knowrob_ws/build/knowrob_objects/CMakeFiles/geometry_msgs_generate_messages_nodejs.dir/depend.internal".
  367. make[2]: Leaving directory '/home/kmanivannan/hmi/knowrob_ws/build/knowrob_objects'
  368. /usr/bin/make -f CMakeFiles/geometry_msgs_generate_messages_eus.dir/build.make CMakeFiles/geometry_msgs_generate_messages_eus.dir/build
  369. make[2]: Leaving directory '/home/kmanivannan/hmi/knowrob_ws/build/knowrob_objects'
  370. /usr/bin/make -f CMakeFiles/_knowrob_objects_generate_messages_check_deps_ObjectState.dir/build.make CMakeFiles/_knowrob_objects_generate_messages_check_deps_ObjectState.dir/build
  371. make[2]: Entering directory '/home/kmanivannan/hmi/knowrob_ws/build/knowrob_objects'
  372. catkin_generated/env_cached.sh /usr/bin/python /opt/ros/kinetic/share/genmsg/cmake/../../../lib/genmsg/genmsg_check_deps.py knowrob_objects /home/kmanivannan/hmi/knowrob_ws/src/knowrob/knowrob_objects/srv/UpdateObjectState.srv geometry_msgs/Transform:std_msgs/ColorRGBA:geometry_msgs/PoseStamped:geometry_msgs/TransformStamped:std_msgs/Header:knowrob_objects/ObjectState:geometry_msgs/Quaternion:geometry_msgs/Vector3:geometry_msgs/Point:geometry_msgs/Pose
  373. make[2]: Entering directory '/home/kmanivannan/hmi/knowrob_ws/build/knowrob_objects'
  374. catkin_generated/env_cached.sh /usr/bin/python /opt/ros/kinetic/share/genmsg/cmake/../../../lib/genmsg/genmsg_check_deps.py knowrob_objects /home/kmanivannan/hmi/knowrob_ws/src/knowrob/knowrob_objects/srv/DirtyObject.srv
  375. make[2]: Entering directory '/home/kmanivannan/hmi/knowrob_ws/build/knowrob_objects'
  376. make[2]: Nothing to be done for 'CMakeFiles/geometry_msgs_generate_messages_eus.dir/build'.
  377. make[2]: Leaving directory '/home/kmanivannan/hmi/knowrob_ws/build/knowrob_objects'
  378. Scanning dependencies of target geometry_msgs_generate_messages_nodejs
  379. make[2]: Entering directory '/home/kmanivannan/hmi/knowrob_ws/build/knowrob_objects'
  380. make[2]: Nothing to be done for 'CMakeFiles/geometry_msgs_generate_messages_py.dir/build'.
  381. make[2]: Leaving directory '/home/kmanivannan/hmi/knowrob_ws/build/knowrob_objects'
  382. make[2]: Entering directory '/home/kmanivannan/hmi/knowrob_ws/build/knowrob_objects'
  383. catkin_generated/env_cached.sh /usr/bin/python /opt/ros/kinetic/share/genmsg/cmake/../../../lib/genmsg/genmsg_check_deps.py knowrob_objects /home/kmanivannan/hmi/knowrob_ws/src/knowrob/knowrob_objects/msg/ObjectState.msg geometry_msgs/Transform:std_msgs/ColorRGBA:geometry_msgs/PoseStamped:geometry_msgs/TransformStamped:std_msgs/Header:geometry_msgs/Quaternion:geometry_msgs/Point:geometry_msgs/Vector3:geometry_msgs/Pose
  384. make[2]: Leaving directory '/home/kmanivannan/hmi/knowrob_ws/build/knowrob_objects'
  385. /usr/bin/make -f CMakeFiles/geometry_msgs_generate_messages_nodejs.dir/build.make CMakeFiles/geometry_msgs_generate_messages_nodejs.dir/build
  386. make[2]: Entering directory '/home/kmanivannan/hmi/knowrob_ws/build/knowrob_objects'
  387. make[2]: Nothing to be done for 'CMakeFiles/geometry_msgs_generate_messages_nodejs.dir/build'.
  388. make[2]: Leaving directory '/home/kmanivannan/hmi/knowrob_ws/build/knowrob_objects'
  389. Dependee "/home/kmanivannan/hmi/knowrob_ws/build/knowrob_objects/CMakeFiles/geometry_msgs_generate_messages_cpp.dir/DependInfo.cmake" is newer than depender "/home/kmanivannan/hmi/knowrob_ws/build/knowrob_objects/CMakeFiles/geometry_msgs_generate_messages_cpp.dir/depend.internal".
  390. Dependee "/home/kmanivannan/hmi/knowrob_ws/build/knowrob_objects/CMakeFiles/CMakeDirectoryInformation.cmake" is newer than depender "/home/kmanivannan/hmi/knowrob_ws/build/knowrob_objects/CMakeFiles/geometry_msgs_generate_messages_cpp.dir/depend.internal".
  391. Scanning dependencies of target geometry_msgs_generate_messages_cpp
  392. make[2]: Leaving directory '/home/kmanivannan/hmi/knowrob_ws/build/knowrob_objects'
  393. /usr/bin/make -f CMakeFiles/geometry_msgs_generate_messages_cpp.dir/build.make CMakeFiles/geometry_msgs_generate_messages_cpp.dir/build
  394. make[2]: Entering directory '/home/kmanivannan/hmi/knowrob_ws/build/knowrob_objects'
  395. make[2]: Nothing to be done for 'CMakeFiles/geometry_msgs_generate_messages_cpp.dir/build'.
  396. make[2]: Leaving directory '/home/kmanivannan/hmi/knowrob_ws/build/knowrob_objects'
  397. [  0%] Built target geometry_msgs_generate_messages_eus
  398. /usr/bin/make -f CMakeFiles/knowrob_objects_generate_messages_java_gradle.dir/build.make CMakeFiles/knowrob_objects_generate_messages_java_gradle.dir/depend
  399. [  0%] Built target geometry_msgs_generate_messages_nodejs
  400. [  0%] Built target geometry_msgs_generate_messages_py
  401. /usr/bin/make -f CMakeFiles/geometry_msgs_generate_messages_lisp.dir/build.make CMakeFiles/geometry_msgs_generate_messages_lisp.dir/depend
  402. /usr/bin/make -f CMakeFiles/roscpp_generate_messages_py.dir/build.make CMakeFiles/roscpp_generate_messages_py.dir/depend
  403. make[2]: Entering directory '/home/kmanivannan/hmi/knowrob_ws/build/knowrob_objects'
  404. cd /home/kmanivannan/hmi/knowrob_ws/build/knowrob_objects && /usr/bin/cmake -E cmake_depends "Unix Makefiles" /home/kmanivannan/hmi/knowrob_ws/src/knowrob/knowrob_objects /home/kmanivannan/hmi/knowrob_ws/src/knowrob/knowrob_objects /home/kmanivannan/hmi/knowrob_ws/build/knowrob_objects /home/kmanivannan/hmi/knowrob_ws/build/knowrob_objects /home/kmanivannan/hmi/knowrob_ws/build/knowrob_objects/CMakeFiles/knowrob_objects_generate_messages_java_gradle.dir/DependInfo.cmake --color=
  405. make[2]: Entering directory '/home/kmanivannan/hmi/knowrob_ws/build/knowrob_objects'
  406. cd /home/kmanivannan/hmi/knowrob_ws/build/knowrob_objects && /usr/bin/cmake -E cmake_depends "Unix Makefiles" /home/kmanivannan/hmi/knowrob_ws/src/knowrob/knowrob_objects /home/kmanivannan/hmi/knowrob_ws/src/knowrob/knowrob_objects /home/kmanivannan/hmi/knowrob_ws/build/knowrob_objects /home/kmanivannan/hmi/knowrob_ws/build/knowrob_objects /home/kmanivannan/hmi/knowrob_ws/build/knowrob_objects/CMakeFiles/roscpp_generate_messages_py.dir/DependInfo.cmake --color=
  407. make[2]: Entering directory '/home/kmanivannan/hmi/knowrob_ws/build/knowrob_objects'
  408. cd /home/kmanivannan/hmi/knowrob_ws/build/knowrob_objects && /usr/bin/cmake -E cmake_depends "Unix Makefiles" /home/kmanivannan/hmi/knowrob_ws/src/knowrob/knowrob_objects /home/kmanivannan/hmi/knowrob_ws/src/knowrob/knowrob_objects /home/kmanivannan/hmi/knowrob_ws/build/knowrob_objects /home/kmanivannan/hmi/knowrob_ws/build/knowrob_objects /home/kmanivannan/hmi/knowrob_ws/build/knowrob_objects/CMakeFiles/geometry_msgs_generate_messages_lisp.dir/DependInfo.cmake --color=
  409. [  0%] Built target geometry_msgs_generate_messages_cpp
  410. /usr/bin/make -f CMakeFiles/roscpp_generate_messages_nodejs.dir/build.make CMakeFiles/roscpp_generate_messages_nodejs.dir/depend
  411. Dependee "/home/kmanivannan/hmi/knowrob_ws/build/knowrob_objects/CMakeFiles/roscpp_generate_messages_py.dir/DependInfo.cmake" is newer than depender "/home/kmanivannan/hmi/knowrob_ws/build/knowrob_objects/CMakeFiles/roscpp_generate_messages_py.dir/depend.internal".
  412. Dependee "/home/kmanivannan/hmi/knowrob_ws/build/knowrob_objects/CMakeFiles/CMakeDirectoryInformation.cmake" is newer than depender "/home/kmanivannan/hmi/knowrob_ws/build/knowrob_objects/CMakeFiles/roscpp_generate_messages_py.dir/depend.internal".
  413. Scanning dependencies of target roscpp_generate_messages_py
  414. Dependee "/home/kmanivannan/hmi/knowrob_ws/build/knowrob_objects/CMakeFiles/knowrob_objects_generate_messages_java_gradle.dir/DependInfo.cmake" is newer than depender "/home/kmanivannan/hmi/knowrob_ws/build/knowrob_objects/CMakeFiles/knowrob_objects_generate_messages_java_gradle.dir/depend.internal".
  415. Dependee "/home/kmanivannan/hmi/knowrob_ws/build/knowrob_objects/CMakeFiles/CMakeDirectoryInformation.cmake" is newer than depender "/home/kmanivannan/hmi/knowrob_ws/build/knowrob_objects/CMakeFiles/knowrob_objects_generate_messages_java_gradle.dir/depend.internal".
  416. Scanning dependencies of target knowrob_objects_generate_messages_java_gradle
  417. make[2]: Leaving directory '/home/kmanivannan/hmi/knowrob_ws/build/knowrob_objects'
  418. /usr/bin/make -f CMakeFiles/roscpp_generate_messages_py.dir/build.make CMakeFiles/roscpp_generate_messages_py.dir/build
  419. make[2]: Leaving directory '/home/kmanivannan/hmi/knowrob_ws/build/knowrob_objects'
  420. /usr/bin/make -f CMakeFiles/knowrob_objects_generate_messages_java_gradle.dir/build.make CMakeFiles/knowrob_objects_generate_messages_java_gradle.dir/build
  421. make[2]: Entering directory '/home/kmanivannan/hmi/knowrob_ws/build/knowrob_objects'
  422. make[2]: Nothing to be done for 'CMakeFiles/roscpp_generate_messages_py.dir/build'.
  423. make[2]: Leaving directory '/home/kmanivannan/hmi/knowrob_ws/build/knowrob_objects'
  424. make[2]: Entering directory '/home/kmanivannan/hmi/knowrob_ws/build/knowrob_objects'
  425. make[2]: Entering directory '/home/kmanivannan/hmi/knowrob_ws/build/knowrob_objects'
  426. cd /home/kmanivannan/hmi/knowrob_ws/build/knowrob_objects && /usr/bin/cmake -E cmake_depends "Unix Makefiles" /home/kmanivannan/hmi/knowrob_ws/src/knowrob/knowrob_objects /home/kmanivannan/hmi/knowrob_ws/src/knowrob/knowrob_objects /home/kmanivannan/hmi/knowrob_ws/build/knowrob_objects /home/kmanivannan/hmi/knowrob_ws/build/knowrob_objects /home/kmanivannan/hmi/knowrob_ws/build/knowrob_objects/CMakeFiles/roscpp_generate_messages_nodejs.dir/DependInfo.cmake --color=
  427. make[2]: Leaving directory '/home/kmanivannan/hmi/knowrob_ws/build/knowrob_objects'
  428. make[2]: Leaving directory '/home/kmanivannan/hmi/knowrob_ws/build/knowrob_objects'
  429. Dependee "/home/kmanivannan/hmi/knowrob_ws/build/knowrob_objects/CMakeFiles/geometry_msgs_generate_messages_lisp.dir/DependInfo.cmake" is newer than depender "/home/kmanivannan/hmi/knowrob_ws/build/knowrob_objects/CMakeFiles/geometry_msgs_generate_messages_lisp.dir/depend.internal".
  430. Dependee "/home/kmanivannan/hmi/knowrob_ws/build/knowrob_objects/CMakeFiles/CMakeDirectoryInformation.cmake" is newer than depender "/home/kmanivannan/hmi/knowrob_ws/build/knowrob_objects/CMakeFiles/geometry_msgs_generate_messages_lisp.dir/depend.internal".
  431. Scanning dependencies of target geometry_msgs_generate_messages_lisp
  432. make[2]: Leaving directory '/home/kmanivannan/hmi/knowrob_ws/build/knowrob_objects'
  433. /usr/bin/make -f CMakeFiles/geometry_msgs_generate_messages_lisp.dir/build.make CMakeFiles/geometry_msgs_generate_messages_lisp.dir/build
  434. [  4%] Generating Java gradle project from knowrob_objects
  435. [  4%] Built target _knowrob_objects_generate_messages_check_deps_UpdateObjectState
  436. Dependee "/home/kmanivannan/hmi/knowrob_ws/build/knowrob_objects/CMakeFiles/roscpp_generate_messages_nodejs.dir/DependInfo.cmake" is newer than depender "/home/kmanivannan/hmi/knowrob_ws/build/knowrob_objects/CMakeFiles/roscpp_generate_messages_nodejs.dir/depend.internal".
  437. Dependee "/home/kmanivannan/hmi/knowrob_ws/build/knowrob_objects/CMakeFiles/CMakeDirectoryInformation.cmake" is newer than depender "/home/kmanivannan/hmi/knowrob_ws/build/knowrob_objects/CMakeFiles/roscpp_generate_messages_nodejs.dir/depend.internal".
  438. Scanning dependencies of target roscpp_generate_messages_nodejs
  439. catkin_generated/env_cached.sh /usr/bin/python /opt/ros/kinetic/share/genjava/cmake/../../../lib/genjava/genjava_gradle_project.py -o /home/kmanivannan/hmi/knowrob_ws/build/knowrob_objects/java -p knowrob_objects
  440. /usr/bin/make -f CMakeFiles/rosgraph_msgs_generate_messages_lisp.dir/build.make CMakeFiles/rosgraph_msgs_generate_messages_lisp.dir/depend
  441. make[2]: Leaving directory '/home/kmanivannan/hmi/knowrob_ws/build/knowrob_objects'
  442. /usr/bin/make -f CMakeFiles/roscpp_generate_messages_nodejs.dir/build.make CMakeFiles/roscpp_generate_messages_nodejs.dir/build
  443. [  4%] Built target roscpp_generate_messages_py
  444. make[2]: Entering directory '/home/kmanivannan/hmi/knowrob_ws/build/knowrob_objects'
  445. make[2]: Nothing to be done for 'CMakeFiles/roscpp_generate_messages_nodejs.dir/build'.
  446. make[2]: Leaving directory '/home/kmanivannan/hmi/knowrob_ws/build/knowrob_objects'
  447. /usr/bin/make -f CMakeFiles/rosgraph_msgs_generate_messages_py.dir/build.make CMakeFiles/rosgraph_msgs_generate_messages_py.dir/depend
  448. make[2]: Entering directory '/home/kmanivannan/hmi/knowrob_ws/build/knowrob_objects'
  449. cd /home/kmanivannan/hmi/knowrob_ws/build/knowrob_objects && /usr/bin/cmake -E cmake_depends "Unix Makefiles" /home/kmanivannan/hmi/knowrob_ws/src/knowrob/knowrob_objects /home/kmanivannan/hmi/knowrob_ws/src/knowrob/knowrob_objects /home/kmanivannan/hmi/knowrob_ws/build/knowrob_objects /home/kmanivannan/hmi/knowrob_ws/build/knowrob_objects /home/kmanivannan/hmi/knowrob_ws/build/knowrob_objects/CMakeFiles/rosgraph_msgs_generate_messages_lisp.dir/DependInfo.cmake --color=
  450. make[2]: Entering directory '/home/kmanivannan/hmi/knowrob_ws/build/knowrob_objects'
  451. make[2]: Nothing to be done for 'CMakeFiles/geometry_msgs_generate_messages_lisp.dir/build'.
  452. make[2]: Leaving directory '/home/kmanivannan/hmi/knowrob_ws/build/knowrob_objects'
  453. make[2]: Leaving directory '/home/kmanivannan/hmi/knowrob_ws/build/knowrob_objects'
  454. make[2]: Entering directory '/home/kmanivannan/hmi/knowrob_ws/build/knowrob_objects'
  455. cd /home/kmanivannan/hmi/knowrob_ws/build/knowrob_objects && /usr/bin/cmake -E cmake_depends "Unix Makefiles" /home/kmanivannan/hmi/knowrob_ws/src/knowrob/knowrob_objects /home/kmanivannan/hmi/knowrob_ws/src/knowrob/knowrob_objects /home/kmanivannan/hmi/knowrob_ws/build/knowrob_objects /home/kmanivannan/hmi/knowrob_ws/build/knowrob_objects /home/kmanivannan/hmi/knowrob_ws/build/knowrob_objects/CMakeFiles/rosgraph_msgs_generate_messages_py.dir/DependInfo.cmake --color=
  456. [  4%] Built target _knowrob_objects_generate_messages_check_deps_ObjectState
  457. /usr/bin/make -f CMakeFiles/roscpp_generate_messages_eus.dir/build.make CMakeFiles/roscpp_generate_messages_eus.dir/depend
  458. Dependee "/home/kmanivannan/hmi/knowrob_ws/build/knowrob_objects/CMakeFiles/rosgraph_msgs_generate_messages_lisp.dir/DependInfo.cmake" is newer than depender "/home/kmanivannan/hmi/knowrob_ws/build/knowrob_objects/CMakeFiles/rosgraph_msgs_generate_messages_lisp.dir/depend.internal".
  459. Dependee "/home/kmanivannan/hmi/knowrob_ws/build/knowrob_objects/CMakeFiles/CMakeDirectoryInformation.cmake" is newer than depender "/home/kmanivannan/hmi/knowrob_ws/build/knowrob_objects/CMakeFiles/rosgraph_msgs_generate_messages_lisp.dir/depend.internal".
  460. Scanning dependencies of target rosgraph_msgs_generate_messages_lisp
  461. make[2]: Leaving directory '/home/kmanivannan/hmi/knowrob_ws/build/knowrob_objects'
  462. /usr/bin/make -f CMakeFiles/rosgraph_msgs_generate_messages_lisp.dir/build.make CMakeFiles/rosgraph_msgs_generate_messages_lisp.dir/build
  463. make[2]: Entering directory '/home/kmanivannan/hmi/knowrob_ws/build/knowrob_objects'
  464. make[2]: Nothing to be done for 'CMakeFiles/rosgraph_msgs_generate_messages_lisp.dir/build'.
  465. make[2]: Leaving directory '/home/kmanivannan/hmi/knowrob_ws/build/knowrob_objects'
  466. [  4%] Built target roscpp_generate_messages_nodejs
  467. [  4%] Built target _knowrob_objects_generate_messages_check_deps_DirtyObject
  468. /usr/bin/make -f CMakeFiles/std_msgs_generate_messages_eus.dir/build.make CMakeFiles/std_msgs_generate_messages_eus.dir/depend
  469. /usr/bin/make -f CMakeFiles/roscpp_generate_messages_lisp.dir/build.make CMakeFiles/roscpp_generate_messages_lisp.dir/depend
  470. make[2]: Entering directory '/home/kmanivannan/hmi/knowrob_ws/build/knowrob_objects'
  471. cd /home/kmanivannan/hmi/knowrob_ws/build/knowrob_objects && /usr/bin/cmake -E cmake_depends "Unix Makefiles" /home/kmanivannan/hmi/knowrob_ws/src/knowrob/knowrob_objects /home/kmanivannan/hmi/knowrob_ws/src/knowrob/knowrob_objects /home/kmanivannan/hmi/knowrob_ws/build/knowrob_objects /home/kmanivannan/hmi/knowrob_ws/build/knowrob_objects /home/kmanivannan/hmi/knowrob_ws/build/knowrob_objects/CMakeFiles/roscpp_generate_messages_eus.dir/DependInfo.cmake --color=
  472. [  4%] Built target geometry_msgs_generate_messages_lisp
  473. /usr/bin/make -f CMakeFiles/rosgraph_msgs_generate_messages_cpp.dir/build.make CMakeFiles/rosgraph_msgs_generate_messages_cpp.dir/depend
  474. make[2]: Entering directory '/home/kmanivannan/hmi/knowrob_ws/build/knowrob_objects'
  475. cd /home/kmanivannan/hmi/knowrob_ws/build/knowrob_objects && /usr/bin/cmake -E cmake_depends "Unix Makefiles" /home/kmanivannan/hmi/knowrob_ws/src/knowrob/knowrob_objects /home/kmanivannan/hmi/knowrob_ws/src/knowrob/knowrob_objects /home/kmanivannan/hmi/knowrob_ws/build/knowrob_objects /home/kmanivannan/hmi/knowrob_ws/build/knowrob_objects /home/kmanivannan/hmi/knowrob_ws/build/knowrob_objects/CMakeFiles/roscpp_generate_messages_lisp.dir/DependInfo.cmake --color=
  476. make[2]: Entering directory '/home/kmanivannan/hmi/knowrob_ws/build/knowrob_objects'
  477. cd /home/kmanivannan/hmi/knowrob_ws/build/knowrob_objects && /usr/bin/cmake -E cmake_depends "Unix Makefiles" /home/kmanivannan/hmi/knowrob_ws/src/knowrob/knowrob_objects /home/kmanivannan/hmi/knowrob_ws/src/knowrob/knowrob_objects /home/kmanivannan/hmi/knowrob_ws/build/knowrob_objects /home/kmanivannan/hmi/knowrob_ws/build/knowrob_objects /home/kmanivannan/hmi/knowrob_ws/build/knowrob_objects/CMakeFiles/std_msgs_generate_messages_eus.dir/DependInfo.cmake --color=
  478. Dependee "/home/kmanivannan/hmi/knowrob_ws/build/knowrob_objects/CMakeFiles/rosgraph_msgs_generate_messages_py.dir/DependInfo.cmake" is newer than depender "/home/kmanivannan/hmi/knowrob_ws/build/knowrob_objects/CMakeFiles/rosgraph_msgs_generate_messages_py.dir/depend.internal".
  479. Dependee "/home/kmanivannan/hmi/knowrob_ws/build/knowrob_objects/CMakeFiles/CMakeDirectoryInformation.cmake" is newer than depender "/home/kmanivannan/hmi/knowrob_ws/build/knowrob_objects/CMakeFiles/rosgraph_msgs_generate_messages_py.dir/depend.internal".
  480. Scanning dependencies of target rosgraph_msgs_generate_messages_py
  481. make[2]: Entering directory '/home/kmanivannan/hmi/knowrob_ws/build/knowrob_objects'
  482. cd /home/kmanivannan/hmi/knowrob_ws/build/knowrob_objects && /usr/bin/cmake -E cmake_depends "Unix Makefiles" /home/kmanivannan/hmi/knowrob_ws/src/knowrob/knowrob_objects /home/kmanivannan/hmi/knowrob_ws/src/knowrob/knowrob_objects /home/kmanivannan/hmi/knowrob_ws/build/knowrob_objects /home/kmanivannan/hmi/knowrob_ws/build/knowrob_objects /home/kmanivannan/hmi/knowrob_ws/build/knowrob_objects/CMakeFiles/rosgraph_msgs_generate_messages_cpp.dir/DependInfo.cmake --color=
  483. make[2]: Leaving directory '/home/kmanivannan/hmi/knowrob_ws/build/knowrob_objects'
  484. /usr/bin/make -f CMakeFiles/rosgraph_msgs_generate_messages_py.dir/build.make CMakeFiles/rosgraph_msgs_generate_messages_py.dir/build
  485. [  4%] Built target rosgraph_msgs_generate_messages_lisp
  486. /usr/bin/make -f CMakeFiles/std_msgs_generate_messages_cpp.dir/build.make CMakeFiles/std_msgs_generate_messages_cpp.dir/depend
  487. make[2]: Entering directory '/home/kmanivannan/hmi/knowrob_ws/build/knowrob_objects'
  488. make[2]: Nothing to be done for 'CMakeFiles/rosgraph_msgs_generate_messages_py.dir/build'.
  489. make[2]: Leaving directory '/home/kmanivannan/hmi/knowrob_ws/build/knowrob_objects'
  490. Dependee "/home/kmanivannan/hmi/knowrob_ws/build/knowrob_objects/CMakeFiles/roscpp_generate_messages_eus.dir/DependInfo.cmake" is newer than depender "/home/kmanivannan/hmi/knowrob_ws/build/knowrob_objects/CMakeFiles/roscpp_generate_messages_eus.dir/depend.internal".
  491. Dependee "/home/kmanivannan/hmi/knowrob_ws/build/knowrob_objects/CMakeFiles/CMakeDirectoryInformation.cmake" is newer than depender "/home/kmanivannan/hmi/knowrob_ws/build/knowrob_objects/CMakeFiles/roscpp_generate_messages_eus.dir/depend.internal".
  492. Scanning dependencies of target roscpp_generate_messages_eus
  493. make[2]: Leaving directory '/home/kmanivannan/hmi/knowrob_ws/build/knowrob_objects'
  494. /usr/bin/make -f CMakeFiles/roscpp_generate_messages_eus.dir/build.make CMakeFiles/roscpp_generate_messages_eus.dir/build
  495. Dependee "/home/kmanivannan/hmi/knowrob_ws/build/knowrob_objects/CMakeFiles/roscpp_generate_messages_lisp.dir/DependInfo.cmake" is newer than depender "/home/kmanivannan/hmi/knowrob_ws/build/knowrob_objects/CMakeFiles/roscpp_generate_messages_lisp.dir/depend.internal".
  496. Dependee "/home/kmanivannan/hmi/knowrob_ws/build/knowrob_objects/CMakeFiles/CMakeDirectoryInformation.cmake" is newer than depender "/home/kmanivannan/hmi/knowrob_ws/build/knowrob_objects/CMakeFiles/roscpp_generate_messages_lisp.dir/depend.internal".
  497. Scanning dependencies of target roscpp_generate_messages_lisp
  498. make[2]: Leaving directory '/home/kmanivannan/hmi/knowrob_ws/build/knowrob_objects'
  499. /usr/bin/make -f CMakeFiles/roscpp_generate_messages_lisp.dir/build.make CMakeFiles/roscpp_generate_messages_lisp.dir/build
  500. make[2]: Entering directory '/home/kmanivannan/hmi/knowrob_ws/build/knowrob_objects'
  501. make[2]: Nothing to be done for 'CMakeFiles/roscpp_generate_messages_eus.dir/build'.
  502. make[2]: Leaving directory '/home/kmanivannan/hmi/knowrob_ws/build/knowrob_objects'
  503. Dependee "/home/kmanivannan/hmi/knowrob_ws/build/knowrob_objects/CMakeFiles/std_msgs_generate_messages_eus.dir/DependInfo.cmake" is newer than depender "/home/kmanivannan/hmi/knowrob_ws/build/knowrob_objects/CMakeFiles/std_msgs_generate_messages_eus.dir/depend.internal".
  504. Dependee "/home/kmanivannan/hmi/knowrob_ws/build/knowrob_objects/CMakeFiles/CMakeDirectoryInformation.cmake" is newer than depender "/home/kmanivannan/hmi/knowrob_ws/build/knowrob_objects/CMakeFiles/std_msgs_generate_messages_eus.dir/depend.internal".
  505. Scanning dependencies of target std_msgs_generate_messages_eus
  506. make[2]: Leaving directory '/home/kmanivannan/hmi/knowrob_ws/build/knowrob_objects'
  507. /usr/bin/make -f CMakeFiles/std_msgs_generate_messages_eus.dir/build.make CMakeFiles/std_msgs_generate_messages_eus.dir/build
  508. make[2]: Entering directory '/home/kmanivannan/hmi/knowrob_ws/build/knowrob_objects'
  509. cd /home/kmanivannan/hmi/knowrob_ws/build/knowrob_objects && /usr/bin/cmake -E cmake_depends "Unix Makefiles" /home/kmanivannan/hmi/knowrob_ws/src/knowrob/knowrob_objects /home/kmanivannan/hmi/knowrob_ws/src/knowrob/knowrob_objects /home/kmanivannan/hmi/knowrob_ws/build/knowrob_objects /home/kmanivannan/hmi/knowrob_ws/build/knowrob_objects /home/kmanivannan/hmi/knowrob_ws/build/knowrob_objects/CMakeFiles/std_msgs_generate_messages_cpp.dir/DependInfo.cmake --color=
  510. make[2]: Entering directory '/home/kmanivannan/hmi/knowrob_ws/build/knowrob_objects'
  511. make[2]: Nothing to be done for 'CMakeFiles/std_msgs_generate_messages_eus.dir/build'.
  512. make[2]: Leaving directory '/home/kmanivannan/hmi/knowrob_ws/build/knowrob_objects'
  513. Dependee "/home/kmanivannan/hmi/knowrob_ws/build/knowrob_objects/CMakeFiles/rosgraph_msgs_generate_messages_cpp.dir/DependInfo.cmake" is newer than depender "/home/kmanivannan/hmi/knowrob_ws/build/knowrob_objects/CMakeFiles/rosgraph_msgs_generate_messages_cpp.dir/depend.internal".
  514. Dependee "/home/kmanivannan/hmi/knowrob_ws/build/knowrob_objects/CMakeFiles/CMakeDirectoryInformation.cmake" is newer than depender "/home/kmanivannan/hmi/knowrob_ws/build/knowrob_objects/CMakeFiles/rosgraph_msgs_generate_messages_cpp.dir/depend.internal".
  515. Scanning dependencies of target rosgraph_msgs_generate_messages_cpp
  516. make[2]: Leaving directory '/home/kmanivannan/hmi/knowrob_ws/build/knowrob_objects'
  517. make[2]: Entering directory '/home/kmanivannan/hmi/knowrob_ws/build/knowrob_objects'
  518. /usr/bin/make -f CMakeFiles/rosgraph_msgs_generate_messages_cpp.dir/build.make CMakeFiles/rosgraph_msgs_generate_messages_cpp.dir/build
  519. make[2]: Nothing to be done for 'CMakeFiles/roscpp_generate_messages_lisp.dir/build'.
  520. make[2]: Leaving directory '/home/kmanivannan/hmi/knowrob_ws/build/knowrob_objects'
  521. [  4%] Built target rosgraph_msgs_generate_messages_py
  522. /usr/bin/make -f CMakeFiles/std_msgs_generate_messages_lisp.dir/build.make CMakeFiles/std_msgs_generate_messages_lisp.dir/depend
  523. make[2]: Entering directory '/home/kmanivannan/hmi/knowrob_ws/build/knowrob_objects'
  524. make[2]: Nothing to be done for 'CMakeFiles/rosgraph_msgs_generate_messages_cpp.dir/build'.
  525. make[2]: Leaving directory '/home/kmanivannan/hmi/knowrob_ws/build/knowrob_objects'
  526. make[2]: Entering directory '/home/kmanivannan/hmi/knowrob_ws/build/knowrob_objects'
  527. cd /home/kmanivannan/hmi/knowrob_ws/build/knowrob_objects && /usr/bin/cmake -E cmake_depends "Unix Makefiles" /home/kmanivannan/hmi/knowrob_ws/src/knowrob/knowrob_objects /home/kmanivannan/hmi/knowrob_ws/src/knowrob/knowrob_objects /home/kmanivannan/hmi/knowrob_ws/build/knowrob_objects /home/kmanivannan/hmi/knowrob_ws/build/knowrob_objects /home/kmanivannan/hmi/knowrob_ws/build/knowrob_objects/CMakeFiles/std_msgs_generate_messages_lisp.dir/DependInfo.cmake --color=
  528. [  4%] Built target roscpp_generate_messages_eus
  529. /usr/bin/make -f CMakeFiles/std_msgs_generate_messages_py.dir/build.make CMakeFiles/std_msgs_generate_messages_py.dir/depend
  530. make[2]: Entering directory '/home/kmanivannan/hmi/knowrob_ws/build/knowrob_objects'
  531. cd /home/kmanivannan/hmi/knowrob_ws/build/knowrob_objects && /usr/bin/cmake -E cmake_depends "Unix Makefiles" /home/kmanivannan/hmi/knowrob_ws/src/knowrob/knowrob_objects /home/kmanivannan/hmi/knowrob_ws/src/knowrob/knowrob_objects /home/kmanivannan/hmi/knowrob_ws/build/knowrob_objects /home/kmanivannan/hmi/knowrob_ws/build/knowrob_objects /home/kmanivannan/hmi/knowrob_ws/build/knowrob_objects/CMakeFiles/std_msgs_generate_messages_py.dir/DependInfo.cmake --color=
  532. Dependee "/home/kmanivannan/hmi/knowrob_ws/build/knowrob_objects/CMakeFiles/std_msgs_generate_messages_cpp.dir/DependInfo.cmake" is newer than depender "/home/kmanivannan/hmi/knowrob_ws/build/knowrob_objects/CMakeFiles/std_msgs_generate_messages_cpp.dir/depend.internal".
  533. Dependee "/home/kmanivannan/hmi/knowrob_ws/build/knowrob_objects/CMakeFiles/CMakeDirectoryInformation.cmake" is newer than depender "/home/kmanivannan/hmi/knowrob_ws/build/knowrob_objects/CMakeFiles/std_msgs_generate_messages_cpp.dir/depend.internal".
  534. Scanning dependencies of target std_msgs_generate_messages_cpp
  535. [  4%] Built target std_msgs_generate_messages_eus
  536. make[2]: Leaving directory '/home/kmanivannan/hmi/knowrob_ws/build/knowrob_objects'
  537. /usr/bin/make -f CMakeFiles/std_msgs_generate_messages_cpp.dir/build.make CMakeFiles/std_msgs_generate_messages_cpp.dir/build
  538. /usr/bin/make -f CMakeFiles/roscpp_generate_messages_cpp.dir/build.make CMakeFiles/roscpp_generate_messages_cpp.dir/depend
  539. make[2]: Entering directory '/home/kmanivannan/hmi/knowrob_ws/build/knowrob_objects'
  540. make[2]: Nothing to be done for 'CMakeFiles/std_msgs_generate_messages_cpp.dir/build'.
  541. make[2]: Leaving directory '/home/kmanivannan/hmi/knowrob_ws/build/knowrob_objects'
  542. make[2]: Entering directory '/home/kmanivannan/hmi/knowrob_ws/build/knowrob_objects'
  543. cd /home/kmanivannan/hmi/knowrob_ws/build/knowrob_objects && /usr/bin/cmake -E cmake_depends "Unix Makefiles" /home/kmanivannan/hmi/knowrob_ws/src/knowrob/knowrob_objects /home/kmanivannan/hmi/knowrob_ws/src/knowrob/knowrob_objects /home/kmanivannan/hmi/knowrob_ws/build/knowrob_objects /home/kmanivannan/hmi/knowrob_ws/build/knowrob_objects /home/kmanivannan/hmi/knowrob_ws/build/knowrob_objects/CMakeFiles/roscpp_generate_messages_cpp.dir/DependInfo.cmake --color=
  544. [  4%] Built target rosgraph_msgs_generate_messages_cpp
  545. /usr/bin/make -f CMakeFiles/std_msgs_generate_messages_nodejs.dir/build.make CMakeFiles/std_msgs_generate_messages_nodejs.dir/depend
  546. [  4%] Built target roscpp_generate_messages_lisp
  547. Dependee "/home/kmanivannan/hmi/knowrob_ws/build/knowrob_objects/CMakeFiles/std_msgs_generate_messages_lisp.dir/DependInfo.cmake" is newer than depender "/home/kmanivannan/hmi/knowrob_ws/build/knowrob_objects/CMakeFiles/std_msgs_generate_messages_lisp.dir/depend.internal".
  548. Dependee "/home/kmanivannan/hmi/knowrob_ws/build/knowrob_objects/CMakeFiles/CMakeDirectoryInformation.cmake" is newer than depender "/home/kmanivannan/hmi/knowrob_ws/build/knowrob_objects/CMakeFiles/std_msgs_generate_messages_lisp.dir/depend.internal".
  549. Scanning dependencies of target std_msgs_generate_messages_lisp
  550. /usr/bin/make -f CMakeFiles/rosgraph_msgs_generate_messages_nodejs.dir/build.make CMakeFiles/rosgraph_msgs_generate_messages_nodejs.dir/depend
  551. make[2]: Leaving directory '/home/kmanivannan/hmi/knowrob_ws/build/knowrob_objects'
  552. /usr/bin/make -f CMakeFiles/std_msgs_generate_messages_lisp.dir/build.make CMakeFiles/std_msgs_generate_messages_lisp.dir/build
  553. make[2]: Entering directory '/home/kmanivannan/hmi/knowrob_ws/build/knowrob_objects'
  554. cd /home/kmanivannan/hmi/knowrob_ws/build/knowrob_objects && /usr/bin/cmake -E cmake_depends "Unix Makefiles" /home/kmanivannan/hmi/knowrob_ws/src/knowrob/knowrob_objects /home/kmanivannan/hmi/knowrob_ws/src/knowrob/knowrob_objects /home/kmanivannan/hmi/knowrob_ws/build/knowrob_objects /home/kmanivannan/hmi/knowrob_ws/build/knowrob_objects /home/kmanivannan/hmi/knowrob_ws/build/knowrob_objects/CMakeFiles/std_msgs_generate_messages_nodejs.dir/DependInfo.cmake --color=
  555. make[2]: Entering directory '/home/kmanivannan/hmi/knowrob_ws/build/knowrob_objects'
  556. Dependee "/home/kmanivannan/hmi/knowrob_ws/build/knowrob_objects/CMakeFiles/std_msgs_generate_messages_py.dir/DependInfo.cmake" is newer than depender "/home/kmanivannan/hmi/knowrob_ws/build/knowrob_objects/CMakeFiles/std_msgs_generate_messages_py.dir/depend.internal".
  557. Dependee "/home/kmanivannan/hmi/knowrob_ws/build/knowrob_objects/CMakeFiles/CMakeDirectoryInformation.cmake" is newer than depender "/home/kmanivannan/hmi/knowrob_ws/build/knowrob_objects/CMakeFiles/std_msgs_generate_messages_py.dir/depend.internal".
  558. Scanning dependencies of target std_msgs_generate_messages_py
  559. make[2]: Nothing to be done for 'CMakeFiles/std_msgs_generate_messages_lisp.dir/build'.
  560. make[2]: Leaving directory '/home/kmanivannan/hmi/knowrob_ws/build/knowrob_objects'
  561. make[2]: Entering directory '/home/kmanivannan/hmi/knowrob_ws/build/knowrob_objects'
  562. cd /home/kmanivannan/hmi/knowrob_ws/build/knowrob_objects && /usr/bin/cmake -E cmake_depends "Unix Makefiles" /home/kmanivannan/hmi/knowrob_ws/src/knowrob/knowrob_objects /home/kmanivannan/hmi/knowrob_ws/src/knowrob/knowrob_objects /home/kmanivannan/hmi/knowrob_ws/build/knowrob_objects /home/kmanivannan/hmi/knowrob_ws/build/knowrob_objects /home/kmanivannan/hmi/knowrob_ws/build/knowrob_objects/CMakeFiles/rosgraph_msgs_generate_messages_nodejs.dir/DependInfo.cmake --color=
  563. make[2]: Leaving directory '/home/kmanivannan/hmi/knowrob_ws/build/knowrob_objects'
  564. /usr/bin/make -f CMakeFiles/std_msgs_generate_messages_py.dir/build.make CMakeFiles/std_msgs_generate_messages_py.dir/build
  565. make[2]: Entering directory '/home/kmanivannan/hmi/knowrob_ws/build/knowrob_objects'
  566. make[2]: Nothing to be done for 'CMakeFiles/std_msgs_generate_messages_py.dir/build'.
  567. make[2]: Leaving directory '/home/kmanivannan/hmi/knowrob_ws/build/knowrob_objects'
  568. Dependee "/home/kmanivannan/hmi/knowrob_ws/build/knowrob_objects/CMakeFiles/roscpp_generate_messages_cpp.dir/DependInfo.cmake" is newer than depender "/home/kmanivannan/hmi/knowrob_ws/build/knowrob_objects/CMakeFiles/roscpp_generate_messages_cpp.dir/depend.internal".
  569. Dependee "/home/kmanivannan/hmi/knowrob_ws/build/knowrob_objects/CMakeFiles/CMakeDirectoryInformation.cmake" is newer than depender "/home/kmanivannan/hmi/knowrob_ws/build/knowrob_objects/CMakeFiles/roscpp_generate_messages_cpp.dir/depend.internal".
  570. Scanning dependencies of target roscpp_generate_messages_cpp
  571. [  4%] Built target std_msgs_generate_messages_cpp
  572. make[2]: Leaving directory '/home/kmanivannan/hmi/knowrob_ws/build/knowrob_objects'
  573. /usr/bin/make -f CMakeFiles/roscpp_generate_messages_cpp.dir/build.make CMakeFiles/roscpp_generate_messages_cpp.dir/build
  574. /usr/bin/make -f CMakeFiles/rosgraph_msgs_generate_messages_eus.dir/build.make CMakeFiles/rosgraph_msgs_generate_messages_eus.dir/depend
  575. make[2]: Entering directory '/home/kmanivannan/hmi/knowrob_ws/build/knowrob_objects'
  576. make[2]: Nothing to be done for 'CMakeFiles/roscpp_generate_messages_cpp.dir/build'.
  577. make[2]: Leaving directory '/home/kmanivannan/hmi/knowrob_ws/build/knowrob_objects'
  578. make[2]: Entering directory '/home/kmanivannan/hmi/knowrob_ws/build/knowrob_objects'
  579. cd /home/kmanivannan/hmi/knowrob_ws/build/knowrob_objects && /usr/bin/cmake -E cmake_depends "Unix Makefiles" /home/kmanivannan/hmi/knowrob_ws/src/knowrob/knowrob_objects /home/kmanivannan/hmi/knowrob_ws/src/knowrob/knowrob_objects /home/kmanivannan/hmi/knowrob_ws/build/knowrob_objects /home/kmanivannan/hmi/knowrob_ws/build/knowrob_objects /home/kmanivannan/hmi/knowrob_ws/build/knowrob_objects/CMakeFiles/rosgraph_msgs_generate_messages_eus.dir/DependInfo.cmake --color=
  580. [  4%] Built target std_msgs_generate_messages_lisp
  581. Dependee "/home/kmanivannan/hmi/knowrob_ws/build/knowrob_objects/CMakeFiles/std_msgs_generate_messages_nodejs.dir/DependInfo.cmake" is newer than depender "/home/kmanivannan/hmi/knowrob_ws/build/knowrob_objects/CMakeFiles/std_msgs_generate_messages_nodejs.dir/depend.internal".
  582. Dependee "/home/kmanivannan/hmi/knowrob_ws/build/knowrob_objects/CMakeFiles/CMakeDirectoryInformation.cmake" is newer than depender "/home/kmanivannan/hmi/knowrob_ws/build/knowrob_objects/CMakeFiles/std_msgs_generate_messages_nodejs.dir/depend.internal".
  583. Scanning dependencies of target std_msgs_generate_messages_nodejs
  584. /usr/bin/make -f CMakeFiles/knowrob_objects_generate_messages_py.dir/build.make CMakeFiles/knowrob_objects_generate_messages_py.dir/depend
  585. make[2]: Leaving directory '/home/kmanivannan/hmi/knowrob_ws/build/knowrob_objects'
  586. /usr/bin/make -f CMakeFiles/std_msgs_generate_messages_nodejs.dir/build.make CMakeFiles/std_msgs_generate_messages_nodejs.dir/build
  587. make[2]: Entering directory '/home/kmanivannan/hmi/knowrob_ws/build/knowrob_objects'
  588. make[2]: Nothing to be done for 'CMakeFiles/std_msgs_generate_messages_nodejs.dir/build'.
  589. make[2]: Leaving directory '/home/kmanivannan/hmi/knowrob_ws/build/knowrob_objects'
  590. Dependee "/home/kmanivannan/hmi/knowrob_ws/build/knowrob_objects/CMakeFiles/rosgraph_msgs_generate_messages_nodejs.dir/DependInfo.cmake" is newer than depender "/home/kmanivannan/hmi/knowrob_ws/build/knowrob_objects/CMakeFiles/rosgraph_msgs_generate_messages_nodejs.dir/depend.internal".
  591. Dependee "/home/kmanivannan/hmi/knowrob_ws/build/knowrob_objects/CMakeFiles/CMakeDirectoryInformation.cmake" is newer than depender "/home/kmanivannan/hmi/knowrob_ws/build/knowrob_objects/CMakeFiles/rosgraph_msgs_generate_messages_nodejs.dir/depend.internal".
  592. Scanning dependencies of target rosgraph_msgs_generate_messages_nodejs
  593. make[2]: Leaving directory '/home/kmanivannan/hmi/knowrob_ws/build/knowrob_objects'
  594. make[2]: Entering directory '/home/kmanivannan/hmi/knowrob_ws/build/knowrob_objects'
  595. cd /home/kmanivannan/hmi/knowrob_ws/build/knowrob_objects && /usr/bin/cmake -E cmake_depends "Unix Makefiles" /home/kmanivannan/hmi/knowrob_ws/src/knowrob/knowrob_objects /home/kmanivannan/hmi/knowrob_ws/src/knowrob/knowrob_objects /home/kmanivannan/hmi/knowrob_ws/build/knowrob_objects /home/kmanivannan/hmi/knowrob_ws/build/knowrob_objects /home/kmanivannan/hmi/knowrob_ws/build/knowrob_objects/CMakeFiles/knowrob_objects_generate_messages_py.dir/DependInfo.cmake --color=
  596. /usr/bin/make -f CMakeFiles/rosgraph_msgs_generate_messages_nodejs.dir/build.make CMakeFiles/rosgraph_msgs_generate_messages_nodejs.dir/build
  597. make[2]: Entering directory '/home/kmanivannan/hmi/knowrob_ws/build/knowrob_objects'
  598. make[2]: Nothing to be done for 'CMakeFiles/rosgraph_msgs_generate_messages_nodejs.dir/build'.
  599. make[2]: Leaving directory '/home/kmanivannan/hmi/knowrob_ws/build/knowrob_objects'
  600. Dependee "/home/kmanivannan/hmi/knowrob_ws/build/knowrob_objects/CMakeFiles/rosgraph_msgs_generate_messages_eus.dir/DependInfo.cmake" is newer than depender "/home/kmanivannan/hmi/knowrob_ws/build/knowrob_objects/CMakeFiles/rosgraph_msgs_generate_messages_eus.dir/depend.internal".
  601. Dependee "/home/kmanivannan/hmi/knowrob_ws/build/knowrob_objects/CMakeFiles/CMakeDirectoryInformation.cmake" is newer than depender "/home/kmanivannan/hmi/knowrob_ws/build/knowrob_objects/CMakeFiles/rosgraph_msgs_generate_messages_eus.dir/depend.internal".
  602. Scanning dependencies of target rosgraph_msgs_generate_messages_eus
  603. make[2]: Leaving directory '/home/kmanivannan/hmi/knowrob_ws/build/knowrob_objects'
  604. /usr/bin/make -f CMakeFiles/rosgraph_msgs_generate_messages_eus.dir/build.make CMakeFiles/rosgraph_msgs_generate_messages_eus.dir/build
  605. [  4%] Built target std_msgs_generate_messages_py
  606. make[2]: Entering directory '/home/kmanivannan/hmi/knowrob_ws/build/knowrob_objects'
  607. make[2]: Nothing to be done for 'CMakeFiles/rosgraph_msgs_generate_messages_eus.dir/build'.
  608. make[2]: Leaving directory '/home/kmanivannan/hmi/knowrob_ws/build/knowrob_objects'
  609. /usr/bin/make -f CMakeFiles/knowrob_objects_generate_messages_cpp.dir/build.make CMakeFiles/knowrob_objects_generate_messages_cpp.dir/depend
  610. [  4%] Built target roscpp_generate_messages_cpp
  611. make[2]: Entering directory '/home/kmanivannan/hmi/knowrob_ws/build/knowrob_objects'
  612. cd /home/kmanivannan/hmi/knowrob_ws/build/knowrob_objects && /usr/bin/cmake -E cmake_depends "Unix Makefiles" /home/kmanivannan/hmi/knowrob_ws/src/knowrob/knowrob_objects /home/kmanivannan/hmi/knowrob_ws/src/knowrob/knowrob_objects /home/kmanivannan/hmi/knowrob_ws/build/knowrob_objects /home/kmanivannan/hmi/knowrob_ws/build/knowrob_objects /home/kmanivannan/hmi/knowrob_ws/build/knowrob_objects/CMakeFiles/knowrob_objects_generate_messages_cpp.dir/DependInfo.cmake --color=
  613. /usr/bin/make -f CMakeFiles/knowrob_objects_generate_messages_nodejs.dir/build.make CMakeFiles/knowrob_objects_generate_messages_nodejs.dir/depend
  614. [  4%] Built target std_msgs_generate_messages_nodejs
  615. make[2]: Entering directory '/home/kmanivannan/hmi/knowrob_ws/build/knowrob_objects'
  616. cd /home/kmanivannan/hmi/knowrob_ws/build/knowrob_objects && /usr/bin/cmake -E cmake_depends "Unix Makefiles" /home/kmanivannan/hmi/knowrob_ws/src/knowrob/knowrob_objects /home/kmanivannan/hmi/knowrob_ws/src/knowrob/knowrob_objects /home/kmanivannan/hmi/knowrob_ws/build/knowrob_objects /home/kmanivannan/hmi/knowrob_ws/build/knowrob_objects /home/kmanivannan/hmi/knowrob_ws/build/knowrob_objects/CMakeFiles/knowrob_objects_generate_messages_nodejs.dir/DependInfo.cmake --color=
  617. /usr/bin/make -f CMakeFiles/knowrob_objects_generate_messages_eus.dir/build.make CMakeFiles/knowrob_objects_generate_messages_eus.dir/depend
  618. make[2]: Entering directory '/home/kmanivannan/hmi/knowrob_ws/build/knowrob_objects'
  619. cd /home/kmanivannan/hmi/knowrob_ws/build/knowrob_objects && /usr/bin/cmake -E cmake_depends "Unix Makefiles" /home/kmanivannan/hmi/knowrob_ws/src/knowrob/knowrob_objects /home/kmanivannan/hmi/knowrob_ws/src/knowrob/knowrob_objects /home/kmanivannan/hmi/knowrob_ws/build/knowrob_objects /home/kmanivannan/hmi/knowrob_ws/build/knowrob_objects /home/kmanivannan/hmi/knowrob_ws/build/knowrob_objects/CMakeFiles/knowrob_objects_generate_messages_eus.dir/DependInfo.cmake --color=
  620. Dependee "/home/kmanivannan/hmi/knowrob_ws/build/knowrob_objects/CMakeFiles/knowrob_objects_generate_messages_py.dir/DependInfo.cmake" is newer than depender "/home/kmanivannan/hmi/knowrob_ws/build/knowrob_objects/CMakeFiles/knowrob_objects_generate_messages_py.dir/depend.internal".
  621. Dependee "/home/kmanivannan/hmi/knowrob_ws/build/knowrob_objects/CMakeFiles/CMakeDirectoryInformation.cmake" is newer than depender "/home/kmanivannan/hmi/knowrob_ws/build/knowrob_objects/CMakeFiles/knowrob_objects_generate_messages_py.dir/depend.internal".
  622. Scanning dependencies of target knowrob_objects_generate_messages_py
  623. [  4%] Built target rosgraph_msgs_generate_messages_eus
  624. make[2]: Leaving directory '/home/kmanivannan/hmi/knowrob_ws/build/knowrob_objects'
  625. /usr/bin/make -f CMakeFiles/knowrob_objects_generate_messages_java.dir/build.make CMakeFiles/knowrob_objects_generate_messages_java.dir/depend
  626. /usr/bin/make -f CMakeFiles/knowrob_objects_generate_messages_py.dir/build.make CMakeFiles/knowrob_objects_generate_messages_py.dir/build
  627. make[2]: Entering directory '/home/kmanivannan/hmi/knowrob_ws/build/knowrob_objects'
  628. cd /home/kmanivannan/hmi/knowrob_ws/build/knowrob_objects && /usr/bin/cmake -E cmake_depends "Unix Makefiles" /home/kmanivannan/hmi/knowrob_ws/src/knowrob/knowrob_objects /home/kmanivannan/hmi/knowrob_ws/src/knowrob/knowrob_objects /home/kmanivannan/hmi/knowrob_ws/build/knowrob_objects /home/kmanivannan/hmi/knowrob_ws/build/knowrob_objects /home/kmanivannan/hmi/knowrob_ws/build/knowrob_objects/CMakeFiles/knowrob_objects_generate_messages_java.dir/DependInfo.cmake --color=
  629. [  4%] Built target rosgraph_msgs_generate_messages_nodejs
  630. /usr/bin/make -f CMakeFiles/knowrob_objects_generate_messages_lisp.dir/build.make CMakeFiles/knowrob_objects_generate_messages_lisp.dir/depend
  631. Dependee "/home/kmanivannan/hmi/knowrob_ws/build/knowrob_objects/CMakeFiles/knowrob_objects_generate_messages_cpp.dir/DependInfo.cmake" is newer than depender "/home/kmanivannan/hmi/knowrob_ws/build/knowrob_objects/CMakeFiles/knowrob_objects_generate_messages_cpp.dir/depend.internal".
  632. Dependee "/home/kmanivannan/hmi/knowrob_ws/build/knowrob_objects/CMakeFiles/CMakeDirectoryInformation.cmake" is newer than depender "/home/kmanivannan/hmi/knowrob_ws/build/knowrob_objects/CMakeFiles/knowrob_objects_generate_messages_cpp.dir/depend.internal".
  633. Scanning dependencies of target knowrob_objects_generate_messages_cpp
  634. make[2]: Entering directory '/home/kmanivannan/hmi/knowrob_ws/build/knowrob_objects'
  635. make[2]: Leaving directory '/home/kmanivannan/hmi/knowrob_ws/build/knowrob_objects'
  636. /usr/bin/make -f CMakeFiles/knowrob_objects_generate_messages_cpp.dir/build.make CMakeFiles/knowrob_objects_generate_messages_cpp.dir/build
  637. make[2]: Entering directory '/home/kmanivannan/hmi/knowrob_ws/build/knowrob_objects'
  638. cd /home/kmanivannan/hmi/knowrob_ws/build/knowrob_objects && /usr/bin/cmake -E cmake_depends "Unix Makefiles" /home/kmanivannan/hmi/knowrob_ws/src/knowrob/knowrob_objects /home/kmanivannan/hmi/knowrob_ws/src/knowrob/knowrob_objects /home/kmanivannan/hmi/knowrob_ws/build/knowrob_objects /home/kmanivannan/hmi/knowrob_ws/build/knowrob_objects /home/kmanivannan/hmi/knowrob_ws/build/knowrob_objects/CMakeFiles/knowrob_objects_generate_messages_lisp.dir/DependInfo.cmake --color=
  639. Dependee "/home/kmanivannan/hmi/knowrob_ws/build/knowrob_objects/CMakeFiles/knowrob_objects_generate_messages_nodejs.dir/DependInfo.cmake" is newer than depender "/home/kmanivannan/hmi/knowrob_ws/build/knowrob_objects/CMakeFiles/knowrob_objects_generate_messages_nodejs.dir/depend.internal".
  640. Dependee "/home/kmanivannan/hmi/knowrob_ws/build/knowrob_objects/CMakeFiles/CMakeDirectoryInformation.cmake" is newer than depender "/home/kmanivannan/hmi/knowrob_ws/build/knowrob_objects/CMakeFiles/knowrob_objects_generate_messages_nodejs.dir/depend.internal".
  641. Scanning dependencies of target knowrob_objects_generate_messages_nodejs
  642. make[2]: Entering directory '/home/kmanivannan/hmi/knowrob_ws/build/knowrob_objects'
  643. Dependee "/home/kmanivannan/hmi/knowrob_ws/build/knowrob_objects/CMakeFiles/knowrob_objects_generate_messages_eus.dir/DependInfo.cmake" is newer than depender "/home/kmanivannan/hmi/knowrob_ws/build/knowrob_objects/CMakeFiles/knowrob_objects_generate_messages_eus.dir/depend.internal".
  644. Dependee "/home/kmanivannan/hmi/knowrob_ws/build/knowrob_objects/CMakeFiles/CMakeDirectoryInformation.cmake" is newer than depender "/home/kmanivannan/hmi/knowrob_ws/build/knowrob_objects/CMakeFiles/knowrob_objects_generate_messages_eus.dir/depend.internal".
  645. Scanning dependencies of target knowrob_objects_generate_messages_eus
  646. make[2]: Leaving directory '/home/kmanivannan/hmi/knowrob_ws/build/knowrob_objects'
  647. /usr/bin/make -f CMakeFiles/knowrob_objects_generate_messages_eus.dir/build.make CMakeFiles/knowrob_objects_generate_messages_eus.dir/build
  648. make[2]: Leaving directory '/home/kmanivannan/hmi/knowrob_ws/build/knowrob_objects'
  649. /usr/bin/make -f CMakeFiles/knowrob_objects_generate_messages_nodejs.dir/build.make CMakeFiles/knowrob_objects_generate_messages_nodejs.dir/build
  650. make[2]: Entering directory '/home/kmanivannan/hmi/knowrob_ws/build/knowrob_objects'
  651. make[2]: Entering directory '/home/kmanivannan/hmi/knowrob_ws/build/knowrob_objects'
  652. Dependee "/home/kmanivannan/hmi/knowrob_ws/build/knowrob_objects/CMakeFiles/knowrob_objects_generate_messages_java.dir/DependInfo.cmake" is newer than depender "/home/kmanivannan/hmi/knowrob_ws/build/knowrob_objects/CMakeFiles/knowrob_objects_generate_messages_java.dir/depend.internal".
  653. Dependee "/home/kmanivannan/hmi/knowrob_ws/build/knowrob_objects/CMakeFiles/CMakeDirectoryInformation.cmake" is newer than depender "/home/kmanivannan/hmi/knowrob_ws/build/knowrob_objects/CMakeFiles/knowrob_objects_generate_messages_java.dir/depend.internal".
  654. Scanning dependencies of target knowrob_objects_generate_messages_java
  655. [  8%] Generating Python from MSG knowrob_objects/ObjectState
  656. make[2]: Leaving directory '/home/kmanivannan/hmi/knowrob_ws/build/knowrob_objects'
  657. /usr/bin/make -f CMakeFiles/knowrob_objects_generate_messages_java.dir/build.make CMakeFiles/knowrob_objects_generate_messages_java.dir/build
  658. Dependee "/home/kmanivannan/hmi/knowrob_ws/build/knowrob_objects/CMakeFiles/knowrob_objects_generate_messages_lisp.dir/DependInfo.cmake" is newer than depender "/home/kmanivannan/hmi/knowrob_ws/build/knowrob_objects/CMakeFiles/knowrob_objects_generate_messages_lisp.dir/depend.internal".
  659. Dependee "/home/kmanivannan/hmi/knowrob_ws/build/knowrob_objects/CMakeFiles/CMakeDirectoryInformation.cmake" is newer than depender "/home/kmanivannan/hmi/knowrob_ws/build/knowrob_objects/CMakeFiles/knowrob_objects_generate_messages_lisp.dir/depend.internal".
  660. Scanning dependencies of target knowrob_objects_generate_messages_lisp
  661. make[2]: Entering directory '/home/kmanivannan/hmi/knowrob_ws/build/knowrob_objects'
  662. make[2]: Leaving directory '/home/kmanivannan/hmi/knowrob_ws/build/knowrob_objects'
  663. /usr/bin/make -f CMakeFiles/knowrob_objects_generate_messages_lisp.dir/build.make CMakeFiles/knowrob_objects_generate_messages_lisp.dir/build
  664. [ 13%] Generating C++ code from knowrob_objects/ObjectState.msg
  665. catkin_generated/env_cached.sh /usr/bin/python /opt/ros/kinetic/share/genpy/cmake/../../../lib/genpy/genmsg_py.py /home/kmanivannan/hmi/knowrob_ws/src/knowrob/knowrob_objects/msg/ObjectState.msg -Iknowrob_objects:/home/kmanivannan/hmi/knowrob_ws/src/knowrob/knowrob_objects/msg -Igeometry_msgs:/opt/ros/kinetic/share/geometry_msgs/cmake/../msg -Istd_msgs:/opt/ros/kinetic/share/std_msgs/cmake/../msg -p knowrob_objects -o /home/kmanivannan/hmi/knowrob_ws/devel/.private/knowrob_objects/lib/python2.7/dist-packages/knowrob_objects/msg
  666. cd /home/kmanivannan/hmi/knowrob_ws/src/knowrob/knowrob_objects && /home/kmanivannan/hmi/knowrob_ws/build/knowrob_objects/catkin_generated/env_cached.sh /usr/bin/python /opt/ros/kinetic/share/gencpp/cmake/../../../lib/gencpp/gen_cpp.py /home/kmanivannan/hmi/knowrob_ws/src/knowrob/knowrob_objects/msg/ObjectState.msg -Iknowrob_objects:/home/kmanivannan/hmi/knowrob_ws/src/knowrob/knowrob_objects/msg -Igeometry_msgs:/opt/ros/kinetic/share/geometry_msgs/cmake/../msg -Istd_msgs:/opt/ros/kinetic/share/std_msgs/cmake/../msg -p knowrob_objects -o /home/kmanivannan/hmi/knowrob_ws/devel/.private/knowrob_objects/include/knowrob_objects -e /opt/ros/kinetic/share/gencpp/cmake/..
  667. [ 17%] Generating Javascript code from knowrob_objects/ObjectState.msg
  668. catkin_generated/env_cached.sh /usr/bin/python /opt/ros/kinetic/share/gennodejs/cmake/../../../lib/gennodejs/gen_nodejs.py /home/kmanivannan/hmi/knowrob_ws/src/knowrob/knowrob_objects/msg/ObjectState.msg -Iknowrob_objects:/home/kmanivannan/hmi/knowrob_ws/src/knowrob/knowrob_objects/msg -Igeometry_msgs:/opt/ros/kinetic/share/geometry_msgs/cmake/../msg -Istd_msgs:/opt/ros/kinetic/share/std_msgs/cmake/../msg -p knowrob_objects -o /home/kmanivannan/hmi/knowrob_ws/devel/.private/knowrob_objects/share/gennodejs/ros/knowrob_objects/msg
  669. make[2]: Entering directory '/home/kmanivannan/hmi/knowrob_ws/build/knowrob_objects'
  670. [ 21%] Generating EusLisp code from knowrob_objects/ObjectState.msg
  671. catkin_generated/env_cached.sh /usr/bin/python /opt/ros/kinetic/share/geneus/cmake/../../../lib/geneus/gen_eus.py /home/kmanivannan/hmi/knowrob_ws/src/knowrob/knowrob_objects/msg/ObjectState.msg -Iknowrob_objects:/home/kmanivannan/hmi/knowrob_ws/src/knowrob/knowrob_objects/msg -Igeometry_msgs:/opt/ros/kinetic/share/geometry_msgs/cmake/../msg -Istd_msgs:/opt/ros/kinetic/share/std_msgs/cmake/../msg -p knowrob_objects -o /home/kmanivannan/hmi/knowrob_ws/devel/.private/knowrob_objects/share/roseus/ros/knowrob_objects/msg
  672. [ 26%] Generating Java gradle project from knowrob_objects
  673. catkin_generated/env_cached.sh /usr/bin/python /opt/ros/kinetic/share/genjava/cmake/../../../lib/genjava/genjava_gradle_project.py -o /home/kmanivannan/hmi/knowrob_ws/build/knowrob_objects/java -p knowrob_objects
  674. [ 30%] Generating Lisp code from knowrob_objects/ObjectState.msg
  675. catkin_generated/env_cached.sh /usr/bin/python /opt/ros/kinetic/share/genlisp/cmake/../../../lib/genlisp/gen_lisp.py /home/kmanivannan/hmi/knowrob_ws/src/knowrob/knowrob_objects/msg/ObjectState.msg -Iknowrob_objects:/home/kmanivannan/hmi/knowrob_ws/src/knowrob/knowrob_objects/msg -Igeometry_msgs:/opt/ros/kinetic/share/geometry_msgs/cmake/../msg -Istd_msgs:/opt/ros/kinetic/share/std_msgs/cmake/../msg -p knowrob_objects -o /home/kmanivannan/hmi/knowrob_ws/devel/.private/knowrob_objects/share/common-lisp/ros/knowrob_objects/msg
  676. [ 34%] Generating Javascript code from knowrob_objects/DirtyObject.srv
  677. catkin_generated/env_cached.sh /usr/bin/python /opt/ros/kinetic/share/gennodejs/cmake/../../../lib/gennodejs/gen_nodejs.py /home/kmanivannan/hmi/knowrob_ws/src/knowrob/knowrob_objects/srv/DirtyObject.srv -Iknowrob_objects:/home/kmanivannan/hmi/knowrob_ws/src/knowrob/knowrob_objects/msg -Igeometry_msgs:/opt/ros/kinetic/share/geometry_msgs/cmake/../msg -Istd_msgs:/opt/ros/kinetic/share/std_msgs/cmake/../msg -p knowrob_objects -o /home/kmanivannan/hmi/knowrob_ws/devel/.private/knowrob_objects/share/gennodejs/ros/knowrob_objects/srv
  678. [ 39%] Generating EusLisp code from knowrob_objects/DirtyObject.srv
  679. catkin_generated/env_cached.sh /usr/bin/python /opt/ros/kinetic/share/geneus/cmake/../../../lib/geneus/gen_eus.py /home/kmanivannan/hmi/knowrob_ws/src/knowrob/knowrob_objects/srv/DirtyObject.srv -Iknowrob_objects:/home/kmanivannan/hmi/knowrob_ws/src/knowrob/knowrob_objects/msg -Igeometry_msgs:/opt/ros/kinetic/share/geometry_msgs/cmake/../msg -Istd_msgs:/opt/ros/kinetic/share/std_msgs/cmake/../msg -p knowrob_objects -o /home/kmanivannan/hmi/knowrob_ws/devel/.private/knowrob_objects/share/roseus/ros/knowrob_objects/srv
  680. [ 43%] Generating Python code from SRV knowrob_objects/DirtyObject
  681. catkin_generated/env_cached.sh /usr/bin/python /opt/ros/kinetic/share/genpy/cmake/../../../lib/genpy/gensrv_py.py /home/kmanivannan/hmi/knowrob_ws/src/knowrob/knowrob_objects/srv/DirtyObject.srv -Iknowrob_objects:/home/kmanivannan/hmi/knowrob_ws/src/knowrob/knowrob_objects/msg -Igeometry_msgs:/opt/ros/kinetic/share/geometry_msgs/cmake/../msg -Istd_msgs:/opt/ros/kinetic/share/std_msgs/cmake/../msg -p knowrob_objects -o /home/kmanivannan/hmi/knowrob_ws/devel/.private/knowrob_objects/lib/python2.7/dist-packages/knowrob_objects/srv
  682. [ 47%] Generating Lisp code from knowrob_objects/DirtyObject.srv
  683. catkin_generated/env_cached.sh /usr/bin/python /opt/ros/kinetic/share/genlisp/cmake/../../../lib/genlisp/gen_lisp.py /home/kmanivannan/hmi/knowrob_ws/src/knowrob/knowrob_objects/srv/DirtyObject.srv -Iknowrob_objects:/home/kmanivannan/hmi/knowrob_ws/src/knowrob/knowrob_objects/msg -Igeometry_msgs:/opt/ros/kinetic/share/geometry_msgs/cmake/../msg -Istd_msgs:/opt/ros/kinetic/share/std_msgs/cmake/../msg -p knowrob_objects -o /home/kmanivannan/hmi/knowrob_ws/devel/.private/knowrob_objects/share/common-lisp/ros/knowrob_objects/srv
  684. [ 52%] Generating EusLisp code from knowrob_objects/UpdateObjectState.srv
  685. catkin_generated/env_cached.sh /usr/bin/python /opt/ros/kinetic/share/geneus/cmake/../../../lib/geneus/gen_eus.py /home/kmanivannan/hmi/knowrob_ws/src/knowrob/knowrob_objects/srv/UpdateObjectState.srv -Iknowrob_objects:/home/kmanivannan/hmi/knowrob_ws/src/knowrob/knowrob_objects/msg -Igeometry_msgs:/opt/ros/kinetic/share/geometry_msgs/cmake/../msg -Istd_msgs:/opt/ros/kinetic/share/std_msgs/cmake/../msg -p knowrob_objects -o /home/kmanivannan/hmi/knowrob_ws/devel/.private/knowrob_objects/share/roseus/ros/knowrob_objects/srv
  686. [ 56%] Generating Javascript code from knowrob_objects/UpdateObjectState.srv
  687. catkin_generated/env_cached.sh /usr/bin/python /opt/ros/kinetic/share/gennodejs/cmake/../../../lib/gennodejs/gen_nodejs.py /home/kmanivannan/hmi/knowrob_ws/src/knowrob/knowrob_objects/srv/UpdateObjectState.srv -Iknowrob_objects:/home/kmanivannan/hmi/knowrob_ws/src/knowrob/knowrob_objects/msg -Igeometry_msgs:/opt/ros/kinetic/share/geometry_msgs/cmake/../msg -Istd_msgs:/opt/ros/kinetic/share/std_msgs/cmake/../msg -p knowrob_objects -o /home/kmanivannan/hmi/knowrob_ws/devel/.private/knowrob_objects/share/gennodejs/ros/knowrob_objects/srv
  688. [ 60%] Generating C++ code from knowrob_objects/DirtyObject.srv
  689. cd /home/kmanivannan/hmi/knowrob_ws/src/knowrob/knowrob_objects && /home/kmanivannan/hmi/knowrob_ws/build/knowrob_objects/catkin_generated/env_cached.sh /usr/bin/python /opt/ros/kinetic/share/gencpp/cmake/../../../lib/gencpp/gen_cpp.py /home/kmanivannan/hmi/knowrob_ws/src/knowrob/knowrob_objects/srv/DirtyObject.srv -Iknowrob_objects:/home/kmanivannan/hmi/knowrob_ws/src/knowrob/knowrob_objects/msg -Igeometry_msgs:/opt/ros/kinetic/share/geometry_msgs/cmake/../msg -Istd_msgs:/opt/ros/kinetic/share/std_msgs/cmake/../msg -p knowrob_objects -o /home/kmanivannan/hmi/knowrob_ws/devel/.private/knowrob_objects/include/knowrob_objects -e /opt/ros/kinetic/share/gencpp/cmake/..
  690. make[2]: Leaving directory '/home/kmanivannan/hmi/knowrob_ws/build/knowrob_objects'
  691. [ 65%] Generating Python code from SRV knowrob_objects/UpdateObjectState
  692. catkin_generated/env_cached.sh /usr/bin/python /opt/ros/kinetic/share/genpy/cmake/../../../lib/genpy/gensrv_py.py /home/kmanivannan/hmi/knowrob_ws/src/knowrob/knowrob_objects/srv/UpdateObjectState.srv -Iknowrob_objects:/home/kmanivannan/hmi/knowrob_ws/src/knowrob/knowrob_objects/msg -Igeometry_msgs:/opt/ros/kinetic/share/geometry_msgs/cmake/../msg -Istd_msgs:/opt/ros/kinetic/share/std_msgs/cmake/../msg -p knowrob_objects -o /home/kmanivannan/hmi/knowrob_ws/devel/.private/knowrob_objects/lib/python2.7/dist-packages/knowrob_objects/srv
  693. [ 69%] Generating EusLisp manifest code for knowrob_objects
  694. [ 69%] Built target knowrob_objects_generate_messages_nodejs
  695. [ 73%] Generating Lisp code from knowrob_objects/UpdateObjectState.srv
  696. catkin_generated/env_cached.sh /usr/bin/python /opt/ros/kinetic/share/geneus/cmake/../../../lib/geneus/gen_eus.py -m -o /home/kmanivannan/hmi/knowrob_ws/devel/.private/knowrob_objects/share/roseus/ros/knowrob_objects knowrob_objects geometry_msgs
  697. catkin_generated/env_cached.sh /usr/bin/python /opt/ros/kinetic/share/genlisp/cmake/../../../lib/genlisp/gen_lisp.py /home/kmanivannan/hmi/knowrob_ws/src/knowrob/knowrob_objects/srv/UpdateObjectState.srv -Iknowrob_objects:/home/kmanivannan/hmi/knowrob_ws/src/knowrob/knowrob_objects/msg -Igeometry_msgs:/opt/ros/kinetic/share/geometry_msgs/cmake/../msg -Istd_msgs:/opt/ros/kinetic/share/std_msgs/cmake/../msg -p knowrob_objects -o /home/kmanivannan/hmi/knowrob_ws/devel/.private/knowrob_objects/share/common-lisp/ros/knowrob_objects/srv
  698. [ 78%] Generating C++ code from knowrob_objects/UpdateObjectState.srv
  699. cd /home/kmanivannan/hmi/knowrob_ws/src/knowrob/knowrob_objects && /home/kmanivannan/hmi/knowrob_ws/build/knowrob_objects/catkin_generated/env_cached.sh /usr/bin/python /opt/ros/kinetic/share/gencpp/cmake/../../../lib/gencpp/gen_cpp.py /home/kmanivannan/hmi/knowrob_ws/src/knowrob/knowrob_objects/srv/UpdateObjectState.srv -Iknowrob_objects:/home/kmanivannan/hmi/knowrob_ws/src/knowrob/knowrob_objects/msg -Igeometry_msgs:/opt/ros/kinetic/share/geometry_msgs/cmake/../msg -Istd_msgs:/opt/ros/kinetic/share/std_msgs/cmake/../msg -p knowrob_objects -o /home/kmanivannan/hmi/knowrob_ws/devel/.private/knowrob_objects/include/knowrob_objects -e /opt/ros/kinetic/share/gencpp/cmake/..
  700. make[2]: Leaving directory '/home/kmanivannan/hmi/knowrob_ws/build/knowrob_objects'
  701. [ 78%] Built target knowrob_objects_generate_messages_lisp
  702. [ 82%] Generating Python msg __init__.py for knowrob_objects
  703. catkin_generated/env_cached.sh /usr/bin/python /opt/ros/kinetic/share/genpy/cmake/../../../lib/genpy/genmsg_py.py -o /home/kmanivannan/hmi/knowrob_ws/devel/.private/knowrob_objects/lib/python2.7/dist-packages/knowrob_objects/msg --initpy
  704. [ 86%] Generating Python srv __init__.py for knowrob_objects
  705. catkin_generated/env_cached.sh /usr/bin/python /opt/ros/kinetic/share/genpy/cmake/../../../lib/genpy/genmsg_py.py -o /home/kmanivannan/hmi/knowrob_ws/devel/.private/knowrob_objects/lib/python2.7/dist-packages/knowrob_objects/srv --initpy
  706. make[2]: Leaving directory '/home/kmanivannan/hmi/knowrob_ws/build/knowrob_objects'
  707. [ 86%] Built target knowrob_objects_generate_messages_py
  708. touch /home/kmanivannan/hmi/knowrob_ws/build/knowrob_objects/java/knowrob_objects/droppings
  709. [ 91%] Compiling Java code for knowrob_objects
  710. cd /home/kmanivannan/hmi/knowrob_ws/build/knowrob_objects/java/knowrob_objects && /home/kmanivannan/hmi/knowrob_ws/build/knowrob_objects/catkin_generated/env_cached.sh /usr/bin/python /opt/ros/kinetic/share/genjava/cmake/../../../lib/genjava/genjava_gradle_project.py --compile -o /home/kmanivannan/hmi/knowrob_ws/build/knowrob_objects/java -p knowrob_objects
  711. make[2]: Leaving directory '/home/kmanivannan/hmi/knowrob_ws/build/knowrob_objects'
  712. [ 91%] Built target knowrob_objects_generate_messages_cpp
  713. touch /home/kmanivannan/hmi/knowrob_ws/build/knowrob_objects/java/knowrob_objects/droppings
  714. make[2]: Leaving directory '/home/kmanivannan/hmi/knowrob_ws/build/knowrob_objects'
  715. [ 91%] Built target knowrob_objects_generate_messages_java
  716. <-------------> 0% CONFIGURING [0s]
  717. > root project > Resolve files of :classpath
  718. make[2]: Leaving directory '/home/kmanivannan/hmi/knowrob_ws/build/knowrob_objects'
  719. [ 91%] Built target knowrob_objects_generate_messages_eus
  720. /usr/bin/make -f CMakeFiles/knowrob_objects.dir/build.make CMakeFiles/knowrob_objects.dir/depend
  721. make[2]: Entering directory '/home/kmanivannan/hmi/knowrob_ws/build/knowrob_objects'
  722. cd /home/kmanivannan/hmi/knowrob_ws/build/knowrob_objects && /usr/bin/cmake -E cmake_depends "Unix Makefiles" /home/kmanivannan/hmi/knowrob_ws/src/knowrob/knowrob_objects /home/kmanivannan/hmi/knowrob_ws/src/knowrob/knowrob_objects /home/kmanivannan/hmi/knowrob_ws/build/knowrob_objects /home/kmanivannan/hmi/knowrob_ws/build/knowrob_objects /home/kmanivannan/hmi/knowrob_ws/build/knowrob_objects/CMakeFiles/knowrob_objects.dir/DependInfo.cmake --color=
  723. Dependee "/home/kmanivannan/hmi/knowrob_ws/build/knowrob_objects/CMakeFiles/knowrob_objects.dir/DependInfo.cmake" is newer than depender "/home/kmanivannan/hmi/knowrob_ws/build/knowrob_objects/CMakeFiles/knowrob_objects.dir/depend.internal".
  724. Dependee "/home/kmanivannan/hmi/knowrob_ws/build/knowrob_objects/CMakeFiles/CMakeDirectoryInformation.cmake" is newer than depender "/home/kmanivannan/hmi/knowrob_ws/build/knowrob_objects/CMakeFiles/knowrob_objects.dir/depend.internal".
  725. Scanning dependencies of target knowrob_objects
  726. make[2]: Leaving directory '/home/kmanivannan/hmi/knowrob_ws/build/knowrob_objects'
  727. /usr/bin/make -f CMakeFiles/knowrob_objects.dir/build.make CMakeFiles/knowrob_objects.dir/build
  728. make[2]: Entering directory '/home/kmanivannan/hmi/knowrob_ws/build/knowrob_objects'
  729. [ 95%] Building CXX object CMakeFiles/knowrob_objects.dir/src/knowrob_objects.cpp.o
  730. /usr/bin/c++   -DROSCONSOLE_BACKEND_LOG4CXX -DROS_PACKAGE_NAME=\"knowrob_objects\" -Dknowrob_objects_EXPORTS -I/home/kmanivannan/hmi/knowrob_ws/devel/.private/knowrob_objects/include -I/home/kmanivannan/hmi/knowrob_ws/src/knowrob/kwarning: [options] bootstrap class path not set in conjunction with -source 1.7
  731. 1 warning
  732. make[2]: Leaving directory '/home/kmanivannan/hmi/knowrob_ws/build/knowrob_objects'
  733. [ 95%] Built target knowrob_objects_generate_messages_java_gradle
  734. /usr/bin/make -f CMakeFiles/knowrob_objects_generate_messages.dir/build.make CMakeFiles/knowrob_objects_generate_messages.dir/depend
  735. make[2]: Entering directory '/home/kmanivannan/hmi/knowrob_ws/build/knowrob_objects'
  736. cd /home/kmanivannan/hmi/knowrob_ws/build/knowrob_objects && /usr/bin/cmake -E cmake_depends "Unix Makefiles" /home/kmanivannan/hmi/knowrob_ws/src/knowrob/knowrob_objects /home/kmanivannan/hmi/knowrob_ws/src/knowrob/knowrob_objects /home/kmanivannan/hmi/knowrob_ws/build/knowrob_objects /home/kmanivannan/hmi/knowrob_ws/build/knowrob_objects /home/kmanivannan/hmi/knowrob_ws/build/knowrob_objects/CMakeFiles/knowrob_objects_generate_messages.dir/DependInfo.cmake --color=
  737. Dependee "/home/kmanivannan/hmi/knowrob_ws/build/knowrob_objects/CMakeFiles/knowrob_objects_generate_messages.dir/DependInfo.cmake" is newer than depender "/home/kmanivannan/hmi/knowrob_ws/build/knowrob_objects/CMakeFiles/knowrob_objects_generate_messages.dir/depend.internal".
  738. Dependee "/home/kmanivannan/hmi/knowrob_ws/build/knowrob_objects/CMakeFiles/CMakeDirectoryInformation.cmake" is newer than depender "/home/kmanivannan/hmi/knowrob_ws/build/knowrob_objects/CMakeFiles/knowrob_objects_generate_messages.dir/depend.internal".
  739. Scanning dependencies of target knowrob_objects_generate_messages
  740. make[2]: Leaving directory '/home/kmanivannan/hmi/knowrob_ws/build/knowrob_objects'
  741. /usr/bin/make -f CMakeFiles/knowrob_objects_generate_messages.dir/build.make CMakeFiles/knowrob_objects_generate_messages.dir/build
  742. make[2]: Entering directory '/home/kmanivannan/hmi/knowrob_ws/build/knowrob_objects'
  743. make[2]: Nothing to be done for 'CMakeFiles/knowrob_objects_generate_messages.dir/build'.
  744. make[2]: Leaving directory '/home/kmanivannan/hmi/knowrob_ws/build/knowrob_objects'
  745. [ 95%] Built target knowrob_objects_generate_messages
  746. [100%] Linking CXX shared library /home/kmanivannan/hmi/knowrob_ws/devel/.private/knowrob_objects/lib/libknowrob_objects.so
  747. /usr/bin/cmake -E cmake_link_script CMakeFiles/knowrob_objects.dir/link.txt --verbose=1
  748. /usr/bin/c++  -fPIC -std=c++0x -pthread   -shared -Wl,-soname,libknowrob_objects.so -o /home/kmanivannan/hmi/knowrob_ws/devel/.private/knowrob_objects/lib/libknowrob_objects.so CMakeFiles/knowrob_objects.dir/src/knowrob_objects.cpp.o -lswipl /home/kmanivannan/hmi/knowrob_ws/devel/.private/rosprolog/lib/librosprolog.so /opt/ros/kinetic/lib/libroscpp.so -lboost_signals /opt/ros/kinetic/lib/librosconsole.so /opt/ros/kinetic/lib/librosconsole_log4cxx.so /opt/ros/kinetic/lib/librosconsole_backend_interface.so -llog4cxx -lboost_regex /opt/ros/kinetic/lib/libroscpp_serialization.so /opt/ros/kinetic/lib/libxmlrpcpp.so /opt/ros/kinetic/lib/librostime.so /opt/ros/kinetic/lib/libcpp_common.so -lboost_thread -lboost_chrono -lboost_date_time -lboost_atomic -lpthread -lconsole_bridge /opt/ros/kinetic/lib/libroslib.so /opt/ros/kinetic/lib/librospack.so -lpython2.7 -lboost_filesystem -lboost_program_options -lboost_system -ltinyxml -Wl,-rpath,/home/kmanivannan/hmi/knowrob_ws/devel/.private/rosprolog/lib:/opt/ros/kinetic/lib
  749. make[2]: Leaving directory '/home/kmanivannan/hmi/knowrob_ws/build/knowrob_objects'
  750. [100%] Built target knowrob_objects
  751. make[1]: Leaving directory '/home/kmanivannan/hmi/knowrob_ws/build/knowrob_objects'
  752. /usr/bin/cmake -E cmake_progress_start /home/kmanivannan/hmi/knowrob_ws/build/knowrob_objects/CMakeFiles 0
  753. cd /home/kmanivannan/hmi/knowrob_ws/build/knowrob_objects; catkin build --get-env knowrob_objects | catkin env -si  /usr/bin/make --jobserver-fds=6,7 -j; cd -
  754. Finished   << knowrob_objects:make                                                                                                                                                                                                    
  755. Starting   >> knowrob_objects:symlink                                                                                                                                                                                                
  756. Output     << knowrob_objects:symlink /home/kmanivannan/hmi/knowrob_ws/logs/knowrob_objects/build.symlink.000.log                                                                                                                    
  757. Symlinking /home/kmanivannan/hmi/knowrob_ws/devel/lib/libknowrob_objects.so
  758. Symlinking /home/kmanivannan/hmi/knowrob_ws/devel/lib/python2.7/dist-packages/knowrob_objects/__init__.py
  759. Symlinking /home/kmanivannan/hmi/knowrob_ws/devel/lib/python2.7/dist-packages/knowrob_objects/msg/_ObjectState.py
  760. Symlinking /home/kmanivannan/hmi/knowrob_ws/devel/lib/python2.7/dist-packages/knowrob_objects/msg/__init__.py
  761. Symlinking /home/kmanivannan/hmi/knowrob_ws/devel/lib/python2.7/dist-packages/knowrob_objects/srv/_DirtyObject.py
  762. Symlinking /home/kmanivannan/hmi/knowrob_ws/devel/lib/python2.7/dist-packages/knowrob_objects/srv/__init__.py
  763. Symlinking /home/kmanivannan/hmi/knowrob_ws/devel/lib/python2.7/dist-packages/knowrob_objects/srv/_UpdateObjectState.py
  764. Symlinking /home/kmanivannan/hmi/knowrob_ws/devel/lib/pkgconfig/knowrob_objects.pc
  765. Symlinking /home/kmanivannan/hmi/knowrob_ws/devel/include/knowrob_objects/DirtyObjectRequest.h
  766. Symlinking /home/kmanivannan/hmi/knowrob_ws/devel/include/knowrob_objects/ObjectState.h
  767. Symlinking /home/kmanivannan/hmi/knowrob_ws/devel/include/knowrob_objects/UpdateObjectState.h
  768. Symlinking /home/kmanivannan/hmi/knowrob_ws/devel/include/knowrob_objects/DirtyObject.h
  769. Symlinking /home/kmanivannan/hmi/knowrob_ws/devel/include/knowrob_objects/DirtyObjectResponse.h
  770. Symlinking /home/kmanivannan/hmi/knowrob_ws/devel/include/knowrob_objects/UpdateObjectStateRequest.h
  771. Symlinking /home/kmanivannan/hmi/knowrob_ws/devel/include/knowrob_objects/UpdateObjectStateResponse.h
  772. Symlinking /home/kmanivannan/hmi/knowrob_ws/devel/share/roseus/ros/knowrob_objects/manifest.l
  773. Symlinking /home/kmanivannan/hmi/knowrob_ws/devel/share/roseus/ros/knowrob_objects/msg/ObjectState.l
  774. Symlinking /home/kmanivannan/hmi/knowrob_ws/devel/share/roseus/ros/knowrob_objects/srv/DirtyObject.l
  775. Symlinking /home/kmanivannan/hmi/knowrob_ws/devel/share/roseus/ros/knowrob_objects/srv/UpdateObjectState.l
  776. Symlinking /home/kmanivannan/hmi/knowrob_ws/devel/share/common-lisp/ros/knowrob_objects/msg/ObjectState.lisp
  777. Symlinking /home/kmanivannan/hmi/knowrob_ws/devel/share/common-lisp/ros/knowrob_objects/msg/_package.lisp
  778. Symlinking /home/kmanivannan/hmi/knowrob_ws/devel/share/common-lisp/ros/knowrob_objects/msg/knowrob_objects-msg.asd
  779. Symlinking /home/kmanivannan/hmi/knowrob_ws/devel/share/common-lisp/ros/knowrob_objects/msg/_package_ObjectState.lisp
  780. Symlinking /home/kmanivannan/hmi/knowrob_ws/devel/share/common-lisp/ros/knowrob_objects/srv/DirtyObject.lisp
  781. Symlinking /home/kmanivannan/hmi/knowrob_ws/devel/share/common-lisp/ros/knowrob_objects/srv/knowrob_objects-srv.asd
  782. Symlinking /home/kmanivannan/hmi/knowrob_ws/devel/share/common-lisp/ros/knowrob_objects/srv/_package.lisp
  783. Symlinking /home/kmanivannan/hmi/knowrob_ws/devel/share/common-lisp/ros/knowrob_objects/srv/_package_DirtyObject.lisp
  784. Symlinking /home/kmanivannan/hmi/knowrob_ws/devel/share/common-lisp/ros/knowrob_objects/srv/UpdateObjectState.lisp
  785. Symlinking /home/kmanivannan/hmi/knowrob_ws/devel/share/common-lisp/ros/knowrob_objects/srv/_package_UpdateObjectState.lisp
  786. Symlinking /home/kmanivannan/hmi/knowrob_ws/devel/share/gennodejs/ros/knowrob_objects/_index.js
  787. Symlinking /home/kmanivannan/hmi/knowrob_ws/devel/share/gennodejs/ros/knowrob_objects/msg/ObjectState.js
  788. Symlinking /home/kmanivannan/hmi/knowrob_ws/devel/share/gennodejs/ros/knowrob_objects/msg/_index.js
  789. Symlinking /home/kmanivannan/hmi/knowrob_ws/devel/share/gennodejs/ros/knowrob_objects/srv/UpdateObjectState.js
  790. Symlinking /home/kmanivannan/hmi/knowrob_ws/devel/share/gennodejs/ros/knowrob_objects/srv/DirtyObject.js
  791. Symlinking /home/kmanivannan/hmi/knowrob_ws/devel/share/gennodejs/ros/knowrob_objects/srv/_index.js
  792. Symlinking /home/kmanivannan/hmi/knowrob_ws/devel/share/knowrob_objects/cmake/knowrob_objects-msg-paths.cmake
  793. Symlinking /home/kmanivannan/hmi/knowrob_ws/devel/share/knowrob_objects/cmake/knowrob_objectsConfig.cmake
  794. Symlinking /home/kmanivannan/hmi/knowrob_ws/devel/share/knowrob_objects/cmake/knowrob_objects-msg-extras.cmake
  795. Symlinking /home/kmanivannan/hmi/knowrob_ws/devel/share/knowrob_objects/cmake/knowrob_objectsConfig-version.cmake
  796. Finished   << knowrob_objects:symlink                                                                                                                                                                                                
  797. Finished  <<< knowrob_objects                            [ 8.4 seconds ]                                                                                                                                                              
  798. Starting  >>> comp_spatial                                                                                                                                                                                                            
  799. Starting  >>> knowrob_actions                                                                                                                                                                                                        
  800. Starting  >>> knowrob_mongo                                                                                                                                                                                                          
  801. Starting   >> knowrob_actions:loadenv                                                                                                                                                                                                
  802. Output     << knowrob_actions:loadenv /home/kmanivannan/hmi/knowrob_ws/logs/knowrob_actions/build.loadenv.000.log                                                                                                                    
  803. Loading environment from: /home/kmanivannan/hmi/knowrob_ws/devel/env.sh
  804. Finished   << knowrob_actions:loadenv                                                                                                                                                                                                
  805. Starting   >> knowrob_actions:mkdir                                                                                                                                                                                                  
  806. Starting   >> knowrob_mongo:loadenv                                                                                                                                                                                                  
  807. Starting   >> knowrob_actions:mkdir                                                                                                                                                                                                  
  808. Starting   >> knowrob_actions:cache-manifest                                                                                                                                                                                          
  809. Starting   >> knowrob_actions:ctr-nuke                                                                                                                                                                                                
  810. Starting   >> knowrob_actions:cmake                                                                                                                                                                                                  
  811. Subprocess  > knowrob_actions:cmake `cd /home/kmanivannan/hmi/knowrob_ws/build/knowrob_actions; catkin build --get-env knowrob_actions | catkin env -si  /usr/bin/cmake /home/kmanivannan/hmi/knowrob_ws/src/knowrob/knowrob_actions --no-warn-unused-cli -DCATKIN_DEVEL_PREFIX=/home/kmanivannan/hmi/knowrob_ws/devel/.private/knowrob_actions -DCMAKE_INSTALL_PREFIX=/home/kmanivannan/hmi/knowrob_ws/install; cd -`
  812. Output     << knowrob_mongo:loadenv /home/kmanivannan/hmi/knowrob_ws/logs/knowrob_mongo/build.loadenv.000.log                                                                                                                        
  813. Loading environment from: /home/kmanivannan/hmi/knowrob_ws/devel/env.sh
  814. Finished   << knowrob_mongo:loadenv                                                                                                                                                                                                  
  815. Starting   >> knowrob_mongo:mkdir                                                                                                                                                                                                    
  816. Starting   >> comp_spatial:loadenv                                                                                                                                                                                                    
  817. Starting   >> knowrob_mongo:mkdir                                                                                                                                                                                                    
  818. Starting   >> knowrob_mongo:cache-manifest                                                                                                                                                                                            
  819. Starting   >> knowrob_mongo:ctr-nuke                                                                                                                                                                                                  
  820. Starting   >> knowrob_mongo:cmake                                                                                                                                                                                                    
  821. Subprocess  > knowrob_mongo:cmake `cd /home/kmanivannan/hmi/knowrob_ws/build/knowrob_mongo; catkin build --get-env knowrob_mongo | catkin env -si  /usr/bin/cmake /home/kmanivannan/hmi/knowrob_ws/src/knowrob/knowrob_mongo --no-warn-unused-cli -DCATKIN_DEVEL_PREFIX=/home/kmanivannan/hmi/knowrob_ws/devel/.private/knowrob_mongo -DCMAKE_INSTALL_PREFIX=/home/kmanivannan/hmi/knowrob_ws/install; cd -`
  822. Output     << comp_spatial:loadenv /home/kmanivannan/hmi/knowrob_ws/logs/comp_spatial/build.loadenv.000.log                                                                                                                          
  823. Loading environment from: /home/kmanivannan/hmi/knowrob_ws/devel/env.sh
  824. Finished   << comp_spatial:loadenv                                                                                                                                                                                                    
  825. Starting   >> comp_spatial:mkdir                                                                                                                                                                                                      
  826. Starting   >> comp_spatial:mkdir                                                                                                                                                                                                      
  827. Starting   >> comp_spatial:cache-manifest                                                                                                                                                                                            
  828. Starting   >> comp_spatial:ctr-nuke                                                                                                                                                                                                  
  829. Starting   >> comp_spatial:cmake                                                                                                                                                                                                      
  830. Subprocess  > comp_spatial:cmake `cd /home/kmanivannan/hmi/knowrob_ws/build/comp_spatial; catkin build --get-env comp_spatial | catkin env -si  /usr/bin/cmake /home/kmanivannan/hmi/knowrob_ws/src/knowrob/comp_spatial --no-warn-unused-cli -DCATKIN_DEVEL_PREFIX=/home/kmanivannan/hmi/knowrob_ws/devel/.private/comp_spatial -DCMAKE_INSTALL_PREFIX=/home/kmanivannan/hmi/knowrob_ws/install; cd -`
  831. ______________________________________________________________________________________________________________________________________________________________________________________________________________________________________
  832. Errors     << json_prolog:make /home/kmanivannan/hmi/knowrob_ws/logs/json_prolog/build.make.000.log                                                                                                                                  
  833. /usr/bin/cmake -H/home/kmanivannan/hmi/knowrob_ws/src/knowrob/json_prolog -B/home/kmanivannan/hmi/knowrob_ws/build/json_prolog --check-build-system CMakeFiles/Makefile.cmake 0
  834. /usr/bin/cmake -E cmake_progress_start /home/kmanivannan/hmi/knowrob_ws/build/json_prolog/CMakeFiles /home/kmanivannan/hmi/knowrob_ws/build/json_prolog/CMakeFiles/progress.marks
  835. /usr/bin/make -f CMakeFiles/Makefile2 all
  836. make[1]: Entering directory '/home/kmanivannan/hmi/knowrob_ws/build/json_prolog'
  837. /usr/bin/make -f CMakeFiles/rosgraph_msgs_generate_messages_eus.dir/build.make CMakeFiles/rosgraph_msgs_generate_messages_eus.dir/depend
  838. make[2]: Entering directory '/home/kmanivannan/hmi/knowrob_ws/build/json_prolog'
  839. cd /home/kmanivannan/hmi/knowrob_ws/build/json_prolog && /usr/bin/cmake -E cmake_depends "Unix Makefiles" /home/kmanivannan/hmi/knowrob_ws/src/knowrob/json_prolog /home/kmanivannan/hmi/knowrob_ws/src/knowrob/json_prolog /home/kmanivannan/hmi/knowrob_ws/build/json_prolog /home/kmanivannan/hmi/knowrob_ws/build/json_prolog /home/kmanivannan/hmi/knowrob_ws/build/json_prolog/CMakeFiles/rosgraph_msgs_generate_messages_eus.dir/DependInfo.cmake --color=
  840. /usr/bin/make -f CMakeFiles/json_prolog_msgs_generate_messages_py.dir/build.make CMakeFiles/json_prolog_msgs_generate_messages_py.dir/depend
  841. make[2]: Entering directory '/home/kmanivannan/hmi/knowrob_ws/build/json_prolog'
  842. cd /home/kmanivannan/hmi/knowrob_ws/build/json_prolog && /usr/bin/cmake -E cmake_depends "Unix Makefiles" /home/kmanivannan/hmi/knowrob_ws/src/knowrob/json_prolog /home/kmanivannan/hmi/knowrob_ws/src/knowrob/json_prolog /home/kmanivannan/hmi/knowrob_ws/build/json_prolog /home/kmanivannan/hmi/knowrob_ws/build/json_prolog /home/kmanivannan/hmi/knowrob_ws/build/json_prolog/CMakeFiles/json_prolog_msgs_generate_messages_py.dir/DependInfo.cmake --color=
  843. Dependee "/home/kmanivannan/hmi/knowrob_ws/build/json_prolog/CMakeFiles/rosgraph_msgs_generate_messages_eus.dir/DependInfo.cmake" is newer than depender "/home/kmanivannan/hmi/knowrob_ws/build/json_prolog/CMakeFiles/rosgraph_msgs_generate_messages_eus.dir/depend.internal".
  844. Dependee "/home/kmanivannan/hmi/knowrob_ws/build/json_prolog/CMakeFiles/CMakeDirectoryInformation.cmake" is newer than depender "/home/kmanivannan/hmi/knowrob_ws/build/json_prolog/CMakeFiles/rosgraph_msgs_generate_messages_eus.dir/depend.internal".
  845. Scanning dependencies of target rosgraph_msgs_generate_messages_eus
  846. make[2]: Leaving directory '/home/kmanivannan/hmi/knowrob_ws/build/json_prolog'
  847. /usr/bin/make -f CMakeFiles/rosgraph_msgs_generate_messages_eus.dir/build.make CMakeFiles/rosgraph_msgs_generate_messages_eus.dir/build
  848. make[2]: Entering directory '/home/kmanivannan/hmi/knowrob_ws/build/json_prolog'
  849. make[2]: Nothing to be done for 'CMakeFiles/rosgraph_msgs_generate_messages_eus.dir/build'.
  850. make[2]: Leaving directory '/home/kmanivannan/hmi/knowrob_ws/build/json_prolog'
  851. Dependee "/home/kmanivannan/hmi/knowrob_ws/build/json_prolog/CMakeFiles/json_prolog_msgs_generate_messages_py.dir/DependInfo.cmake" is newer than depender "/home/kmanivannan/hmi/knowrob_ws/build/json_prolog/CMakeFiles/json_prolog_msgs_generate_messages_py.dir/depend.internal".
  852. Dependee "/home/kmanivannan/hmi/knowrob_ws/build/json_prolog/CMakeFiles/CMakeDirectoryInformation.cmake" is newer than depender "/home/kmanivannan/hmi/knowrob_ws/build/json_prolog/CMakeFiles/json_prolog_msgs_generate_messages_py.dir/depend.internal".
  853. Scanning dependencies of target json_prolog_msgs_generate_messages_py
  854. make[2]: Leaving directory '/home/kmanivannan/hmi/knowrob_ws/build/json_prolog'
  855. /usr/bin/make -f CMakeFiles/json_prolog_msgs_generate_messages_py.dir/build.make CMakeFiles/json_prolog_msgs_generate_messages_py.dir/build
  856. make[2]: Entering directory '/home/kmanivannan/hmi/knowrob_ws/build/json_prolog'
  857. make[2]: Nothing to be done for 'CMakeFiles/json_prolog_msgs_generate_messages_py.dir/build'.
  858. make[2]: Leaving directory '/home/kmanivannan/hmi/knowrob_ws/build/json_prolog'
  859. [  0%] Built target json_prolog_msgs_generate_messages_py
  860. [  0%] Built target rosgraph_msgs_generate_messages_eus
  861. /usr/bin/make -f CMakeFiles/json_prolog_msgs_generate_messages_lisp.dir/build.make CMakeFiles/json_prolog_msgs_generate_messages_lisp.dir/depend
  862. /usr/bin/make -f CMakeFiles/json_prolog_msgs_generate_messages_java.dir/build.make CMakeFiles/json_prolog_msgs_generate_messages_java.dir/depend
  863. make[2]: Entering directory '/home/kmanivannan/hmi/knowrob_ws/build/json_prolog'
  864. cd /home/kmanivannan/hmi/knowrob_ws/build/json_prolog && /usr/bin/cmake -E cmake_depends "Unix Makefiles" /home/kmanivannan/hmi/knowrob_ws/src/knowrob/json_prolog /home/kmanivannan/hmi/knowrob_ws/src/knowrob/json_prolog /home/kmanivannan/hmi/knowrob_ws/build/json_prolog /home/kmanivannan/hmi/knowrob_ws/build/json_prolog /home/kmanivannan/hmi/knowrob_ws/build/json_prolog/CMakeFiles/json_prolog_msgs_generate_messages_java.dir/DependInfo.cmake --color=
  865. /usr/bin/make -f CMakeFiles/json_prolog_msgs_generate_messages_eus.dir/build.make CMakeFiles/json_prolog_msgs_generate_messages_eus.dir/depend
  866. make[2]: Entering directory '/home/kmanivannan/hmi/knowrob_ws/build/json_prolog'
  867. cd /home/kmanivannan/hmi/knowrob_ws/build/json_prolog && /usr/bin/cmake -E cmake_depends "Unix Makefiles" /home/kmanivannan/hmi/knowrob_ws/src/knowrob/json_prolog /home/kmanivannan/hmi/knowrob_ws/src/knowrob/json_prolog /home/kmanivannan/hmi/knowrob_ws/build/json_prolog /home/kmanivannan/hmi/knowrob_ws/build/json_prolog /home/kmanivannan/hmi/knowrob_ws/build/json_prolog/CMakeFiles/json_prolog_msgs_generate_messages_lisp.dir/DependInfo.cmake --color=
  868. make[2]: Entering directory '/home/kmanivannan/hmi/knowrob_ws/build/json_prolog'
  869. cd /home/kmanivannan/hmi/knowrob_ws/build/json_prolog && /usr/bin/cmake -E cmake_depends "Unix Makefiles" /home/kmanivannan/hmi/knowrob_ws/src/knowrob/json_prolog /home/kmanivannan/hmi/knowrob_ws/src/knowrob/json_prolog /home/kmanivannan/hmi/knowrob_ws/build/json_prolog /home/kmanivannan/hmi/knowrob_ws/build/json_prolog /home/kmanivannan/hmi/knowrob_ws/build/json_prolog/CMakeFiles/json_prolog_msgs_generate_messages_eus.dir/DependInfo.cmake --color=
  870. Dependee "/home/kmanivannan/hmi/knowrob_ws/build/json_prolog/CMakeFiles/json_prolog_msgs_generate_messages_java.dir/DependInfo.cmake" is newer than depender "/home/kmanivannan/hmi/knowrob_ws/build/json_prolog/CMakeFiles/json_prolog_msgs_generate_messages_java.dir/depend.internal".
  871. Dependee "/home/kmanivannan/hmi/knowrob_ws/build/json_prolog/CMakeFiles/CMakeDirectoryInformation.cmake" is newer than depender "/home/kmanivannan/hmi/knowrob_ws/build/json_prolog/CMakeFiles/json_prolog_msgs_generate_messages_java.dir/depend.internal".
  872. Scanning dependencies of target json_prolog_msgs_generate_messages_java
  873. Dependee "/home/kmanivannan/hmi/knowrob_ws/build/json_prolog/CMakeFiles/json_prolog_msgs_generate_messages_lisp.dir/DependInfo.cmake" is newer than depender "/home/kmanivannan/hmi/knowrob_ws/build/json_prolog/CMakeFiles/json_prolog_msgs_generate_messages_lisp.dir/depend.internal".
  874. Dependee "/home/kmanivannan/hmi/knowrob_ws/build/json_prolog/CMakeFiles/json_prolog_msgs_generate_messages_eus.dir/DependInfo.cmake" is newer than depender "/home/kmanivannan/hmi/knowrob_ws/build/json_prolog/CMakeFiles/json_prolog_msgs_generate_messages_eus.dir/depend.internal".
  875. Dependee "/home/kmanivannan/hmi/knowrob_ws/build/json_prolog/CMakeFiles/CMakeDirectoryInformation.cmake" is newer than depender "/home/kmanivannan/hmi/knowrob_ws/build/json_prolog/CMakeFiles/json_prolog_msgs_generate_messages_eus.dir/depend.internal".
  876. Scanning dependencies of target json_prolog_msgs_generate_messages_eus
  877. Dependee "/home/kmanivannan/hmi/knowrob_ws/build/json_prolog/CMakeFiles/CMakeDirectoryInformation.cmake" is newer than depender "/home/kmanivannan/hmi/knowrob_ws/build/json_prolog/CMakeFiles/json_prolog_msgs_generate_messages_lisp.dir/depend.internal".
  878. Scanning dependencies of target json_prolog_msgs_generate_messages_lisp
  879. make[2]: Leaving directory '/home/kmanivannan/hmi/knowrob_ws/build/json_prolog'
  880. make[2]: Leaving directory '/home/kmanivannan/hmi/knowrob_ws/build/json_prolog'
  881. /usr/bin/make -f CMakeFiles/json_prolog_msgs_generate_messages_java.dir/build.make CMakeFiles/json_prolog_msgs_generate_messages_java.dir/build
  882. /usr/bin/make -f CMakeFiles/json_prolog_msgs_generate_messages_eus.dir/build.make CMakeFiles/json_prolog_msgs_generate_messages_eus.dir/build
  883. make[2]: Leaving directory '/home/kmanivannan/hmi/knowrob_ws/build/json_prolog'
  884. /usr/bin/make -f CMakeFiles/json_prolog_msgs_generate_messages_lisp.dir/build.make CMakeFiles/json_prolog_msgs_generate_messages_lisp.dir/build
  885. make[2]: Entering directory '/home/kmanivannan/hmi/knowrob_ws/build/json_prolog'
  886. make[2]: Entering directory '/home/kmanivannan/hmi/knowrob_ws/build/json_prolog'
  887. make[2]: Nothing to be done for 'CMakeFiles/json_prolog_msgs_generate_messages_java.dir/build'.
  888. make[2]: Nothing to be done for 'CMakeFiles/json_prolog_msgs_generate_messages_eus.dir/build'.
  889. make[2]: Leaving directory '/home/kmanivannan/hmi/knowrob_ws/build/json_prolog'
  890. make[2]: Leaving directory '/home/kmanivannan/hmi/knowrob_ws/build/json_prolog'
  891. make[2]: Entering directory '/home/kmanivannan/hmi/knowrob_ws/build/json_prolog'
  892. make[2]: Nothing to be done for 'CMakeFiles/json_prolog_msgs_generate_messages_lisp.dir/build'.
  893. make[2]: Leaving directory '/home/kmanivannan/hmi/knowrob_ws/build/json_prolog'
  894. [  0%] Built target json_prolog_msgs_generate_messages_eus
  895. /usr/bin/make -f CMakeFiles/rosgraph_msgs_generate_messages_nodejs.dir/build.make CMakeFiles/rosgraph_msgs_generate_messages_nodejs.dir/depend
  896. [  0%] Built target json_prolog_msgs_generate_messages_lisp
  897. /usr/bin/make -f CMakeFiles/geometry_msgs_generate_messages_py.dir/build.make CMakeFiles/geometry_msgs_generate_messages_py.dir/depend
  898. /usr/bin/make -f CMakeFiles/geometry_msgs_generate_messages_cpp.dir/build.make CMakeFiles/geometry_msgs_generate_messages_cpp.dir/depend
  899. make[2]: Entering directory '/home/kmanivannan/hmi/knowrob_ws/build/json_prolog'
  900. cd /home/kmanivannan/hmi/knowrob_ws/build/json_prolog && /usr/bin/cmake -E cmake_depends "Unix Makefiles" /home/kmanivannan/hmi/knowrob_ws/src/knowrob/json_prolog /home/kmanivannan/hmi/knowrob_ws/src/knowrob/json_prolog /home/kmanivannan/hmi/knowrob_ws/build/json_prolog /home/kmanivannan/hmi/knowrob_ws/build/json_prolog /home/kmanivannan/hmi/knowrob_ws/build/json_prolog/CMakeFiles/rosgraph_msgs_generate_messages_nodejs.dir/DependInfo.cmake --color=
  901. make[2]: Entering directory '/home/kmanivannan/hmi/knowrob_ws/build/json_prolog'
  902. cd /home/kmanivannan/hmi/knowrob_ws/build/json_prolog && /usr/bin/cmake -E cmake_depends "Unix Makefiles" /home/kmanivannan/hmi/knowrob_ws/src/knowrob/json_prolog /home/kmanivannan/hmi/knowrob_ws/src/knowrob/json_prolog /home/kmanivannan/hmi/knowrob_ws/build/json_prolog /home/kmanivannan/hmi/knowrob_ws/build/json_prolog /home/kmanivannan/hmi/knowrob_ws/build/json_prolog/CMakeFiles/geometry_msgs_generate_messages_py.dir/DependInfo.cmake --color=
  903. make[2]: Entering directory '/home/kmanivannan/hmi/knowrob_ws/build/json_prolog'
  904. cd /home/kmanivannan/hmi/knowrob_ws/build/json_prolog && /usr/bin/cmake -E cmake_depends "Unix Makefiles" /home/kmanivannan/hmi/knowrob_ws/src/knowrob/json_prolog /home/kmanivannan/hmi/knowrob_ws/src/knowrob/json_prolog /home/kmanivannan/hmi/knowrob_ws/build/json_prolog /home/kmanivannan/hmi/knowrob_ws/build/json_prolog /home/kmanivannan/hmi/knowrob_ws/build/json_prolog/CMakeFiles/geometry_msgs_generate_messages_cpp.dir/DependInfo.cmake --color=
  905. [  0%] Built target json_prolog_msgs_generate_messages_java
  906. /usr/bin/make -f CMakeFiles/roscpp_generate_messages_cpp.dir/build.make CMakeFiles/roscpp_generate_messages_cpp.dir/depend
  907. make[2]: Entering directory '/home/kmanivannan/hmi/knowrob_ws/build/json_prolog'
  908. cd /home/kmanivannan/hmi/knowrob_ws/build/json_prolog && /usr/bin/cmake -E cmake_depends "Unix Makefiles" /home/kmanivannan/hmi/knowrob_ws/src/knowrob/json_prolog /home/kmanivannan/hmi/knowrob_ws/src/knowrob/json_prolog /home/kmanivannan/hmi/knowrob_ws/build/json_prolog /home/kmanivannan/hmi/knowrob_ws/build/json_prolog /home/kmanivannan/hmi/knowrob_ws/build/json_prolog/CMakeFiles/roscpp_generate_messages_cpp.dir/DependInfo.cmake --color=
  909. Dependee "/home/kmanivannan/hmi/knowrob_ws/build/json_prolog/CMakeFiles/rosgraph_msgs_generate_messages_nodejs.dir/DependInfo.cmake" is newer than depender "/home/kmanivannan/hmi/knowrob_ws/build/json_prolog/CMakeFiles/rosgraph_msgs_generate_messages_nodejs.dir/depend.internal".
  910. Dependee "/home/kmanivannan/hmi/knowrob_ws/build/json_prolog/CMakeFiles/CMakeDirectoryInformation.cmake" is newer than depender "/home/kmanivannan/hmi/knowrob_ws/build/json_prolog/CMakeFiles/rosgraph_msgs_generate_messages_nodejs.dir/depend.internal".
  911. Scanning dependencies of target rosgraph_msgs_generate_messages_nodejs
  912. Dependee "/home/kmanivannan/hmi/knowrob_ws/build/json_prolog/CMakeFiles/geometry_msgs_generate_messages_py.dir/DependInfo.cmake" is newer than depender "/home/kmanivannan/hmi/knowrob_ws/build/json_prolog/CMakeFiles/geometry_msgs_generate_messages_py.dir/depend.internal".
  913. Dependee "/home/kmanivannan/hmi/knowrob_ws/build/json_prolog/CMakeFiles/CMakeDirectoryInformation.cmake" is newer than depender "/home/kmanivannan/hmi/knowrob_ws/build/json_prolog/CMakeFiles/geometry_msgs_generate_messages_py.dir/depend.internal".
  914. Scanning dependencies of target geometry_msgs_generate_messages_py
  915. make[2]: Leaving directory '/home/kmanivannan/hmi/knowrob_ws/build/json_prolog'
  916. /usr/bin/make -f CMakeFiles/rosgraph_msgs_generate_messages_nodejs.dir/build.make CMakeFiles/rosgraph_msgs_generate_messages_nodejs.dir/build
  917. make[2]: Leaving directory '/home/kmanivannan/hmi/knowrob_ws/build/json_prolog'
  918. /usr/bin/make -f CMakeFiles/geometry_msgs_generate_messages_py.dir/build.make CMakeFiles/geometry_msgs_generate_messages_py.dir/build
  919. make[2]: Entering directory '/home/kmanivannan/hmi/knowrob_ws/build/json_prolog'
  920. make[2]: Nothing to be done for 'CMakeFiles/rosgraph_msgs_generate_messages_nodejs.dir/build'.
  921. make[2]: Leaving directory '/home/kmanivannan/hmi/knowrob_ws/build/json_prolog'
  922. make[2]: Entering directory '/home/kmanivannan/hmi/knowrob_ws/build/json_prolog'
  923. make[2]: Nothing to be done for 'CMakeFiles/geometry_msgs_generate_messages_py.dir/build'.
  924. make[2]: Leaving directory '/home/kmanivannan/hmi/knowrob_ws/build/json_prolog'
  925. Dependee "/home/kmanivannan/hmi/knowrob_ws/build/json_prolog/CMakeFiles/geometry_msgs_generate_messages_cpp.dir/DependInfo.cmake" is newer than depender "/home/kmanivannan/hmi/knowrob_ws/build/json_prolog/CMakeFiles/geometry_msgs_generate_messages_cpp.dir/depend.internal".
  926. Dependee "/home/kmanivannan/hmi/knowrob_ws/build/json_prolog/CMakeFiles/CMakeDirectoryInformation.cmake" is newer than depender "/home/kmanivannan/hmi/knowrob_ws/build/json_prolog/CMakeFiles/geometry_msgs_generate_messages_cpp.dir/depend.internal".
  927. Scanning dependencies of target geometry_msgs_generate_messages_cpp
  928. make[2]: Leaving directory '/home/kmanivannan/hmi/knowrob_ws/build/json_prolog'
  929. /usr/bin/make -f CMakeFiles/geometry_msgs_generate_messages_cpp.dir/build.make CMakeFiles/geometry_msgs_generate_messages_cpp.dir/build
  930. make[2]: Entering directory '/home/kmanivannan/hmi/knowrob_ws/build/json_prolog'
  931. make[2]: Nothing to be done for 'CMakeFiles/geometry_msgs_generate_messages_cpp.dir/build'.
  932. make[2]: Leaving directory '/home/kmanivannan/hmi/knowrob_ws/build/json_prolog'
  933. Dependee "/home/kmanivannan/hmi/knowrob_ws/build/json_prolog/CMakeFiles/roscpp_generate_messages_cpp.dir/DependInfo.cmake" is newer than depender "/home/kmanivannan/hmi/knowrob_ws/build/json_prolog/CMakeFiles/roscpp_generate_messages_cpp.dir/depend.internal".
  934. Dependee "/home/kmanivannan/hmi/knowrob_ws/build/json_prolog/CMakeFiles/CMakeDirectoryInformation.cmake" is newer than depender "/home/kmanivannan/hmi/knowrob_ws/build/json_prolog/CMakeFiles/roscpp_generate_messages_cpp.dir/depend.internal".
  935. Scanning dependencies of target roscpp_generate_messages_cpp
  936. make[2]: Leaving directory '/home/kmanivannan/hmi/knowrob_ws/build/json_prolog'
  937. [  0%] Built target geometry_msgs_generate_messages_py
  938. [  0%] Built target rosgraph_msgs_generate_messages_nodejs
  939. /usr/bin/make -f CMakeFiles/roscpp_generate_messages_cpp.dir/build.make CMakeFiles/roscpp_generate_messages_cpp.dir/build
  940. /usr/bin/make -f CMakeFiles/geometry_msgs_generate_messages_eus.dir/build.make CMakeFiles/geometry_msgs_generate_messages_eus.dir/depend
  941. make[2]: Entering directory '/home/kmanivannan/hmi/knowrob_ws/build/json_prolog'
  942. make[2]: Nothing to be done for 'CMakeFiles/roscpp_generate_messages_cpp.dir/build'.
  943. make[2]: Leaving directory '/home/kmanivannan/hmi/knowrob_ws/build/json_prolog'
  944. make[2]: Entering directory '/home/kmanivannan/hmi/knowrob_ws/build/json_prolog'
  945. cd /home/kmanivannan/hmi/knowrob_ws/build/json_prolog && /usr/bin/cmake -E cmake_depends "Unix Makefiles" /home/kmanivannan/hmi/knowrob_ws/src/knowrob/json_prolog /home/kmanivannan/hmi/knowrob_ws/src/knowrob/json_prolog /home/kmanivannan/hmi/knowrob_ws/build/json_prolog /home/kmanivannan/hmi/knowrob_ws/build/json_prolog /home/kmanivannan/hmi/knowrob_ws/build/json_prolog/CMakeFiles/geometry_msgs_generate_messages_eus.dir/DependInfo.cmake --color=
  946. [  0%] Built target geometry_msgs_generate_messages_cpp
  947. /usr/bin/make -f CMakeFiles/std_msgs_generate_messages_py.dir/build.make CMakeFiles/std_msgs_generate_messages_py.dir/depend
  948. [  0%] Built target roscpp_generate_messages_cpp
  949. /usr/bin/make -f CMakeFiles/json_prolog_msgs_generate_messages_cpp.dir/build.make CMakeFiles/json_prolog_msgs_generate_messages_cpp.dir/depend
  950. make[2]: Entering directory '/home/kmanivannan/hmi/knowrob_ws/build/json_prolog'
  951. /usr/bin/make -f CMakeFiles/geometry_msgs_generate_messages_lisp.dir/build.make CMakeFiles/geometry_msgs_generate_messages_lisp.dir/depend
  952. cd /home/kmanivannan/hmi/knowrob_ws/build/json_prolog && /usr/bin/cmake -E cmake_depends "Unix Makefiles" /home/kmanivannan/hmi/knowrob_ws/src/knowrob/json_prolog /home/kmanivannan/hmi/knowrob_ws/src/knowrob/json_prolog /home/kmanivannan/hmi/knowrob_ws/build/json_prolog /home/kmanivannan/hmi/knowrob_ws/build/json_prolog /home/kmanivannan/hmi/knowrob_ws/build/json_prolog/CMakeFiles/std_msgs_generate_messages_py.dir/DependInfo.cmake --color=
  953. make[2]: Entering directory '/home/kmanivannan/hmi/knowrob_ws/build/json_prolog'
  954. cd /home/kmanivannan/hmi/knowrob_ws/build/json_prolog && /usr/bin/cmake -E cmake_depends "Unix Makefiles" /home/kmanivannan/hmi/knowrob_ws/src/knowrob/json_prolog /home/kmanivannan/hmi/knowrob_ws/src/knowrob/json_prolog /home/kmanivannan/hmi/knowrob_ws/build/json_prolog /home/kmanivannan/hmi/knowrob_ws/build/json_prolog /home/kmanivannan/hmi/knowrob_ws/build/json_prolog/CMakeFiles/json_prolog_msgs_generate_messages_cpp.dir/DependInfo.cmake --color=
  955. make[2]: Entering directory '/home/kmanivannan/hmi/knowrob_ws/build/json_prolog'
  956. cd /home/kmanivannan/hmi/knowrob_ws/build/json_prolog && /usr/bin/cmake -E cmake_depends "Unix Makefiles" /home/kmanivannan/hmi/knowrob_ws/src/knowrob/json_prolog /home/kmanivannan/hmi/knowrob_ws/src/knowrob/json_prolog /home/kmanivannan/hmi/knowrob_ws/build/json_prolog /home/kmanivannan/hmi/knowrob_ws/build/json_prolog /home/kmanivannan/hmi/knowrob_ws/build/json_prolog/CMakeFiles/geometry_msgs_generate_messages_lisp.dir/DependInfo.cmake --color=
  957. Dependee "/home/kmanivannan/hmi/knowrob_ws/build/json_prolog/CMakeFiles/geometry_msgs_generate_messages_lisp.dir/DependInfo.cmake" is newer than depender "/home/kmanivannan/hmi/knowrob_ws/build/json_prolog/CMakeFiles/geometry_msgs_generate_messages_lisp.dir/depend.internal".
  958. Dependee "/home/kmanivannan/hmi/knowrob_ws/build/json_prolog/CMakeFiles/CMakeDirectoryInformation.cmake" is newer than depender "/home/kmanivannan/hmi/knowrob_ws/build/json_prolog/CMakeFiles/geometry_msgs_generate_messages_lisp.dir/depend.internal".
  959. Scanning dependencies of target geometry_msgs_generate_messages_lisp
  960. make[2]: Leaving directory '/home/kmanivannan/hmi/knowrob_ws/build/json_prolog'
  961. /usr/bin/make -f CMakeFiles/geometry_msgs_generate_messages_lisp.dir/build.make CMakeFiles/geometry_msgs_generate_messages_lisp.dir/build
  962. Dependee "/home/kmanivannan/hmi/knowrob_ws/build/json_prolog/CMakeFiles/json_prolog_msgs_generate_messages_cpp.dir/DependInfo.cmake" is newer than depender "/home/kmanivannan/hmi/knowrob_ws/build/json_prolog/CMakeFiles/json_prolog_msgs_generate_messages_cpp.dir/depend.internal".
  963. Dependee "/home/kmanivannan/hmi/knowrob_ws/build/json_prolog/CMakeFiles/CMakeDirectoryInformation.cmake" is newer than depender "/home/kmanivannan/hmi/knowrob_ws/build/json_prolog/CMakeFiles/json_prolog_msgs_generate_messages_cpp.dir/depend.internal".
  964. Scanning dependencies of target json_prolog_msgs_generate_messages_cpp
  965. make[2]: Leaving directory '/home/kmanivannan/hmi/knowrob_ws/build/json_prolog'
  966. /usr/bin/make -f CMakeFiles/json_prolog_msgs_generate_messages_cpp.dir/build.make CMakeFiles/json_prolog_msgs_generate_messages_cpp.dir/build
  967. Dependee "/home/kmanivannan/hmi/knowrob_ws/build/json_prolog/CMakeFiles/std_msgs_generate_messages_py.dir/DependInfo.cmake" is newer than depender "/home/kmanivannan/hmi/knowrob_ws/build/json_prolog/CMakeFiles/std_msgs_generate_messages_py.dir/depend.internal".
  968. Dependee "/home/kmanivannan/hmi/knowrob_ws/build/json_prolog/CMakeFiles/CMakeDirectoryInformation.cmake" is newer than depender "/home/kmanivannan/hmi/knowrob_ws/build/json_prolog/CMakeFiles/std_msgs_generate_messages_py.dir/depend.internal".
  969. Scanning dependencies of target std_msgs_generate_messages_py
  970. make[2]: Entering directory '/home/kmanivannan/hmi/knowrob_ws/build/json_prolog'
  971. make[2]: Nothing to be done for 'CMakeFiles/geometry_msgs_generate_messages_lisp.dir/build'.
  972. make[2]: Leaving directory '/home/kmanivannan/hmi/knowrob_ws/build/json_prolog'
  973. make[2]: Entering directory '/home/kmanivannan/hmi/knowrob_ws/build/json_prolog'
  974. make[2]: Nothing to be done for 'CMakeFiles/json_prolog_msgs_generate_messages_cpp.dir/build'.
  975. make[2]: Leaving directory '/home/kmanivannan/hmi/knowrob_ws/build/json_prolog'
  976. make[2]: Leaving directory '/home/kmanivannan/hmi/knowrob_ws/build/json_prolog'
  977. Dependee "/home/kmanivannan/hmi/knowrob_ws/build/json_prolog/CMakeFiles/geometry_msgs_generate_messages_eus.dir/DependInfo.cmake" is newer than depender "/home/kmanivannan/hmi/knowrob_ws/build/json_prolog/CMakeFiles/geometry_msgs_generate_messages_eus.dir/depend.internal".
  978. Dependee "/home/kmanivannan/hmi/knowrob_ws/build/json_prolog/CMakeFiles/CMakeDirectoryInformation.cmake" is newer than depender "/home/kmanivannan/hmi/knowrob_ws/build/json_prolog/CMakeFiles/geometry_msgs_generate_messages_eus.dir/depend.internal".
  979. /usr/bin/make -f CMakeFiles/std_msgs_generate_messages_py.dir/build.make CMakeFiles/std_msgs_generate_messages_py.dir/build
  980. Scanning dependencies of target geometry_msgs_generate_messages_eus
  981. make[2]: Leaving directory '/home/kmanivannan/hmi/knowrob_ws/build/json_prolog'
  982. /usr/bin/make -f CMakeFiles/geometry_msgs_generate_messages_eus.dir/build.make CMakeFiles/geometry_msgs_generate_messages_eus.dir/build
  983. make[2]: Entering directory '/home/kmanivannan/hmi/knowrob_ws/build/json_prolog'
  984. make[2]: Nothing to be done for 'CMakeFiles/std_msgs_generate_messages_py.dir/build'.
  985. make[2]: Leaving directory '/home/kmanivannan/hmi/knowrob_ws/build/json_prolog'
  986. make[2]: Entering directory '/home/kmanivannan/hmi/knowrob_ws/build/json_prolog'
  987. make[2]: Nothing to be done for 'CMakeFiles/geometry_msgs_generate_messages_eus.dir/build'.
  988. make[2]: Leaving directory '/home/kmanivannan/hmi/knowrob_ws/build/json_prolog'
  989. [  0%] Built target geometry_msgs_generate_messages_lisp
  990. /usr/bin/make -f CMakeFiles/std_msgs_generate_messages_lisp.dir/build.make CMakeFiles/std_msgs_generate_messages_lisp.dir/depend
  991. [  0%] Built target json_prolog_msgs_generate_messages_cpp
  992. /usr/bin/make -f CMakeFiles/json_prolog_msgs_generate_messages_nodejs.dir/build.make CMakeFiles/json_prolog_msgs_generate_messages_nodejs.dir/depend
  993. [  0%] Built target std_msgs_generate_messages_py
  994. make[2]: Entering directory '/home/kmanivannan/hmi/knowrob_ws/build/json_prolog'
  995. cd /home/kmanivannan/hmi/knowrob_ws/build/json_prolog && /usr/bin/cmake -E cmake_depends "Unix Makefiles" /home/kmanivannan/hmi/knowrob_ws/src/knowrob/json_prolog /home/kmanivannan/hmi/knowrob_ws/src/knowrob/json_prolog /home/kmanivannan/hmi/knowrob_ws/build/json_prolog /home/kmanivannan/hmi/knowrob_ws/build/json_prolog /home/kmanivannan/hmi/knowrob_ws/build/json_prolog/CMakeFiles/std_msgs_generate_messages_lisp.dir/DependInfo.cmake --color=
  996. /usr/bin/make -f CMakeFiles/std_msgs_generate_messages_cpp.dir/build.make CMakeFiles/std_msgs_generate_messages_cpp.dir/depend
  997. [  0%] Built target geometry_msgs_generate_messages_eus
  998. make[2]: Entering directory '/home/kmanivannan/hmi/knowrob_ws/build/json_prolog'
  999. cd /home/kmanivannan/hmi/knowrob_ws/build/json_prolog && /usr/bin/cmake -E cmake_depends "Unix Makefiles" /home/kmanivannan/hmi/knowrob_ws/src/knowrob/json_prolog /home/kmanivannan/hmi/knowrob_ws/src/knowrob/json_prolog /home/kmanivannan/hmi/knowrob_ws/build/json_prolog /home/kmanivannan/hmi/knowrob_ws/build/json_prolog /home/kmanivannan/hmi/knowrob_ws/build/json_prolog/CMakeFiles/json_prolog_msgs_generate_messages_nodejs.dir/DependInfo.cmake --color=
  1000. /usr/bin/make -f CMakeFiles/rosgraph_msgs_generate_messages_cpp.dir/build.make CMakeFiles/rosgraph_msgs_generate_messages_cpp.dir/depend
  1001. make[2]: Entering directory '/home/kmanivannan/hmi/knowrob_ws/build/json_prolog'
  1002. cd /home/kmanivannan/hmi/knowrob_ws/build/json_prolog && /usr/bin/cmake -E cmake_depends "Unix Makefiles" /home/kmanivannan/hmi/knowrob_ws/src/knowrob/json_prolog /home/kmanivannan/hmi/knowrob_ws/src/knowrob/json_prolog /home/kmanivannan/hmi/knowrob_ws/build/json_prolog /home/kmanivannan/hmi/knowrob_ws/build/json_prolog /home/kmanivannan/hmi/knowrob_ws/build/json_prolog/CMakeFiles/std_msgs_generate_messages_cpp.dir/DependInfo.cmake --color=
  1003. make[2]: Entering directory '/home/kmanivannan/hmi/knowrob_ws/build/json_prolog'
  1004. cd /home/kmanivannan/hmi/knowrob_ws/build/json_prolog && /usr/bin/cmake -E cmake_depends "Unix Makefiles" /home/kmanivannan/hmi/knowrob_ws/src/knowrob/json_prolog /home/kmanivannan/hmi/knowrob_ws/src/knowrob/json_prolog /home/kmanivannan/hmi/knowrob_ws/build/json_prolog /home/kmanivannan/hmi/knowrob_ws/build/json_prolog /home/kmanivannan/hmi/knowrob_ws/build/json_prolog/CMakeFiles/rosgraph_msgs_generate_messages_cpp.dir/DependInfo.cmake --color=
  1005. Dependee "/home/kmanivannan/hmi/knowrob_ws/build/json_prolog/CMakeFiles/json_prolog_msgs_generate_messages_nodejs.dir/DependInfo.cmake" is newer than depender "/home/kmanivannan/hmi/knowrob_ws/build/json_prolog/CMakeFiles/json_prolog_msgs_generate_messages_nodejs.dir/depend.internal".
  1006. Dependee "/home/kmanivannan/hmi/knowrob_ws/build/json_prolog/CMakeFiles/CMakeDirectoryInformation.cmake" is newer than depender "/home/kmanivannan/hmi/knowrob_ws/build/json_prolog/CMakeFiles/json_prolog_msgs_generate_messages_nodejs.dir/depend.internal".
  1007. Scanning dependencies of target json_prolog_msgs_generate_messages_nodejs
  1008. make[2]: Leaving directory '/home/kmanivannan/hmi/knowrob_ws/build/json_prolog'
  1009. /usr/bin/make -f CMakeFiles/json_prolog_msgs_generate_messages_nodejs.dir/build.make CMakeFiles/json_prolog_msgs_generate_messages_nodejs.dir/build
  1010. make[2]: Entering directory '/home/kmanivannan/hmi/knowrob_ws/build/json_prolog'
  1011. make[2]: Nothing to be done for 'CMakeFiles/json_prolog_msgs_generate_messages_nodejs.dir/build'.
  1012. make[2]: Leaving directory '/home/kmanivannan/hmi/knowrob_ws/build/json_prolog'
  1013. [  0%] Built target json_prolog_msgs_generate_messages_nodejs
  1014. /usr/bin/make -f CMakeFiles/geometry_msgs_generate_messages_nodejs.dir/build.make CMakeFiles/geometry_msgs_generate_messages_nodejs.dir/depend
  1015. Dependee "/home/kmanivannan/hmi/knowrob_ws/build/json_prolog/CMakeFiles/rosgraph_msgs_generate_messages_cpp.dir/DependInfo.cmake" is newer than depender "/home/kmanivannan/hmi/knowrob_ws/build/json_prolog/CMakeFiles/rosgraph_msgs_generate_messages_cpp.dir/depend.internal".
  1016. Dependee "/home/kmanivannan/hmi/knowrob_ws/build/json_prolog/CMakeFiles/CMakeDirectoryInformation.cmake" is newer than depender "/home/kmanivannan/hmi/knowrob_ws/build/json_prolog/CMakeFiles/rosgraph_msgs_generate_messages_cpp.dir/depend.internal".
  1017. Scanning dependencies of target rosgraph_msgs_generate_messages_cpp
  1018. make[2]: Leaving directory '/home/kmanivannan/hmi/knowrob_ws/build/json_prolog'
  1019. /usr/bin/make -f CMakeFiles/rosgraph_msgs_generate_messages_cpp.dir/build.make CMakeFiles/rosgraph_msgs_generate_messages_cpp.dir/build
  1020. make[2]: Entering directory '/home/kmanivannan/hmi/knowrob_ws/build/json_prolog'
  1021. cd /home/kmanivannan/hmi/knowrob_ws/build/json_prolog && /usr/bin/cmake -E cmake_depends "Unix Makefiles" /home/kmanivannan/hmi/knowrob_ws/src/knowrob/json_prolog /home/kmanivannan/hmi/knowrob_ws/src/knowrob/json_prolog /home/kmanivannan/hmi/knowrob_ws/build/json_prolog /home/kmanivannan/hmi/knowrob_ws/build/json_prolog /home/kmanivannan/hmi/knowrob_ws/build/json_prolog/CMakeFiles/geometry_msgs_generate_messages_nodejs.dir/DependInfo.cmake --color=
  1022. Dependee "/home/kmanivannan/hmi/knowrob_ws/build/json_prolog/CMakeFiles/std_msgs_generate_messages_cpp.dir/DependInfo.cmake" is newer than depender "/home/kmanivannan/hmi/knowrob_ws/build/json_prolog/CMakeFiles/std_msgs_generate_messages_cpp.dir/depend.internal".
  1023. Dependee "/home/kmanivannan/hmi/knowrob_ws/build/json_prolog/CMakeFiles/CMakeDirectoryInformation.cmake" is newer than depender "/home/kmanivannan/hmi/knowrob_ws/build/json_prolog/CMakeFiles/std_msgs_generate_messages_cpp.dir/depend.internal".
  1024. Scanning dependencies of target std_msgs_generate_messages_cpp
  1025. make[2]: Leaving directory '/home/kmanivannan/hmi/knowrob_ws/build/json_prolog'
  1026. /usr/bin/make -f CMakeFiles/std_msgs_generate_messages_cpp.dir/build.make CMakeFiles/std_msgs_generate_messages_cpp.dir/build
  1027. Dependee "/home/kmanivannan/hmi/knowrob_ws/build/json_prolog/CMakeFiles/std_msgs_generate_messages_lisp.dir/DependInfo.cmake" is newer than depender "/home/kmanivannan/hmi/knowrob_ws/build/json_prolog/CMakeFiles/std_msgs_generate_messages_lisp.dir/depend.internal".
  1028. Dependee "/home/kmanivannan/hmi/knowrob_ws/build/json_prolog/CMakeFiles/CMakeDirectoryInformation.cmake" is newer than depender "/home/kmanivannan/hmi/knowrob_ws/build/json_prolog/CMakeFiles/std_msgs_generate_messages_lisp.dir/depend.internal".
  1029. Scanning dependencies of target std_msgs_generate_messages_lisp
  1030. make[2]: Leaving directory '/home/kmanivannan/hmi/knowrob_ws/build/json_prolog'
  1031. /usr/bin/make -f CMakeFiles/std_msgs_generate_messages_lisp.dir/build.make CMakeFiles/std_msgs_generate_messages_lisp.dir/build
  1032. make[2]: Entering directory '/home/kmanivannan/hmi/knowrob_ws/build/json_prolog'
  1033. make[2]: Nothing to be done for 'CMakeFiles/rosgraph_msgs_generate_messages_cpp.dir/build'.
  1034. make[2]: Leaving directory '/home/kmanivannan/hmi/knowrob_ws/build/json_prolog'
  1035. make[2]: Entering directory '/home/kmanivannan/hmi/knowrob_ws/build/json_prolog'
  1036. make[2]: Nothing to be done for 'CMakeFiles/std_msgs_generate_messages_cpp.dir/build'.
  1037. make[2]: Leaving directory '/home/kmanivannan/hmi/knowrob_ws/build/json_prolog'
  1038. make[2]: Entering directory '/home/kmanivannan/hmi/knowrob_ws/build/json_prolog'
  1039. make[2]: Nothing to be done for 'CMakeFiles/std_msgs_generate_messages_lisp.dir/build'.
  1040. make[2]: Leaving directory '/home/kmanivannan/hmi/knowrob_ws/build/json_prolog'
  1041. Dependee "/home/kmanivannan/hmi/knowrob_ws/build/json_prolog/CMakeFiles/geometry_msgs_generate_messages_nodejs.dir/DependInfo.cmake" is newer than depender "/home/kmanivannan/hmi/knowrob_ws/build/json_prolog/CMakeFiles/geometry_msgs_generate_messages_nodejs.dir/depend.internal".
  1042. Dependee "/home/kmanivannan/hmi/knowrob_ws/build/json_prolog/CMakeFiles/CMakeDirectoryInformation.cmake" is newer than depender "/home/kmanivannan/hmi/knowrob_ws/build/json_prolog/CMakeFiles/geometry_msgs_generate_messages_nodejs.dir/depend.internal".
  1043. Scanning dependencies of target geometry_msgs_generate_messages_nodejs
  1044. /usr/bin/make -f CMakeFiles/std_msgs_generate_messages_nodejs.dir/build.make CMakeFiles/std_msgs_generate_messages_nodejs.dir/depend
  1045. make[2]: Leaving directory '/home/kmanivannan/hmi/knowrob_ws/build/json_prolog'
  1046. make[2]: Entering directory '/home/kmanivannan/hmi/knowrob_ws/build/json_prolog'
  1047. cd /home/kmanivannan/hmi/knowrob_ws/build/json_prolog && /usr/bin/cmake -E cmake_depends "Unix Makefiles" /home/kmanivannan/hmi/knowrob_ws/src/knowrob/json_prolog /home/kmanivannan/hmi/knowrob_ws/src/knowrob/json_prolog /home/kmanivannan/hmi/knowrob_ws/build/json_prolog /home/kmanivannan/hmi/knowrob_ws/build/json_prolog /home/kmanivannan/hmi/knowrob_ws/build/json_prolog/CMakeFiles/std_msgs_generate_messages_nodejs.dir/DependInfo.cmake --color=
  1048. /usr/bin/make -f CMakeFiles/geometry_msgs_generate_messages_nodejs.dir/build.make CMakeFiles/geometry_msgs_generate_messages_nodejs.dir/build
  1049. make[2]: Entering directory '/home/kmanivannan/hmi/knowrob_ws/build/json_prolog'
  1050. make[2]: Nothing to be done for 'CMakeFiles/geometry_msgs_generate_messages_nodejs.dir/build'.
  1051. make[2]: Leaving directory '/home/kmanivannan/hmi/knowrob_ws/build/json_prolog'
  1052. [  0%] Built target rosgraph_msgs_generate_messages_cpp
  1053. [  0%] Built target std_msgs_generate_messages_cpp
  1054. [  0%] Built target std_msgs_generate_messages_lisp
  1055. /usr/bin/make -f CMakeFiles/roscpp_generate_messages_lisp.dir/build.make CMakeFiles/roscpp_generate_messages_lisp.dir/depend
  1056. /usr/bin/make -f CMakeFiles/std_msgs_generate_messages_eus.dir/build.make CMakeFiles/std_msgs_generate_messages_eus.dir/depend
  1057. /usr/bin/make -f CMakeFiles/roscpp_generate_messages_eus.dir/build.make CMakeFiles/roscpp_generate_messages_eus.dir/depend
  1058. make[2]: Entering directory '/home/kmanivannan/hmi/knowrob_ws/build/json_prolog'
  1059. cd /home/kmanivannan/hmi/knowrob_ws/build/json_prolog && /usr/bin/cmake -E cmake_depends "Unix Makefiles" /home/kmanivannan/hmi/knowrob_ws/src/knowrob/json_prolog /home/kmanivannan/hmi/knowrob_ws/src/knowrob/json_prolog /home/kmanivannan/hmi/knowrob_ws/build/json_prolog /home/kmanivannan/hmi/knowrob_ws/build/json_prolog /home/kmanivannan/hmi/knowrob_ws/build/json_prolog/CMakeFiles/roscpp_generate_messages_lisp.dir/DependInfo.cmake --color=
  1060. make[2]: Entering directory '/home/kmanivannan/hmi/knowrob_ws/build/json_prolog'
  1061. cd /home/kmanivannan/hmi/knowrob_ws/build/json_prolog && /usr/bin/cmake -E cmake_depends "Unix Makefiles" /home/kmanivannan/hmi/knowrob_ws/src/knowrob/json_prolog /home/kmanivannan/hmi/knowrob_ws/src/knowrob/json_prolog /home/kmanivannan/hmi/knowrob_ws/build/json_prolog /home/kmanivannan/hmi/knowrob_ws/build/json_prolog /home/kmanivannan/hmi/knowrob_ws/build/json_prolog/CMakeFiles/std_msgs_generate_messages_eus.dir/DependInfo.cmake --color=
  1062. [  0%] Built target geometry_msgs_generate_messages_nodejs
  1063. /usr/bin/make -f CMakeFiles/rosgraph_msgs_generate_messages_py.dir/build.make CMakeFiles/rosgraph_msgs_generate_messages_py.dir/depend
  1064. make[2]: Entering directory '/home/kmanivannan/hmi/knowrob_ws/build/json_prolog'
  1065. cd /home/kmanivannan/hmi/knowrob_ws/build/json_prolog && /usr/bin/cmake -E cmake_depends "Unix Makefiles" /home/kmanivannan/hmi/knowrob_ws/src/knowrob/json_prolog /home/kmanivannan/hmi/knowrob_ws/src/knowrob/json_prolog /home/kmanivannan/hmi/knowrob_ws/build/json_prolog /home/kmanivannan/hmi/knowrob_ws/build/json_prolog /home/kmanivannan/hmi/knowrob_ws/build/json_prolog/CMakeFiles/roscpp_generate_messages_eus.dir/DependInfo.cmake --color=
  1066. make[2]: Entering directory '/home/kmanivannan/hmi/knowrob_ws/build/json_prolog'
  1067. cd /home/kmanivannan/hmi/knowrob_ws/build/json_prolog && /usr/bin/cmake -E cmake_depends "Unix Makefiles" /home/kmanivannan/hmi/knowrob_ws/src/knowrob/json_prolog /home/kmanivannan/hmi/knowrob_ws/src/knowrob/json_prolog /home/kmanivannan/hmi/knowrob_ws/build/json_prolog /home/kmanivannan/hmi/knowrob_ws/build/json_prolog /home/kmanivannan/hmi/knowrob_ws/build/json_prolog/CMakeFiles/rosgraph_msgs_generate_messages_py.dir/DependInfo.cmake --color=
  1068. Dependee "/home/kmanivannan/hmi/knowrob_ws/build/json_prolog/CMakeFiles/std_msgs_generate_messages_nodejs.dir/DependInfo.cmake" is newer than depender "/home/kmanivannan/hmi/knowrob_ws/build/json_prolog/CMakeFiles/std_msgs_generate_messages_nodejs.dir/depend.internal".
  1069. Dependee "/home/kmanivannan/hmi/knowrob_ws/build/json_prolog/CMakeFiles/CMakeDirectoryInformation.cmake" is newer than depender "/home/kmanivannan/hmi/knowrob_ws/build/json_prolog/CMakeFiles/std_msgs_generate_messages_nodejs.dir/depend.internal".
  1070. Scanning dependencies of target std_msgs_generate_messages_nodejs
  1071. make[2]: Leaving directory '/home/kmanivannan/hmi/knowrob_ws/build/json_prolog'
  1072. /usr/bin/make -f CMakeFiles/std_msgs_generate_messages_nodejs.dir/build.make CMakeFiles/std_msgs_generate_messages_nodejs.dir/build
  1073. Dependee "/home/kmanivannan/hmi/knowrob_ws/build/json_prolog/CMakeFiles/roscpp_generate_messages_lisp.dir/DependInfo.cmake" is newer than depender "/home/kmanivannan/hmi/knowrob_ws/build/json_prolog/CMakeFiles/roscpp_generate_messages_lisp.dir/depend.internal".
  1074. Dependee "/home/kmanivannan/hmi/knowrob_ws/build/json_prolog/CMakeFiles/rosgraph_msgs_generate_messages_py.dir/DependInfo.cmake" is newer than depender "/home/kmanivannan/hmi/knowrob_ws/build/json_prolog/CMakeFiles/rosgraph_msgs_generate_messages_py.dir/depend.internal".
  1075. Dependee "/home/kmanivannan/hmi/knowrob_ws/build/json_prolog/CMakeFiles/CMakeDirectoryInformation.cmake" is newer than depender "/home/kmanivannan/hmi/knowrob_ws/build/json_prolog/CMakeFiles/rosgraph_msgs_generate_messages_py.dir/depend.internal".
  1076. Scanning dependencies of target rosgraph_msgs_generate_messages_py
  1077. Dependee "/home/kmanivannan/hmi/knowrob_ws/build/json_prolog/CMakeFiles/CMakeDirectoryInformation.cmake" is newer than depender "/home/kmanivannan/hmi/knowrob_ws/build/json_prolog/CMakeFiles/roscpp_generate_messages_lisp.dir/depend.internal".
  1078. Scanning dependencies of target roscpp_generate_messages_lisp
  1079. Dependee "/home/kmanivannan/hmi/knowrob_ws/build/json_prolog/CMakeFiles/std_msgs_generate_messages_eus.dir/DependInfo.cmake" is newer than depender "/home/kmanivannan/hmi/knowrob_ws/build/json_prolog/CMakeFiles/std_msgs_generate_messages_eus.dir/depend.internal".
  1080. Dependee "/home/kmanivannan/hmi/knowrob_ws/build/json_prolog/CMakeFiles/CMakeDirectoryInformation.cmake" is newer than depender "/home/kmanivannan/hmi/knowrob_ws/build/json_prolog/CMakeFiles/std_msgs_generate_messages_eus.dir/depend.internal".
  1081. Scanning dependencies of target std_msgs_generate_messages_eus
  1082. make[2]: Leaving directory '/home/kmanivannan/hmi/knowrob_ws/build/json_prolog'
  1083. make[2]: Leaving directory '/home/kmanivannan/hmi/knowrob_ws/build/json_prolog'
  1084. /usr/bin/make -f CMakeFiles/roscpp_generate_messages_lisp.dir/build.make CMakeFiles/roscpp_generate_messages_lisp.dir/build
  1085. /usr/bin/make -f CMakeFiles/std_msgs_generate_messages_eus.dir/build.make CMakeFiles/std_msgs_generate_messages_eus.dir/build
  1086. make[2]: Entering directory '/home/kmanivannan/hmi/knowrob_ws/build/json_prolog'
  1087. make[2]: Nothing to be done for 'CMakeFiles/std_msgs_generate_messages_nodejs.dir/build'.
  1088. make[2]: Leaving directory '/home/kmanivannan/hmi/knowrob_ws/build/json_prolog'
  1089. make[2]: Entering directory '/home/kmanivannan/hmi/knowrob_ws/build/json_prolog'
  1090. make[2]: Nothing to be done for 'CMakeFiles/roscpp_generate_messages_lisp.dir/build'.
  1091. make[2]: Leaving directory '/home/kmanivannan/hmi/knowrob_ws/build/json_prolog'
  1092. make[2]: Entering directory '/home/kmanivannan/hmi/knowrob_ws/build/json_prolog'
  1093. make[2]: Nothing to be done for 'CMakeFiles/std_msgs_generate_messages_eus.dir/build'.
  1094. make[2]: Leaving directory '/home/kmanivannan/hmi/knowrob_ws/build/json_prolog'
  1095. Dependee "/home/kmanivannan/hmi/knowrob_ws/build/json_prolog/CMakeFiles/roscpp_generate_messages_eus.dir/DependInfo.cmake" is newer than depender "/home/kmanivannan/hmi/knowrob_ws/build/json_prolog/CMakeFiles/roscpp_generate_messages_eus.dir/depend.internal".
  1096. Dependee "/home/kmanivannan/hmi/knowrob_ws/build/json_prolog/CMakeFiles/CMakeDirectoryInformation.cmake" is newer than depender "/home/kmanivannan/hmi/knowrob_ws/build/json_prolog/CMakeFiles/roscpp_generate_messages_eus.dir/depend.internal".
  1097. Scanning dependencies of target roscpp_generate_messages_eus
  1098. make[2]: Leaving directory '/home/kmanivannan/hmi/knowrob_ws/build/json_prolog'
  1099. /usr/bin/make -f CMakeFiles/roscpp_generate_messages_eus.dir/build.make CMakeFiles/roscpp_generate_messages_eus.dir/build
  1100. [  0%] Built target std_msgs_generate_messages_eus
  1101. make[2]: Leaving directory '/home/kmanivannan/hmi/knowrob_ws/build/json_prolog'
  1102. /usr/bin/make -f CMakeFiles/rosgraph_msgs_generate_messages_lisp.dir/build.make CMakeFiles/rosgraph_msgs_generate_messages_lisp.dir/depend
  1103. /usr/bin/make -f CMakeFiles/rosgraph_msgs_generate_messages_py.dir/build.make CMakeFiles/rosgraph_msgs_generate_messages_py.dir/build
  1104. make[2]: Entering directory '/home/kmanivannan/hmi/knowrob_ws/build/json_prolog'
  1105. cd /home/kmanivannan/hmi/knowrob_ws/build/json_prolog && /usr/bin/cmake -E cmake_depends "Unix Makefiles" /home/kmanivannan/hmi/knowrob_ws/src/knowrob/json_prolog /home/kmanivannan/hmi/knowrob_ws/src/knowrob/json_prolog /home/kmanivannan/hmi/knowrob_ws/build/json_prolog /home/kmanivannan/hmi/knowrob_ws/build/json_prolog /home/kmanivannan/hmi/knowrob_ws/build/json_prolog/CMakeFiles/rosgraph_msgs_generate_messages_lisp.dir/DependInfo.cmake --color=
  1106. make[2]: Entering directory '/home/kmanivannan/hmi/knowrob_ws/build/json_prolog'
  1107. make[2]: Nothing to be done for 'CMakeFiles/roscpp_generate_messages_eus.dir/build'.
  1108. make[2]: Leaving directory '/home/kmanivannan/hmi/knowrob_ws/build/json_prolog'
  1109. [  0%] Built target roscpp_generate_messages_lisp
  1110. make[2]: Entering directory '/home/kmanivannan/hmi/knowrob_ws/build/json_prolog'
  1111. make[2]: Nothing to be done for 'CMakeFiles/rosgraph_msgs_generate_messages_py.dir/build'.
  1112. make[2]: Leaving directory '/home/kmanivannan/hmi/knowrob_ws/build/json_prolog'
  1113. [  0%] Built target std_msgs_generate_messages_nodejs
  1114. /usr/bin/make -f CMakeFiles/roscpp_generate_messages_nodejs.dir/build.make CMakeFiles/roscpp_generate_messages_nodejs.dir/depend
  1115. /usr/bin/make -f CMakeFiles/roscpp_generate_messages_py.dir/build.make CMakeFiles/roscpp_generate_messages_py.dir/depend
  1116. make[2]: Entering directory '/home/kmanivannan/hmi/knowrob_ws/build/json_prolog'
  1117. cd /home/kmanivannan/hmi/knowrob_ws/build/json_prolog && /usr/bin/cmake -E cmake_depends "Unix Makefiles" /home/kmanivannan/hmi/knowrob_ws/src/knowrob/json_prolog /home/kmanivannan/hmi/knowrob_ws/src/knowrob/json_prolog /home/kmanivannan/hmi/knowrob_ws/build/json_prolog /home/kmanivannan/hmi/knowrob_ws/build/json_prolog /home/kmanivannan/hmi/knowrob_ws/build/json_prolog/CMakeFiles/roscpp_generate_messages_nodejs.dir/DependInfo.cmake --color=
  1118. make[2]: Entering directory '/home/kmanivannan/hmi/knowrob_ws/build/json_prolog'
  1119. cd /home/kmanivannan/hmi/knowrob_ws/build/json_prolog && /usr/bin/cmake -E cmake_depends "Unix Makefiles" /home/kmanivannan/hmi/knowrob_ws/src/knowrob/json_prolog /home/kmanivannan/hmi/knowrob_ws/src/knowrob/json_prolog /home/kmanivannan/hmi/knowrob_ws/build/json_prolog /home/kmanivannan/hmi/knowrob_ws/build/json_prolog /home/kmanivannan/hmi/knowrob_ws/build/json_prolog/CMakeFiles/roscpp_generate_messages_py.dir/DependInfo.cmake --color=
  1120. Dependee "/home/kmanivannan/hmi/knowrob_ws/build/json_prolog/CMakeFiles/rosgraph_msgs_generate_messages_lisp.dir/DependInfo.cmake" is newer than depender "/home/kmanivannan/hmi/knowrob_ws/build/json_prolog/CMakeFiles/rosgraph_msgs_generate_messages_lisp.dir/depend.internal".
  1121. Dependee "/home/kmanivannan/hmi/knowrob_ws/build/json_prolog/CMakeFiles/CMakeDirectoryInformation.cmake" is newer than depender "/home/kmanivannan/hmi/knowrob_ws/build/json_prolog/CMakeFiles/rosgraph_msgs_generate_messages_lisp.dir/depend.internal".
  1122. Scanning dependencies of target rosgraph_msgs_generate_messages_lisp
  1123. make[2]: Leaving directory '/home/kmanivannan/hmi/knowrob_ws/build/json_prolog'
  1124. /usr/bin/make -f CMakeFiles/rosgraph_msgs_generate_messages_lisp.dir/build.make CMakeFiles/rosgraph_msgs_generate_messages_lisp.dir/build
  1125. make[2]: Entering directory '/home/kmanivannan/hmi/knowrob_ws/build/json_prolog'
  1126. make[2]: Nothing to be done for 'CMakeFiles/rosgraph_msgs_generate_messages_lisp.dir/build'.
  1127. make[2]: Leaving directory '/home/kmanivannan/hmi/knowrob_ws/build/json_prolog'
  1128. Dependee "/home/kmanivannan/hmi/knowrob_ws/build/json_prolog/CMakeFiles/roscpp_generate_messages_nodejs.dir/DependInfo.cmake" is newer than depender "/home/kmanivannan/hmi/knowrob_ws/build/json_prolog/CMakeFiles/roscpp_generate_messages_nodejs.dir/depend.internal".
  1129. Dependee "/home/kmanivannan/hmi/knowrob_ws/build/json_prolog/CMakeFiles/CMakeDirectoryInformation.cmake" is newer than depender "/home/kmanivannan/hmi/knowrob_ws/build/json_prolog/CMakeFiles/roscpp_generate_messages_nodejs.dir/depend.internal".
  1130. Scanning dependencies of target roscpp_generate_messages_nodejs
  1131. [  0%] Built target roscpp_generate_messages_eus
  1132. [  0%] Built target rosgraph_msgs_generate_messages_py
  1133. /usr/bin/make -f CMakeFiles/gradle-json_prolog.dir/build.make CMakeFiles/gradle-json_prolog.dir/depend
  1134. make[2]: Leaving directory '/home/kmanivannan/hmi/knowrob_ws/build/json_prolog'
  1135. /usr/bin/make -f CMakeFiles/roscpp_generate_messages_nodejs.dir/build.make CMakeFiles/roscpp_generate_messages_nodejs.dir/build
  1136. make[2]: Entering directory '/home/kmanivannan/hmi/knowrob_ws/build/json_prolog'
  1137. cd /home/kmanivannan/hmi/knowrob_ws/build/json_prolog && /usr/bin/cmake -E cmake_depends "Unix Makefiles" /home/kmanivannan/hmi/knowrob_ws/src/knowrob/json_prolog /home/kmanivannan/hmi/knowrob_ws/src/knowrob/json_prolog /home/kmanivannan/hmi/knowrob_ws/build/json_prolog /home/kmanivannan/hmi/knowrob_ws/build/json_prolog /home/kmanivannan/hmi/knowrob_ws/build/json_prolog/CMakeFiles/gradle-json_prolog.dir/DependInfo.cmake --color=
  1138. make[2]: Entering directory '/home/kmanivannan/hmi/knowrob_ws/build/json_prolog'
  1139. make[2]: Nothing to be done for 'CMakeFiles/roscpp_generate_messages_nodejs.dir/build'.
  1140. make[2]: Leaving directory '/home/kmanivannan/hmi/knowrob_ws/build/json_prolog'
  1141. [  0%] Built target rosgraph_msgs_generate_messages_lisp
  1142. Dependee "/home/kmanivannan/hmi/knowrob_ws/build/json_prolog/CMakeFiles/roscpp_generate_messages_py.dir/DependInfo.cmake" is newer than depender "/home/kmanivannan/hmi/knowrob_ws/build/json_prolog/CMakeFiles/roscpp_generate_messages_py.dir/depend.internal".
  1143. Dependee "/home/kmanivannan/hmi/knowrob_ws/build/json_prolog/CMakeFiles/CMakeDirectoryInformation.cmake" is newer than depender "/home/kmanivannan/hmi/knowrob_ws/build/json_prolog/CMakeFiles/roscpp_generate_messages_py.dir/depend.internal".
  1144. Scanning dependencies of target roscpp_generate_messages_py
  1145. Dependee "/home/kmanivannan/hmi/knowrob_ws/build/json_prolog/CMakeFiles/gradle-json_prolog.dir/DependInfo.cmake" is newer than depender "/home/kmanivannan/hmi/knowrob_ws/build/json_prolog/CMakeFiles/gradle-json_prolog.dir/depend.internal".
  1146. Dependee "/home/kmanivannan/hmi/knowrob_ws/build/json_prolog/CMakeFiles/CMakeDirectoryInformation.cmake" is newer than depender "/home/kmanivannan/hmi/knowrob_ws/build/json_prolog/CMakeFiles/gradle-json_prolog.dir/depend.internal".
  1147. Scanning dependencies of target gradle-json_prolog
  1148. [  0%] Built target roscpp_generate_messages_nodejs
  1149. make[2]: Leaving directory '/home/kmanivannan/hmi/knowrob_ws/build/json_prolog'
  1150. make[2]: Leaving directory '/home/kmanivannan/hmi/knowrob_ws/build/json_prolog'
  1151. /usr/bin/make -f CMakeFiles/gradle-json_prolog.dir/build.make CMakeFiles/gradle-json_prolog.dir/build
  1152. /usr/bin/make -f CMakeFiles/roscpp_generate_messages_py.dir/build.make CMakeFiles/roscpp_generate_messages_py.dir/build
  1153. make[2]: Entering directory '/home/kmanivannan/hmi/knowrob_ws/build/json_prolog'
  1154. make[2]: Nothing to be done for 'CMakeFiles/roscpp_generate_messages_py.dir/build'.
  1155. make[2]: Leaving directory '/home/kmanivannan/hmi/knowrob_ws/build/json_prolog'
  1156. make[2]: Entering directory '/home/kmanivannan/hmi/knowrob_ws/build/json_prolog'
  1157. [  0%] Built target roscpp_generate_messages_py
  1158. /usr/bin/make -f CMakeFiles/json_prolog.dir/build.make CMakeFiles/json_prolog.dir/depend
  1159. make[2]: Entering directory '/home/kmanivannan/hmi/knowrob_ws/build/json_prolog'
  1160. cd /home/kmanivannan/hmi/knowrob_ws/build/json_prolog && /usr/bin/cmake -E cmake_depends "Unix Makefiles" /home/kmanivannan/hmi/knowrob_ws/src/knowrob/json_prolog /home/kmanivannan/hmi/knowrob_ws/src/knowrob/json_prolog /home/kmanivannan/hmi/knowrob_ws/build/json_prolog /home/kmanivannan/hmi/knowrob_ws/build/json_prolog /home/kmanivannan/hmi/knowrob_ws/build/json_prolog/CMakeFiles/json_prolog.dir/DependInfo.cmake --color=
  1161. [ 10%] Gradling tasks for json_prolog
  1162. cd /home/kmanivannan/hmi/knowrob_ws/src/knowrob/json_prolog && ROS_MAVEN_REPOSITORY=https://github.com/rosjava/rosjava_mvn_repo/raw/master /home/kmanivannan/hmi/knowrob_ws/build/json_prolog/catkin_generated/env_cached.sh /home/kmanivannan/hmi/knowrob_ws/src/knowrob/json_prolog/gradlew -q installDist publishMavenJavaPublicationToMavenRepository writeClasspath
  1163. Dependee "/home/kmanivannan/hmi/knowrob_ws/build/json_prolog/CMakeFiles/json_prolog.dir/DependInfo.cmake" is newer than depender "/home/kmanivannan/hmi/knowrob_ws/build/json_prolog/CMakeFiles/json_prolog.dir/depend.internal".
  1164. Dependee "/home/kmanivannan/hmi/knowrob_ws/build/json_prolog/CMakeFiles/CMakeDirectoryInformation.cmake" is newer than depender "/home/kmanivannan/hmi/knowrob_ws/build/json_prolog/CMakeFiles/json_prolog.dir/depend.internal".
  1165. Scanning dependencies of target json_prolog
  1166. make[2]: Leaving directory '/home/kmanivannan/hmi/knowrob_ws/build/json_prolog'
  1167. /usr/bin/make -f CMakeFiles/json_prolog.dir/build.make CMakeFiles/json_prolog.dir/build
  1168. make[2]: Entering directory '/home/kmanivannan/hmi/knowrob_ws/build/json_prolog'
  1169. [ 20%] Building CXX object CMakeFiles/json_prolog.dir/src/prolog_value.cpp.o
  1170. [ 30%] Building CXX object CMakeFiles/json_prolog.dir/src/prolog_bindings.cpp.o
  1171. /usr/bin/c++   -DROSCONSOLE_BACKEND_LOG4CXX -DROS_PACKAGE_NAME=\"json_prolog\" -Djson_prolog_EXPORTS -I/usr/lib/swi-prolog/include -I/home/kmanivannan/hmi/knowrob_ws/src/knowrob/json_prolog/include -I/home/kmanivannan/hmi/knowrob_ws/devel/.private/json_prolog_msgs/include -I/home/kmanivannan/hmi/knowrob_ws/src/knowrob/rosprolog/include -I/opt/ros/kinetic/include -I/opt/ros/kinetic/share/xmlrpcpp/cmake/../../../include/xmlrpcpp  -fPIC   -pthread -I/usr/include/json-glib-1.0 -I/usr/include/glib-2.0 -I/usr/lib/x86_64-linux-gnu/glib-2.0/include -o CMakeFiles/json_prolog.dir/src/prolog_value.cpp.o -c /home/kmanivannan/hmi/knowrob_ws/src/knowrob/json_prolog/src/prolog_value.cpp
  1172. /usr/bin/c++   -DROSCONSOLE_BACKEND_LOG4CXX -DROS_PACKAGE_NAME=\"json_prolog\" -Djson_prolog_EXPORTS -I/usr/lib/swi-prolog/include -I/home/kmanivannan/hmi/knowrob_ws/src/knowrob/json_prolog/include -I/home/kmanivannan/hmi/knowrob_ws/devel/.private/json_prolog_msgs/include -I/home/kmanivannan/hmi/knowrob_ws/src/knowrob/rosprolog/include -I/opt/ros/kinetic/include -I/opt/ros/kinetic/share/xmlrpcpp/cmake/../../../include/xmlrpcpp  -fPIC   -pthread -I/usr/include/json-glib-1.0 -I/usr/include/glib-2.0 -I/usr/lib/x86_64-linux-gnu/glib-2.0/include -o CMakeFiles/json_prolog.dir/src/prolog_bindings.cpp.o -c /home/kmanivannan/hmi/knowrob_ws/src/knowrob/json_prolog/src/prolog_bindings.cpp
  1173. [ 40%] Building CXX object CMakeFiles/json_prolog.dir/src/prolog.cpp.o
  1174. /usr/bin/c++   -DROSCONSOLE_BACKEND_LOG4CXX -DROS_PACKAGE_NAME=\"json_prolog\" -Djson_prolog_EXPORTS -I/usr/lib/swi-prolog/include -I/home/kmanivannan/hmi/knowrob_ws/src/knowrob/json_prolog/include -I/home/kmanivannan/hmi/knowrob_ws/devel/.private/json_prolog_msgs/include -I/home/kmanivannan/hmi/knowrob_ws/src/knowrob/rosprolog/include -I/opt/ros/kinetic/include -I/opt/ros/kinetic/share/xmlrpcpp/cmake/../../../include/xmlrpcpp  -fPIC   -pthread -I/usr/include/json-glib-1.0 -I/usr/include/glib-2.0 -I/usr/lib/x86_64-linux-gnu/glib-2.0/include -o CMakeFiles/json_prolog.dir/src/prolog.cpp.o -c /home/kmanivannan/hmi/knowrob_ws/src/knowrob/json_prolog/src/prolog.cpp
  1175. [ 50%] Building CXX object CMakeFiles/json_prolog.dir/src/prolog_query_proxy.cpp.o
  1176. /usr/bin/c++   -DROSCONSOLE_BACKEND_LOG4CXX -DROS_PACKAGE_NAME=\"json_prolog\" -Djson_prolog_EXPORTS -I/usr/lib/swi-prolog/include -I/home/kmanivannan/hmi/knowrob_ws/src/knowrob/json_prolog/include -I/home/kmanivannan/hmi/knowrob_ws/devel/.private/json_prolog_msgs/include -I/home/kmanivannan/hmi/knowrob_ws/src/knowrob/rosprolog/include -I/opt/ros/kinetic/include -I/opt/ros/kinetic/share/xmlrpcpp/cmake/../../../include/xmlrpcpp  -fPIC   -pthread -I/usr/include/json-glib-1.0 -I/usr/include/glib-2.0 -I/usr/lib/x86_64-linux-gnu/glib-2.0/include -o CMakeFiles/json_prolog.dir/src/prolog_query_proxy.cpp.o -c /home/kmanivannan/hmi/knowrob_ws/src/knowrob/json_prolog/src/prolog_query_proxy.cpp
  1177. /home/kmanivannan/hmi/knowrob_ws/src/knowrob/json_prolog/src/prolog_bindings.cpp: In constructor ‘json_prolog::detail::InitJsonGlib::InitJsonGlib()’:
  1178. /home/kmanivannan/hmi/knowrob_ws/src/knowrob/json_prolog/src/prolog_bindings.cpp:45:5: warning: ‘void g_type_init()’ is deprecated [-Wdeprecated-declarations]
  1179.     g_type_init();
  1180.     ^
  1181. In file included from /usr/include/glib-2.0/gobject/gobject.h:24:0,
  1182.                 from /usr/include/glib-2.0/gobject/gbinding.h:29,
  1183.                 from /usr/include/glib-2.0/glib-object.h:23,
  1184.                 from /usr/include/json-glib-1.0/json-glib/json-types.h:31,
  1185.                 from /usr/include/json-glib-1.0/json-glib/json-glib.h:29,
  1186.                 from /home/kmanivannan/hmi/knowrob_ws/src/knowrob/json_prolog/src/prolog_bindings.cpp:30:
  1187. /usr/include/glib-2.0/gobject/gtype.h:681:23: note: declared here
  1188. void                  g_type_init                    (void);
  1189.                       ^
  1190. /home/kmanivannan/hmi/knowrob_ws/src/knowrob/json_prolog/src/prolog_bindings.cpp:45:5: warning: ‘void g_type_init()’ is deprecated [-Wdeprecated-declarations]
  1191.     g_type_init();
  1192.     ^
  1193. In file included from /usr/include/glib-2.0/gobject/gobject.h:24:0,
  1194.                 from /usr/include/glib-2.0/gobject/gbinding.h:29,
  1195.                 from /usr/include/glib-2.0/glib-object.h:23,
  1196.                 from /usr/include/json-glib-1.0/json-glib/json-types.h:31,
  1197.                 from /usr/include/json-glib-1.0/json-glib/json-glib.h:29,
  1198.                 from /home/kmanivannan/hmi/knowrob_ws/src/knowrob/json_prolog/src/prolog_bindings.cpp:30:
  1199. /usr/include/glib-2.0/gobject/gtype.h:681:23: note: declared here
  1200. void                  g_type_init                    (void);
  1201.                       ^
  1202. /home/kmanivannan/hmi/knowrob_ws/src/knowrob/json_prolog/src/prolog_bindings.cpp:45:17: warning: ‘void g_type_init()’ is deprecated [-Wdeprecated-declarations]
  1203.     g_type_init();
  1204.                 ^
  1205. In file included from /usr/include/glib-2.0/gobject/gobject.h:24:0,
  1206.                 from /usr/include/glib-2.0/gobject/gbinding.h:29,
  1207.                 from /usr/include/glib-2.0/glib-object.h:23,
  1208.                 from /usr/include/json-glib-1.0/json-glib/json-types.h:31,
  1209.                 from /usr/include/json-glib-1.0/json-glib/json-glib.h:29,
  1210.                 from /home/kmanivannan/hmi/knowrob_ws/src/knowrob/json_prolog/src/prolog_bindings.cpp:30:
  1211. /usr/include/glib-2.0/gobject/gtype.h:681:23: note: declared here
  1212. void                  g_type_init                    (void);
  1213.                       ^
  1214. <-------------> 0% EXECUTING [1s]
  1215. > :json_prolog_msgs:generateSources > Resolve files of :json_prolog_msgs:runtime
  1216. [ 60%] Linking CXX shared library /home/kmanivannan/hmi/knowrob_ws/devel/.private/json_prolog/lib/libjson_prolog.so
  1217. /usr/bin/cmake -E cmake_link_script CMakeFiles/json_prolog.dir/link.txt --verbose=1
  1218. /usr/bin/c++  -fPIC   -shared -Wl,-soname,libjson_prolog.so -o /home/kmanivannan/hmi/knowrob_ws/devel/.private/json_prolog/lib/libjson_prolog.so CMakeFiles/json_prolog.dir/src/prolog.cpp.o CMakeFiles/json_prolog.dir/src/prolog_query_proxy.cpp.o CMakeFiles/json_prolog.dir/src/prolog_bindings.cpp.o CMakeFiles/json_prolog.dir/src/prolog_value.cpp.o  -L/usr/lib/swi-prolog/lib/amd64 -ljson-glib-1.0 -lgio-2.0 -lgobject-2.0 -lglib-2.0 /home/kmanivannan/hmi/knowrob_ws/devel/.private/rosprolog/lib/librosprolog.so /opt/ros/kinetic/lib/libroslib.so /opt/ros/kinetic/lib/librospack.so -lpython2.7 -lboost_program_options -ltinyxml /opt/ros/kinetic/lib/libroscpp.so -lboost_filesystem -lboost_signals /opt/ros/kinetic/lib/librosconsole.so /opt/ros/kinetic/lib/librosconsole_log4cxx.so /opt/ros/kinetic/lib/librosconsole_backend_interface.so -llog4cxx -lboost_regex /opt/ros/kinetic/lib/libroscpp_serialization.so /opt/ros/kinetic/l<-------------> 0% EXECUTING [1s]c/lib/librostime.so /opt/ros/kinetic/lib/libcpp_common.so -lboost_system -lboost_thread -lboost_chrono -lboost_date_time -lboost_atomic -lpthread -lconsole_bridge -Wl,-rpath,/usr/lib/swi-prolog/lib/> :json_prolog_msgs:generateSources
  1219. make[2]: Leaving directory '/home/kmanivannan/hmi/knowrob_ws/build/json_prolog'
  1220. [ 60%] Built target json_prolog
  1221. /usr/bin/make -f CMakeFiles/object_positions.dir/build.make CMakeFiles/object_positions.dir/depend
  1222. /usr/bin/make -f CMakeFiles/test_json_prolog.dir/build.make CMakeFiles/test_json_prolog.dir/depend
  1223. make[2]: Entering directory '/home/kmanivannan/hmi/knowrob_ws/build/json_prolog'
  1224. cd /home/kmanivannan/hmi/knowrob_ws/build/json_prolog && /usr/bin/cmake -E cmake_depends "Unix Makefiles" /home/kmanivannan/hmi/knowrob_ws/src/knowrob/json_prolog /home/kmanivannan/hmi/knowrob_ws/src/knowrob/json_prolog /home/kmanivannan/hmi/knowrob_ws/build/json_prolog /home/kmanivannan/hmi/knowrob_ws/build/json_prolog /home/kmanivannan/hmi/knowrob_ws/build/json_prolog/CMakeFiles/object_positions.dir/DependInfo.cmake --color=
  1225. make[2]: Entering directory '/home/kmanivannan/hmi/knowrob_ws/build/json_prolog'
  1226. cd /home/kmanivannan/hmi/knowrob_ws/build/json_prolog && /usr/bin/cmake -E cmake_depends "Unix Makefiles" /home/kmanivannan/hmi/knowrob_ws/src/knowrob/json_prolog /home/kmanivannan/hmi/knowrob_ws/src/knowrob/json_prolog /home/kmanivannan/hmi/knowrob_ws/build/json_prolog /home/kmanivannan/hmi/knowrob_ws/build/json_prolog /home/kmanivannan/hmi/knowrob_ws/build/json_prolog/CMakeFiles/test_json_prolog.dir/DependInfo.cmake --color=
  1227. Dependee "/home/kmanivannan/hmi/knowrob_ws/build/json_prolog/CMakeFiles/object_positions.dir/DependInfo.cmake" is newer than depender "/home/kmanivannan/hmi/knowrob_ws/build/json_prolog/CMakeFiles/object_positions.dir/depend.internal".
  1228. <-------------> 0% EXECUTING [1s]nowrob_ws/build/json_prolog/CMakeFiles/CMakeDirectoryInformation.cmake" is newer than depender "/home/kmanivannan/hmi/knowrob_ws/build/json_prolog/CMakeFiles/object_positions.dir/depend.internal".
  1229. > :json_prolog_msgs:generateSourcesect_positions
  1230. make[2]: Leaving directory '/home/kmanivannan/hmi/knowrob_ws/build/json_prolog'
  1231. /usr/bin/make -f CMakeFiles/object_positions.dir/build.make CMakeFiles/object_positions.dir/build
  1232. Dependee "/home/kmanivannan/hmi/knowrob_ws/build/json_prolog/CMakeFiles/test_json_prolog.dir/DependInfo.cmake" is newer than depender "/home/kmanivannan/hmi/knowrob_ws/build/json_prolog/CMakeFiles/test_json_prolog.dir/depend.internal".
  1233. Dependee "/home/kmanivannan/hmi/knowrob_ws/build/json_prolog/CMakeFiles/CMakeDirectoryInformation.cmake" is newer than depender "/home/kmanivannan/hmi/knowrob_ws/build/json_prolog/CMakeFiles/test_json_prolog.dir/depend.internal".
  1234. Scanning dependencies of target test_json_prolog
  1235. make[2]: Entering directory '/home/kmanivannan/hmi/knowrob_ws/build/json_prolog'
  1236. make[2]: Leaving directory '/home/kmanivannan/hmi/knowrob_ws/build/json_prolog'
  1237. /usr/bin/make -f CMakeFiles/test_json_prolog.dir/build.make CMakeFiles/test_json_prolog.dir/build
  1238. make[2]: Entering directory '/home/kmanivannan/hmi/knowrob_ws/build/json_prolog'
  1239. [ 70%] Building CXX object CMakeFiles/object_positions.dir/examples/object_positions.cpp.o
  1240. /usr/bin/c++   -DROSCONSOLE_BACKEND_LOG4CXX -DROS_PACKAGE_NAME=\"json_prolog\" -I/usr/lib/swi-prolog/include -I/home/kmanivannan/hmi/knowrob_ws/src/knowrob/json_prolog/include -I/home/kmanivannan/hmi/knowrob_ws/devel/.private/json_prolog_msgs/include -I/home/kmanivannan/hmi/knowrob_ws/src/knowrob/rosprolog/include -I/opt/ros/kinetic/include -I/opt/ros/kinetic/share/xmlrpcpp/cmake/../../../include/xmlrpcpp  -pthread -I/usr/include/json-glib-1.0 -I/usr/include/glib-2.0 -I/usr/lib/x86_64-linux-gnu/glib-2.0/include -o CMakeFiles/object_positions.dir/examples/object_positions.cpp.o -c /home/kmanivannan/hmi/knowrob_ws/src/knowrob/json_prolog/examples/object_positions.cpp
  1241. [ 80%] Building CXX object CMakeFiles/test_json_prolog.dir/examples/test_json_prolog.cpp.o
  1242. /usr/bin/c++   -DROSCONSOLE_BACKEND_LOG4CXX -DROS_PACKAGE_NAME=\"json_prolog\" -I/usr/lib/swi-prolog/include -I/home/kmanivannan/hmi/knowrob_ws/src/knowrob/json_prolog/include -I/home/kmanivannan/hmi/knowrob_ws/devel/.private/json_<===----------> 29% EXECUTING [2s]annan/hmi/knowrob_ws/src/knowrob/rosprolog/include -I/opt/ros/kinetic/include -I/opt/ros/kinetic/share/xmlrpcpp/cmake/../../../include/xmlrpcpp  -pthread -I/usr/include/json-glib-1.0 -I/usr/include> :json_prolog:compileJava > Resolve dependencies of :json_prolog:compileClasspath
  1243. [ 90%] Linking CXX executable /home/kmanivannan/hmi/knowrob_ws/devel/.private/json_prolog/lib/json_prolog/test_json_prolog
  1244. /usr/bin/cmake -E cmake_link_script CMakeFiles/test_json_prolog.dir/link.txt --verbose=1
  1245. /usr/bin/c++      CMakeFiles/test_json_prolog.dir/examples/test_json_prolog.cpp.o  -o /home/kmanivannan/hmi/knowrob_ws/devel/.private/json_prolog/lib/json_prolog/test_json_prolog  -L/usr/lib/swi-prolog/lib/amd64 -rdynamic /home/kmanivannan/hmi/knowrob_ws/devel/.private/json_prolog/lib/libjson_prolog.so /home/kmanivannan/hmi/knowrob_ws/devel/.private/rosprolog/lib/librosprolog.so /opt/ros/kinetic/lib/libroslib.so /opt/ros/kinetic/lib/librospack.so -lpython2.7 -lboost_program_options -ltinyxml /opt/ros/kinetic/lib/libroscpp.so -lboost_filesystem -lboost_signals /opt/ros/kinetic/lib/librosconsole.so /opt/ros/kinetic/lib/librosconsole_log4cxx.so /opt/ros/kinetic/lib/librosconsole_backend_interface.so -llog4cxx -lboost_regex /opt/ros/kinetic/lib/libroscpp_serialization.so /opt/ros/kinetic/lib/libxmlrpcpp.so /opt/ros/kinetic/lib/librostime.so /opt/ros/kinetic/lib/libcpp_common.so -lboost_system -lboost_thread -lboost_chrono -lboost_date_time -lboost_atomic -lpthread -lconsole_bridge -ljson-glib-1.0 -lgio-2.0 -lgobject-2.0 -lglib-2.0 /home/kmanivannan/hmi/knowrob_ws/devel/.private/rosprolog/lib/librosprolog.so /opt/ros/kinetic/lib/libroslib.so /opt/ros/kinetic/lib/librospack.so -lpython2.7 -lboost_program_options -ltinyxml /opt/ros/kinetic/lib/libroscpp.so -lboost_filesystem -lboost_signals /opt/ros/kinetic/lib/librosconsole.so /opt/ros/kinetic/lib/librosconsole_log4cxx.so /opt/ros/kinetic/lib/librosconsole_backend_interface.so -llog4cxx -lboost_regex /opt/ros/kinetic/lib/libroscpp_serialization.so /opt/ros/kinetic/lib/libxmlrpcpp.so /opt/ros/kinetic/lib/librostime.so /opt/ros/kinetic/lib/libcpp_c<===----------> 29% EXECUTING [2s]read -lboost_chrono -lboost_date_time -lboost_atomic -lpthread -lconsole_bridge -Wl,-rpath,/usr/lib/swi-prolog/lib/amd64:/home/kmanivannan/hmi/knowrob_ws/devel/.private/json_prolog/lib:/home/kmaniv> :json_prolog:compileJava > Resolve dependencies of :json_prolog:compileClasspath > maven-metadata.xml
  1246. [100%] Linking CXX executable /home/kmanivannan/hmi/knowrob_ws/devel/.private/json_prolog/lib/json_prolog/object_positions
  1247. /usr/bin/cmake -E cmake_link_script CMakeFiles/object_positions.dir/link.txt --verbose=1
  1248. /usr/bin/c++      CMakeFiles/object_positions.dir/examples/object_positions.cpp.o  -o /home/kmanivannan/hmi/knowrob_ws/devel/.private/json_prolog/lib/json_prolog/object_positions  -L/usr/lib/swi-prolog/lib/amd64 -rdynamic /home/kmanivannan/hmi/knowrob_ws/devel/.private/json_prolog/lib/libjson_prolog.so /home/kmanivannan/hmi/knowrob_ws/devel/.private/rosprolog/lib/librosprolog.so /opt/ros/kinetic/lib/libroslib.so /opt/ros/kinetic/lib/librospack.so -lpython2.7 -lboost_program_options -ltinyxml /opt/ros/kinetic/lib/libroscpp.so -lboost_filesystem -lboost_signals /opt/ros/kinetic/lib/librosconsole.so /opt/ros/kinetic/lib/librosconsole_log4cxx.so /opt/ros/kinetic/lib/librosconsole_backend_interface.so -llog4cxx -lboost_regex /opt/ros/kinetic/lib/libroscpp_serialization.so /opt/ros/kinetic/lib/libxmlrpcpp.so /opt/ros/kinetic/lib/librostime.so /opt/ros/kinetic/lib/libcpp_common.so -lboost_system -lboost_thread -lboost_chrono -lboost_date_time -lboost_atomic -lpthread -lconsole_bridge -ljson-glib-1.0 -lgio-2.0 -lgobject-2.0 -lglib-2.0 /home/kmanivannan/hmi/knowrob_ws/devel/.private/rosprolog/lib/librosprolog.so /opt/ros/kinetic/lib/libroslib.so /opt/ros/kinetic/lib/librospack.so -lpython2.7 -lboost_program_options -ltinyxml /opt/ros/kinetic/lib/libroscpp.so -lboost_filesystem -lboost_signals /opt/ros/kinetic/lib/librosconsole.so /opt/ros/kinetic/lib/librosconsole_log4cxx.so /opt/ros/kinetic/lib/librosconsole_backend_interface.so -llog4cxx -lboost_regex /opt/ros/kinetic/lib/libroscpp_serialization.so /opt/ros/kinetic/lib/libxmlrpcpp.so /opt/ros/kinetic/lib/librostime.so /opt/ros/kinetic/lib/libcpp_c<===----------> 29% EXECUTING [2s]read -lboost_chrono -lboost_date_time -lboost_atomic -lpthread -lconsole_bridge -Wl,-rpath,/usr/lib/swi-prolog/lib/amd64:/home/kmanivannan/hmi/knowrob_ws/devel/.private/json_prolog/lib:/home/kmaniv<===----------> 29% EXECUTING [3s]ve dependencies of :json_prolog:compileClasspath
  1249. > :json_prolog:compileJava > Resolve dependencies of :json_prolog:compileClasspath > maven-metadata.xml
  1250. [100%] Built target object_positions
  1251.  
  1252. FAILURE: Build failed with an exception.
  1253.  
  1254. * What went wrong:
  1255. Could not resolve all files for configuration ':json_prolog:compileClasspath'.
  1256. > Could not find any matches for org.knowrob.knowrob_common:knowrob_common:[0.1,) as no versions of org.knowrob.knowrob_common:knowrob_common are available.
  1257.  Searched in the following locations:
  1258.    - file:/home/kmanivannan/hmi/knowrob_ws/devel/.private/json_prolog/share/maven/org/knowrob/knowrob_common/knowrob_common/maven-metadata.xml
  1259.    - file:/home/kmanivannan/hmi/knowrob_ws/devel/.private/json_prolog/share/maven/org/knowrob/knowrob_common/knowrob_common/
  1260.    - file:/home/kmanivannan/hmi/knowrob_ws/devel/share/maven/org/knowrob/knowrob_common/knowrob_common/maven-metadata.xml
  1261.    - file:/home/kmanivannan/hmi/knowrob_ws/devel/share/maven/org/knowrob/knowrob_common/knowrob_common/
  1262.    - file:/home/kmanivannan/aquanaut_ws/install/share/maven/org/knowrob/knowrob_common/knowrob_common/maven-metadata.xml
  1263.    - file:/home/kmanivannan/aquanaut_ws/install/share/maven/org/knowrob/knowrob_common/knowrob_common/
  1264.    - file:/opt/ros/kinetic/share/maven/org/knowrob/knowrob_common/knowrob_common/maven-metadata.xml
  1265.    - file:/opt/ros/kinetic/share/maven/org/knowrob/knowrob_common/knowrob_common/
  1266.    - https://github.com/rosjava/rosjava_mvn_repo/raw/master/org/knowrob/knowrob_common/knowrob_common/maven-metadata.xml
  1267.    - https://github.com/rosjava/rosjava_mvn_repo/raw/master/org/knowrob/knowrob_common/knowrob_common/
  1268.    - https://github.com/rosjava/rosjava_mvn_repo/raw/master/org/knowrob/knowrob_common/knowrob_common/maven-metadata.xml
  1269.    - https://github.com/rosjava/rosjava_mvn_repo/raw/master/org/knowrob/knowrob_common/knowrob_common/
  1270.    - file:/home/kmanivannan/.m2/repository/org/knowrob/knowrob_common/knowrob_common/maven-metadata.xml
  1271.    - file:/home/kmanivannan/.m2/repository/org/knowrob/knowrob_common/knowrob_common/
  1272.    - http://repository.springsource.com/maven/bundles/release/org/knowrob/knowrob_common/knowrob_common/maven-metadata.xml
  1273.    - http://repository.springsource.com/maven/bundles/release/org/knowrob/knowrob_common/knowrob_common/
  1274.    - http://repository.springsource.com/maven/bundles/external/org/knowrob/knowrob_common/knowrob_common/maven-metadata.xml
  1275.    - http://repository.springsource.com/maven/bundles/external/org/knowrob/knowrob_common/knowrob_common/
  1276.    - https://jcenter.bintray.com/org/knowrob/knowrob_common/knowrob_common/maven-metadata.xml
  1277.    - https://jcenter.bintray.com/org/knowrob/knowrob_common/knowrob_common/
  1278.  Required by:
  1279.      project :json_prolog
  1280.  
  1281. * Try:
  1282. Run with --stacktrace option to get the stack trace. Run with --info or --debug option to get more log output. Run with --scan to get full insights.
  1283.  
  1284. * Get more help at https://help.gradle.org
  1285.  
  1286. BUILD FAILED in 4s
  1287. CMakeFiles/gradle-json_prolog.dir/build.make:57: recipe for target 'CMakeFiles/gradle-json_prolog' failed
  1288. make[2]: Leaving directory '/home/kmanivannan/hmi/knowrob_ws/build/json_prolog'
  1289. make[2]: *** [CMakeFiles/gradle-json_prolog] Error 1
  1290. make[1]: *** [CMakeFiles/gradle-json_prolog.dir/all] Error 2
  1291. CMakeFiles/Makefile2:193: recipe for target 'CMakeFiles/gradle-json_prolog.dir/all' failed
  1292. make[1]: Leaving directory '/home/kmanivannan/hmi/knowrob_ws/build/json_prolog'
  1293. Makefile:138: recipe for target 'all' failed
  1294. make: *** [all] Error 2
  1295. cd /home/kmanivannan/hmi/knowrob_ws/build/json_prolog; catkin build --get-env json_prolog | catkin env -si  /usr/bin/make --jobserver-fds=6,7 -j; cd -
  1296. ......................................................................................................................................................................................................................................
  1297. Failed     << json_prolog:make                           [ Exited with code 2 ]                                                                                                                                                      
  1298. Failed    <<< json_prolog                                [ 8.7 seconds ]                                                                                                                                                              
  1299. Abandoned <<< knowrob_household                          [ Unrelated job failed ]                                                                                                                                                    
  1300. Abandoned <<< knowrob_maps                               [ Unrelated job failed ]                                                                                                                                                    
  1301. Abandoned <<< knowrob_srdl                               [ Unrelated job failed ]                                                                                                                                                    
  1302. Abandoned <<< knowrob_vis                                [ Unrelated job failed ]                                                                                                                                                    
  1303. Output     << knowrob_actions:cmake /home/kmanivannan/hmi/knowrob_ws/logs/knowrob_actions/build.cmake.000.log                                                                                                                        
  1304. Not searching for unused variables given on the command line.
  1305. Re-run cmake no build system arguments
  1306. -- The C compiler identification is GNU 5.4.0
  1307. -- The CXX compiler identification is GNU 5.4.0
  1308. -- Check for working C compiler: /usr/bin/cc
  1309. -- Check for working C compiler: /usr/bin/cc -- works
  1310. -- Detecting C compiler ABI info
  1311. -- Detecting C compiler ABI info - done
  1312. -- Detecting C compile features
  1313. -- Detecting C compile features - done
  1314. -- Check for working CXX compiler: /usr/bin/c++
  1315. -- Check for working CXX compiler: /usr/bin/c++ -- works
  1316. -- Detecting CXX compiler ABI info
  1317. -- Detecting CXX compiler ABI info - done
  1318. -- Detecting CXX compile features
  1319. -- Detecting CXX compile features - done
  1320. -- Using CATKIN_DEVEL_PREFIX: /home/kmanivannan/hmi/knowrob_ws/devel/.private/knowrob_actions
  1321. -- Using CMAKE_PREFIX_PATH: /home/kmanivannan/hmi/knowrob_ws/devel;/home/kmanivannan/aquanaut_ws/install;/opt/ros/kinetic
  1322. -- This workspace overlays: /home/kmanivannan/hmi/knowrob_ws/devel;/home/kmanivannan/aquanaut_ws/install;/opt/ros/kinetic
  1323. -- Found PythonInterp: /usr/bin/python (found version "2.7.12")
  1324. -- Using PYTHON_EXECUTABLE: /usr/bin/python
  1325. -- Using Debian Python package layout
  1326. -- Using empy: /usr/bin/empy
  1327. -- Using CATKIN_ENABLE_TESTING: ON
  1328. -- Call enable_testing()
  1329. -- Using CATKIN_TEST_RESULTS_DIR: /home/kmanivannan/hmi/knowrob_ws/build/knowrob_actions/test_results
  1330. -- Found gmock sources under '/usr/src/gmock': gmock will be built
  1331. -- Looking for pthread.h
  1332. -- Looking for pthread.h - found
  1333. -- Looking for pthread_create
  1334. -- Looking for pthread_create - not found
  1335. -- Looking for pthread_create in pthreads
  1336. -- Looking for pthread_create in pthreads - not found
  1337. -- Looking for pthread_create in pthread
  1338. -- Looking for pthread_create in pthread - found
  1339. -- Found Threads: TRUE
  1340. -- Found gtest sources under '/usr/src/gmock': gtests will be built
  1341. -- Using Python nosetests: /usr/bin/nosetests-2.7
  1342. -- catkin 0.7.14
  1343. -- Configuring done
  1344. -- Generating done
  1345. -- Build files have been written to: /home/kmanivannan/hmi/knowrob_ws/build/knowrob_actions
  1346. cd /home/kmanivannan/hmi/knowrob_ws/build/knowrob_actions; catkin build --get-env knowrob_actions | catkin env -si  /usr/bin/cmake /home/kmanivannan/hmi/knowrob_ws/src/knowrob/knowrob_actions --no-warn-unused-cli -DCATKIN_DEVEL_PREFIX=/home/kmanivannan/hmi/knowrob_ws/devel/.private/knowrob_actions -DCMAKE_INSTALL_PREFIX=/home/kmanivannan/hmi/knowrob_ws/install; cd -
  1347. Finished   << knowrob_actions:cmake                                                                                                                                                                                                  
  1348. Starting   >> knowrob_actions:make                                                                                                                                                                                                    
  1349. Subprocess  > knowrob_actions:make `cd /home/kmanivannan/hmi/knowrob_ws/build/knowrob_actions; catkin build --get-env knowrob_actions | catkin env -si  /usr/bin/make --jobserver-fds=6,7 -j; cd -`                                  
  1350. Output     << knowrob_actions:make /home/kmanivannan/hmi/knowrob_ws/logs/knowrob_actions/build.make.000.log                                                                                                                          
  1351. /usr/bin/cmake -H/home/kmanivannan/hmi/knowrob_ws/src/knowrob/knowrob_actions -B/home/kmanivannan/hmi/knowrob_ws/build/knowrob_actions --check-build-system CMakeFiles/Makefile.cmake 0
  1352. /usr/bin/cmake -E cmake_progress_start /home/kmanivannan/hmi/knowrob_ws/build/knowrob_actions/CMakeFiles /home/kmanivannan/hmi/knowrob_ws/build/knowrob_actions/CMakeFiles/progress.marks
  1353. /usr/bin/make -f CMakeFiles/Makefile2 all
  1354. make[1]: Entering directory '/home/kmanivannan/hmi/knowrob_ws/build/knowrob_actions'
  1355. make[1]: Nothing to be done for 'all'.
  1356. make[1]: Leaving directory '/home/kmanivannan/hmi/knowrob_ws/build/knowrob_actions'
  1357. /usr/bin/cmake -E cmake_progress_start /home/kmanivannan/hmi/knowrob_ws/build/knowrob_actions/CMakeFiles 0
  1358. cd /home/kmanivannan/hmi/knowrob_ws/build/knowrob_actions; catkin build --get-env knowrob_actions | catkin env -si  /usr/bin/make --jobserver-fds=6,7 -j; cd -
  1359. Finished   << knowrob_actions:make                                                                                                                                                                                                    
  1360. Starting   >> knowrob_actions:symlink                                                                                                                                                                                                
  1361. Output     << knowrob_actions:symlink /home/kmanivannan/hmi/knowrob_ws/logs/knowrob_actions/build.symlink.000.log                                                                                                                    
  1362. Symlinking /home/kmanivannan/hmi/knowrob_ws/devel/lib/pkgconfig/knowrob_actions.pc
  1363. Symlinking /home/kmanivannan/hmi/knowrob_ws/devel/share/knowrob_actions/cmake/knowrob_actionsConfig.cmake
  1364. Symlinking /home/kmanivannan/hmi/knowrob_ws/devel/share/knowrob_actions/cmake/knowrob_actionsConfig-version.cmake
  1365. Finished   << knowrob_actions:symlink                                                                                                                                                                                                
  1366. Finished  <<< knowrob_actions                            [ 2.2 seconds ]                                                                                                                                                              
  1367. Output     << knowrob_mongo:cmake /home/kmanivannan/hmi/knowrob_ws/logs/knowrob_mongo/build.cmake.000.log                                                                                                                            
  1368. Not searching for unused variables given on the command line.
  1369. Re-run cmake no build system arguments
  1370. -- The C compiler identification is GNU 5.4.0
  1371. -- The CXX compiler identification is GNU 5.4.0
  1372. -- Check for working C compiler: /usr/bin/cc
  1373. -- Check for working C compiler: /usr/bin/cc -- works
  1374. -- Detecting C compiler ABI info
  1375. -- Detecting C compiler ABI info - done
  1376. -- Detecting C compile features
  1377. -- Detecting C compile features - done
  1378. -- Check for working CXX compiler: /usr/bin/c++
  1379. -- Check for working CXX compiler: /usr/bin/c++ -- works
  1380. -- Detecting CXX compiler ABI info
  1381. -- Detecting CXX compiler ABI info - done
  1382. -- Detecting CXX compile features
  1383. -- Detecting CXX compile features - done
  1384. -- Using CATKIN_DEVEL_PREFIX: /home/kmanivannan/hmi/knowrob_ws/devel/.private/knowrob_mongo
  1385. -- Using CMAKE_PREFIX_PATH: /home/kmanivannan/hmi/knowrob_ws/devel;/home/kmanivannan/aquanaut_ws/install;/opt/ros/kinetic
  1386. -- This workspace overlays: /home/kmanivannan/hmi/knowrob_ws/devel;/home/kmanivannan/aquanaut_ws/install;/opt/ros/kinetic
  1387. -- Found PythonInterp: /usr/bin/python (found version "2.7.12")
  1388. -- Using PYTHON_EXECUTABLE: /usr/bin/python
  1389. -- Using Debian Python package layout
  1390. -- Using empy: /usr/bin/empy
  1391. -- Using CATKIN_ENABLE_TESTING: ON
  1392. -- Call enable_testing()
  1393. -- Using CATKIN_TEST_RESULTS_DIR: /home/kmanivannan/hmi/knowrob_ws/build/knowrob_mongo/test_results
  1394. -- Found gmock sources under '/usr/src/gmock': gmock will be built
  1395. -- Looking for pthread.h
  1396. -- Looking for pthread.h - found
  1397. -- Looking for pthread_create
  1398. -- Looking for pthread_create - not found
  1399. -- Looking for pthread_create in pthreads
  1400. -- Looking for pthread_create in pthreads - not found
  1401. -- Looking for pthread_create in pthread
  1402. -- Looking for pthread_create in pthread - found
  1403. -- Found Threads: TRUE
  1404. -- Found gtest sources under '/usr/src/gmock': gtests will be built
  1405. -- Using Python nosetests: /usr/bin/nosetests-2.7
  1406. -- catkin 0.7.14
  1407. -- Configuring done
  1408. -- Generating done
  1409. -- Build files have been written to: /home/kmanivannan/hmi/knowrob_ws/build/knowrob_mongo
  1410. cd /home/kmanivannan/hmi/knowrob_ws/build/knowrob_mongo; catkin build --get-env knowrob_mongo | catkin env -si  /usr/bin/cmake /home/kmanivannan/hmi/knowrob_ws/src/knowrob/knowrob_mongo --no-warn-unused-cli -DCATKIN_DEVEL_PREFIX=/home/kmanivannan/hmi/knowrob_ws/devel/.private/knowrob_mongo -DCMAKE_INSTALL_PREFIX=/home/kmanivannan/hmi/knowrob_ws/install; cd -
  1411. Finished   << knowrob_mongo:cmake                                                                                                                                                                                                    
  1412. Starting   >> knowrob_mongo:make                                                                                                                                                                                                      
  1413. Subprocess  > knowrob_mongo:make `cd /home/kmanivannan/hmi/knowrob_ws/build/knowrob_mongo; catkin build --get-env knowrob_mongo | catkin env -si  /usr/bin/make --jobserver-fds=6,7 -j; cd -`                                        
  1414. Output     << comp_spatial:cmake /home/kmanivannan/hmi/knowrob_ws/logs/comp_spatial/build.cmake.000.log                                                                                                                              
  1415. Not searching for unused variables given on the command line.
  1416. Re-run cmake no build system arguments
  1417. -- The C compiler identification is GNU 5.4.0
  1418. -- The CXX compiler identification is GNU 5.4.0
  1419. -- Check for working C compiler: /usr/bin/cc
  1420. -- Check for working C compiler: /usr/bin/cc -- works
  1421. -- Detecting C compiler ABI info
  1422. -- Detecting C compiler ABI info - done
  1423. -- Detecting C compile features
  1424. -- Detecting C compile features - done
  1425. -- Check for working CXX compiler: /usr/bin/c++
  1426. -- Check for working CXX compiler: /usr/bin/c++ -- works
  1427. -- Detecting CXX compiler ABI info
  1428. -- Detecting CXX compiler ABI info - done
  1429. -- Detecting CXX compile features
  1430. -- Detecting CXX compile features - done
  1431. -- Using CATKIN_DEVEL_PREFIX: /home/kmanivannan/hmi/knowrob_ws/devel/.private/comp_spatial
  1432. -- Using CMAKE_PREFIX_PATH: /home/kmanivannan/hmi/knowrob_ws/devel;/home/kmanivannan/aquanaut_ws/install;/opt/ros/kinetic
  1433. -- This workspace overlays: /home/kmanivannan/hmi/knowrob_ws/devel;/home/kmanivannan/aquanaut_ws/install;/opt/ros/kinetic
  1434. -- Found PythonInterp: /usr/bin/python (found version "2.7.12")
  1435. -- Using PYTHON_EXECUTABLE: /usr/bin/python
  1436. -- Using Debian Python package layout
  1437. -- Using empy: /usr/bin/empy
  1438. -- Using CATKIN_ENABLE_TESTING: ON
  1439. -- Call enable_testing()
  1440. -- Using CATKIN_TEST_RESULTS_DIR: /home/kmanivannan/hmi/knowrob_ws/build/comp_spatial/test_results
  1441. -- Found gmock sources under '/usr/src/gmock': gmock will be built
  1442. -- Looking for pthread.h
  1443. -- Looking for pthread.h - found
  1444. -- Looking for pthread_create
  1445. -- Looking for pthread_create - not found
  1446. -- Looking for pthread_create in pthreads
  1447. -- Looking for pthread_create in pthreads - not found
  1448. -- Looking for pthread_create in pthread
  1449. -- Looking for pthread_create in pthread - found
  1450. -- Found Threads: TRUE
  1451. -- Found gtest sources under '/usr/src/gmock': gtests will be built
  1452. -- Using Python nosetests: /usr/bin/nosetests-2.7
  1453. -- catkin 0.7.14
  1454. -- Configuring done
  1455. -- Generating done
  1456. -- Build files have been written to: /home/kmanivannan/hmi/knowrob_ws/build/comp_spatial
  1457. cd /home/kmanivannan/hmi/knowrob_ws/build/comp_spatial; catkin build --get-env comp_spatial | catkin env -si  /usr/bin/cmake /home/kmanivannan/hmi/knowrob_ws/src/knowrob/comp_spatial --no-warn-unused-cli -DCATKIN_DEVEL_PREFIX=/home/kmanivannan/hmi/knowrob_ws/devel/.private/comp_spatial -DCMAKE_INSTALL_PREFIX=/home/kmanivannan/hmi/knowrob_ws/install; cd -
  1458. Finished   << comp_spatial:cmake                                                                                                                                                                                                      
  1459. Starting   >> comp_spatial:make                                                                                                                                                                                                      
  1460. Subprocess  > comp_spatial:make `cd /home/kmanivannan/hmi/knowrob_ws/build/comp_spatial; catkin build --get-env comp_spatial | catkin env -si  /usr/bin/make --jobserver-fds=6,7 -j; cd -`                                            
  1461. Output     << comp_spatial:make /home/kmanivannan/hmi/knowrob_ws/logs/comp_spatial/build.make.000.log                                                                                                                                
  1462. /usr/bin/cmake -H/home/kmanivannan/hmi/knowrob_ws/src/knowrob/comp_spatial -B/home/kmanivannan/hmi/knowrob_ws/build/comp_spatial --check-build-system CMakeFiles/Makefile.cmake 0
  1463. /usr/bin/cmake -E cmake_progress_start /home/kmanivannan/hmi/knowrob_ws/build/comp_spatial/CMakeFiles /home/kmanivannan/hmi/knowrob_ws/build/comp_spatial/CMakeFiles/progress.marks
  1464. /usr/bin/make -f CMakeFiles/Makefile2 all
  1465. make[1]: Entering directory '/home/kmanivannan/hmi/knowrob_ws/build/comp_spatial'
  1466. make[1]: Nothing to be done for 'all'.
  1467. make[1]: Leaving directory '/home/kmanivannan/hmi/knowrob_ws/build/comp_spatial'
  1468. /usr/bin/cmake -E cmake_progress_start /home/kmanivannan/hmi/knowrob_ws/build/comp_spatial/CMakeFiles 0
  1469. cd /home/kmanivannan/hmi/knowrob_ws/build/comp_spatial; catkin build --get-env comp_spatial | catkin env -si  /usr/bin/make --jobserver-fds=6,7 -j; cd -
  1470. Finished   << comp_spatial:make                                                                                                                                                                                                      
  1471. Starting   >> comp_spatial:symlink                                                                                                                                                                                                    
  1472. Output     << comp_spatial:symlink /home/kmanivannan/hmi/knowrob_ws/logs/comp_spatial/build.symlink.000.log                                                                                                                          
  1473. Symlinking /home/kmanivannan/hmi/knowrob_ws/devel/lib/pkgconfig/comp_spatial.pc
  1474. Symlinking /home/kmanivannan/hmi/knowrob_ws/devel/share/comp_spatial/cmake/comp_spatialConfig-version.cmake
  1475. Symlinking /home/kmanivannan/hmi/knowrob_ws/devel/share/comp_spatial/cmake/comp_spatialConfig.cmake
  1476. Finished   << comp_spatial:symlink                                                                                                                                                                                                    
  1477. Finished  <<< comp_spatial                               [ 2.2 seconds ]                                                                                                                                                              
  1478. ______________________________________________________________________________________________________________________________________________________________________________________________________________________________________
  1479. Errors     << knowrob_mongo:make /home/kmanivannan/hmi/knowrob_ws/logs/knowrob_mongo/build.make.000.log                                                                                                                              
  1480. /usr/bin/cmake -H/home/kmanivannan/hmi/knowrob_ws/src/knowrob/knowrob_mongo -B/home/kmanivannan/hmi/knowrob_ws/build/knowrob_mongo --check-build-system CMakeFiles/Makefile.cmake 0
  1481. /usr/bin/cmake -E cmake_progress_start /home/kmanivannan/hmi/knowrob_ws/build/knowrob_mongo/CMakeFiles /home/kmanivannan/hmi/knowrob_ws/build/knowrob_mongo/CMakeFiles/progress.marks
  1482. /usr/bin/make -f CMakeFiles/Makefile2 all
  1483. make[1]: Entering directory '/home/kmanivannan/hmi/knowrob_ws/build/knowrob_mongo'
  1484. /usr/bin/make -f CMakeFiles/gradle-knowrob_mongo.dir/build.make CMakeFiles/gradle-knowrob_mongo.dir/depend
  1485. make[2]: Entering directory '/home/kmanivannan/hmi/knowrob_ws/build/knowrob_mongo'
  1486. cd /home/kmanivannan/hmi/knowrob_ws/build/knowrob_mongo && /usr/bin/cmake -E cmake_depends "Unix Makefiles" /home/kmanivannan/hmi/knowrob_ws/src/knowrob/knowrob_mongo /home/kmanivannan/hmi/knowrob_ws/src/knowrob/knowrob_mongo /home/kmanivannan/hmi/knowrob_ws/build/knowrob_mongo /home/kmanivannan/hmi/knowrob_ws/build/knowrob_mongo /home/kmanivannan/hmi/knowrob_ws/build/knowrob_mongo/CMakeFiles/gradle-knowrob_mongo.dir/DependInfo.cmake --color=
  1487. Dependee "/home/kmanivannan/hmi/knowrob_ws/build/knowrob_mongo/CMakeFiles/gradle-knowrob_mongo.dir/DependInfo.cmake" is newer than depender "/home/kmanivannan/hmi/knowrob_ws/build/knowrob_mongo/CMakeFiles/gradle-knowrob_mongo.dir/depend.internal".
  1488. Dependee "/home/kmanivannan/hmi/knowrob_ws/build/knowrob_mongo/CMakeFiles/CMakeDirectoryInformation.cmake" is newer than depender "/home/kmanivannan/hmi/knowrob_ws/build/knowrob_mongo/CMakeFiles/gradle-knowrob_mongo.dir/depend.internal".
  1489. Scanning dependencies of target gradle-knowrob_mongo
  1490. make[2]: Leaving directory '/home/kmanivannan/hmi/knowrob_ws/build/knowrob_mongo'
  1491. /usr/bin/make -f CMakeFiles/gradle-knowrob_mongo.dir/build.make CMakeFiles/gradle-knowrob_mongo.dir/build
  1492. make[2]: Entering directory '/home/kmanivannan/hmi/knowrob_ws/build/knowrob_mongo'
  1493. [100%] Gradling tasks for knowrob_mongo
  1494. cd /home/kmanivannan/hmi/knowrob_ws/src/knowrob/knowrob_mongo && ROS_MAVEN_REPOSITORY=https://github.com/rosjava/rosjava_mvn_repo/raw/master /home/kmanivannan/hmi/knowrob_ws/build/knowrob_mongo/catkin_generated/env_cached.sh /home/kmanivannan/hmi/knowrob_ws/src/knowrob/knowrob_mongo/gradlew -q installDist publishMavenJavaPublicationToMavenRepository writeClasspath
  1495.  
  1496. FAILURE: Build failed with an exception.
  1497.  
  1498. * What went wrong:
  1499. Could not resolve all files for configuration ':knowrob_mongo:compileClasspath'.
  1500. > Could not find any matches for org.knowrob.tfjava:tfjava:[0.1,) as no versions of org.knowrob.tfjava:tfjava are available.
  1501.  Searched in the following locations:
  1502.    - file:/home/kmanivannan/hmi/knowrob_ws/devel/.private/knowrob_mongo/share/maven/org/knowrob/tfjava/tfjava/maven-metadata.xml
  1503.    - file:/home/kmanivannan/hmi/knowrob_ws/devel/.private/knowrob_mongo/share/maven/org/knowrob/tfjava/tfjava/
  1504.    - file:/home/kmanivannan/hmi/knowrob_ws/devel/share/maven/org/knowrob/tfjava/tfjava/maven-metadata.xml
  1505.    - file:/home/kmanivannan/hmi/knowrob_ws/devel/share/maven/org/knowrob/tfjava/tfjava/
  1506.    - file:/home/kmanivannan/aquanaut_ws/install/share/maven/org/knowrob/tfjava/tfjava/maven-metadata.xml
  1507.    - file:/home/kmanivannan/aquanaut_ws/install/share/maven/org/knowrob/tfjava/tfjava/
  1508.    - file:/opt/ros/kinetic/share/maven/org/knowrob/tfjava/tfjava/maven-metadata.xml
  1509.    - file:/opt/ros/kinetic/share/maven/org/knowrob/tfjava/tfjava/
  1510.    - https://github.com/rosjava/rosjava_mvn_repo/raw/master/org/knowrob/tfjava/tfjava/maven-metadata.xml
  1511.    - https://github.com/rosjava/rosjava_mvn_repo/raw/master/org/knowrob/tfjava/tfjava/
  1512.    - https://github.com/rosjava/rosjava_mvn_repo/raw/master/org/knowrob/tfjava/tfjava/maven-metadata.xml
  1513.    - https://github.com/rosjava/rosjava_mvn_repo/raw/master/org/knowrob/tfjava/tfjava/
  1514.    - file:/home/kmanivannan/.m2/repository/org/knowrob/tfjava/tfjava/maven-metadata.xml
  1515.    - file:/home/kmanivannan/.m2/repository/org/knowrob/tfjava/tfjava/
  1516.    - http://repository.springsource.com/maven/bundles/release/org/knowrob/tfjava/tfjava/maven-metadata.xml
  1517.    - http://repository.springsource.com/maven/bundles/release/org/knowrob/tfjava/tfjava/
  1518.    - http://repository.springsource.com/maven/bundles/external/org/knowrob/tfjava/tfjava/maven-metadata.xml
  1519.    - http://repository.springsource.com/maven/bundles/external/org/knowrob/tfjava/tfjava/
  1520.    - https://jcenter.bintray.com/org/knowrob/tfjava/tfjava/maven-metadata.xml
  1521.    - https://jcenter.bintray.com/org/knowrob/tfjava/tfjava/
  1522.  Required by:
  1523.      project :knowrob_mongo
  1524. > Could not find any matches for org.knowrob.knowrob_common:knowrob_common:[0.1,) as no versions of org.knowrob.knowrob_common:knowrob_common are available.
  1525.  Searched in the following locations:
  1526.    - file:/home/kmanivannan/hmi/knowrob_ws/devel/.private/knowrob_mongo/share/maven/org/knowrob/knowrob_common/knowrob_common/maven-metadata.xml
  1527.    - file:/home/kmanivannan/hmi/knowrob_ws/devel/.private/knowrob_mongo/share/maven/org/knowrob/knowrob_common/knowrob_common/
  1528.    - file:/home/kmanivannan/hmi/knowrob_ws/devel/share/maven/org/knowrob/knowrob_common/knowrob_common/maven-metadata.xml
  1529.    - file:/home/kmanivannan/hmi/knowrob_ws/devel/share/maven/org/knowrob/knowrob_common/knowrob_common/
  1530.    - file:/home/kmanivannan/aquanaut_ws/install/share/maven/org/knowrob/knowrob_common/knowrob_common/maven-metadata.xml
  1531.    - file:/home/kmanivannan/aquanaut_ws/install/share/maven/org/knowrob/knowrob_common/knowrob_common/
  1532.    - file:/opt/ros/kinetic/share/maven/org/knowrob/knowrob_common/knowrob_common/maven-metadata.xml
  1533.    - file:/opt/ros/kinetic/share/maven/org/knowrob/knowrob_common/knowrob_common/
  1534.    - https://github.com/rosjava/rosjava_mvn_repo/raw/master/org/knowrob/knowrob_common/knowrob_common/maven-metadata.xml
  1535.    - https://github.com/rosjava/rosjava_mvn_repo/raw/master/org/knowrob/knowrob_common/knowrob_common/
  1536.    - https://github.com/rosjava/rosjava_mvn_repo/raw/master/org/knowrob/knowrob_common/knowrob_common/maven-metadata.xml
  1537.    - https://github.com/rosjava/rosjava_mvn_repo/raw/master/org/knowrob/knowrob_common/knowrob_common/
  1538.    - file:/home/kmanivannan/.m2/repository/org/knowrob/knowrob_common/knowrob_common/maven-metadata.xml
  1539.    - file:/home/kmanivannan/.m2/repository/org/knowrob/knowrob_common/knowrob_common/
  1540.    - http://repository.springsource.com/maven/bundles/release/org/knowrob/knowrob_common/knowrob_common/maven-metadata.xml
  1541.    - http://repository.springsource.com/maven/bundles/release/org/knowrob/knowrob_common/knowrob_common/
  1542.    - http://repository.springsource.com/maven/bundles/external/org/knowrob/knowrob_common/knowrob_common/maven-metadata.xml
  1543.    - http://repository.springsource.com/maven/bundles/external/org/knowrob/knowrob_common/knowrob_common/
  1544.    - https://jcenter.bintray.com/org/knowrob/knowrob_common/knowrob_common/maven-metadata.xml
  1545.    - https://jcenter.bintray.com/org/knowrob/knowrob_common/knowrob_common/
  1546.  Required by:
  1547.      project :knowrob_mongo
  1548.  
  1549. * Try:
  1550. Run with --stacktrace option to get the stack trace. Run with --info or --debug option to get more log output. Run with --scan to get full insights.
  1551.  
  1552. * Get more help at https://help.gradle.org
  1553.  
  1554. BUILD FAILED in 4s
  1555. CMakeFiles/gradle-knowrob_mongo.dir/build.make:57: recipe for target 'CMakeFiles/gradle-knowrob_mongo' failed
  1556. make[2]: Leaving directory '/home/kmanivannan/hmi/knowrob_ws/build/knowrob_mongo'
  1557. make[2]: *** [CMakeFiles/gradle-knowrob_mongo] Error 1
  1558. CMakeFiles/Makefile2:675: recipe for target 'CMakeFiles/gradle-knowrob_mongo.dir/all' failed
  1559. make[1]: Leaving directory '/home/kmanivannan/hmi/knowrob_ws/build/knowrob_mongo'
  1560. make[1]: *** [CMakeFiles/gradle-knowrob_mongo.dir/all] Error 2
  1561. Makefile:138: recipe for target 'all' failed
  1562. make: *** [all] Error 2
  1563. cd /home/kmanivannan/hmi/knowrob_ws/build/knowrob_mongo; catkin build --get-env knowrob_mongo | catkin env -si  /usr/bin/make --jobserver-fds=6,7 -j; cd -
  1564. ......................................................................................................................................................................................................................................
  1565. Failed     << knowrob_mongo:make                         [ Exited with code 2 ]                                                                                                                                                      
  1566. Failed    <<< knowrob_mongo                              [ 7.0 seconds ]                                                                                                                                                              
  1567. [build] Summary: 24 of 30 packages succeeded.                                                                                                                                                                                        
  1568. [build]   Ignored:   2 packages were skipped or are blacklisted.                                                                                                                                                                      
  1569. [build]   Warnings:  1 packages succeeded with warnings.                                                                                                                                                                              
  1570. [build]   Abandoned: 4 packages were abandoned.                                                                                                                                                                                      
  1571. [build]   Failed:    2 packages failed.                                                                                                                                                                                              
  1572. [build] Runtime: 1 minute and 5.1 seconds total.                                                                                                                                                                                      
  1573. [build] Note: Workspace packages have changed, please re-source setup files to use them.
RAW Paste Data
We use cookies for various purposes including analytics. By continuing to use Pastebin, you agree to our use of cookies as described in the Cookies Policy. OK, I Understand
 
Top