Guest User

Untitled

a guest
Feb 26th, 2014
40
Never
Not a member of Pastebin yet? Sign Up, it unlocks many cool features!
  1. $ make -f client.mk build
  2. > obj-i686-pc-linux-gnu/.mozconfig.mk
  3. make -f /home/user/Sources/firefox-kde-opensuse/src/mozilla-release/client.mk realbuild
  4. make[1]: вход в каталог «/home/user/Sources/firefox-kde-opensuse/src/mozilla-release»
  5. Adding client.mk options from /home/user/Sources/firefox-kde-opensuse/src/mozilla-release/.mozconfig:
  6. BUILD_OFFICIAL=1
  7. MOZILLA_OFFICIAL=1
  8. FOUND_MOZCONFIG := /home/user/Sources/firefox-kde-opensuse/src/mozilla-release/.mozconfig
  9. make[2]: вход в каталог «/home/user/Sources/firefox-kde-opensuse/src/mozilla-release»
  10. python /home/user/Sources/firefox-kde-opensuse/src/mozilla-release/config/pythonpath.py -I /home/user/Sources/firefox-kde-opensuse/src/mozilla-release/testing/mozbase/mozfile \
  11. /home/user/Sources/firefox-kde-opensuse/src/mozilla-release/python/mozbuild/mozbuild/controller/clobber.py /home/user/Sources/firefox-kde-opensuse/src/mozilla-release obj-i686-pc-linux-gnu
  12. Traceback (most recent call last):
  13. File "/home/user/Sources/firefox-kde-opensuse/src/mozilla-release/config/pythonpath.py", line 56, in <module>
  14. main(sys.argv[1:])
  15. File "/home/user/Sources/firefox-kde-opensuse/src/mozilla-release/config/pythonpath.py", line 48, in main
  16. execfile(script, frozenglobals)
  17. NameError: global name 'execfile' is not defined
  18. /home/user/Sources/firefox-kde-opensuse/src/mozilla-release/client.mk:340: ошибка выполнения рецепта для цели «check-clobber»
  19. make[2]: *** [check-clobber] Ошибка 1
  20. make[2]: выход из каталога «/home/user/Sources/firefox-kde-opensuse/src/mozilla-release»
  21. /home/user/Sources/firefox-kde-opensuse/src/mozilla-release/client.mk:371: ошибка выполнения рецепта для цели «obj-i686-pc-linux-gnu/Makefile»
  22. make[1]: *** [obj-i686-pc-linux-gnu/Makefile] Ошибка 2
  23. make[1]: выход из каталога «/home/user/Sources/firefox-kde-opensuse/src/mozilla-release»
  24. client.mk:179: ошибка выполнения рецепта для цели «build»
  25. make: *** [build] Ошибка 2
  26. [user@arch mozilla-release]$ nano .mozconfig
  27. [user@arch mozilla-release]$ make -f client.mk build
  28. > obj-i686-pc-linux-gnu/.mozconfig.mk
  29. make -f /home/user/Sources/firefox-kde-opensuse/src/mozilla-release/client.mk realbuild
  30. make[1]: вход в каталог «/home/user/Sources/firefox-kde-opensuse/src/mozilla-release»
  31. Adding client.mk options from /home/user/Sources/firefox-kde-opensuse/src/mozilla-release/.mozconfig:
  32. BUILD_OFFICIAL=1
  33. MOZILLA_OFFICIAL=1
  34. PYTHON=/usr/bin/python2
  35. FOUND_MOZCONFIG := /home/user/Sources/firefox-kde-opensuse/src/mozilla-release/.mozconfig
  36. make[2]: вход в каталог «/home/user/Sources/firefox-kde-opensuse/src/mozilla-release»
  37. /usr/bin/python2 /home/user/Sources/firefox-kde-opensuse/src/mozilla-release/config/pythonpath.py -I /home/user/Sources/firefox-kde-opensuse/src/mozilla-release/testing/mozbase/mozfile \
  38. /home/user/Sources/firefox-kde-opensuse/src/mozilla-release/python/mozbuild/mozbuild/controller/clobber.py /home/user/Sources/firefox-kde-opensuse/src/mozilla-release obj-i686-pc-linux-gnu
  39. Clobber not needed.
  40. cp /home/user/Sources/firefox-kde-opensuse/src/mozilla-release/.mozconfig obj-i686-pc-linux-gnu/.mozconfig
  41. cd obj-i686-pc-linux-gnu
  42. /home/user/Sources/firefox-kde-opensuse/src/mozilla-release/configure
  43. Adding configure options from /home/user/Sources/firefox-kde-opensuse/src/mozilla-release/.mozconfig:
  44. --enable-application=browser
  45. --prefix=/usr
  46. --libdir=/usr/lib
  47. --enable-official-branding
  48. --with-system-nspr
  49. --with-system-nss
  50. --with-system-jpeg
  51. --with-system-zlib
  52. --with-system-bz2
  53. --with-system-png
  54. --with-system-libevent
  55. --with-system-libvpx
  56. --enable-system-hunspell
  57. --enable-system-sqlite
  58. --enable-system-ffi
  59. --enable-system-cairo
  60. --enable-system-pixman
  61. --disable-libproxy
  62. --enable-startup-notification
  63. --enable-pulseaudio
  64. --disable-gio
  65. --disable-gconf
  66. --disable-gnomevfs
  67. --disable-crashreporter
  68. --disable-tests
  69. --disable-updater
  70. --disable-mochitest
  71. --disable-installer
  72. --disable-debug-symbols
  73. --enable-optimize
  74. --with-google-api-keyfile=/home/user/Sources/firefox-kde-opensuse/src/mozilla-release/obj-i686-pc-linux-gnu/google-api-key
  75. loading cache ./config.cache
  76. checking host system type... i686-pc-linux-gnu
  77. checking target system type... i686-pc-linux-gnu
  78. checking build system type... i686-pc-linux-gnu
  79. checking for gawk... gawk
  80. checking for python2.7... /usr/bin/python2.7
  81. Creating Python environment
  82. New python executable in /home/user/Sources/firefox-kde-opensuse/src/mozilla-release/obj-i686-pc-linux-gnu/_virtualenv/bin/python2.7
  83. Not overwriting existing python script /home/user/Sources/firefox-kde-opensuse/src/mozilla-release/obj-i686-pc-linux-gnu/_virtualenv/bin/python (you must use /home/user/Sources/firefox-kde-opensuse/src/mozilla-release/obj-i686-pc-linux-gnu/_virtualenv/bin/python2.7)
  84. Traceback (most recent call last):
  85. File "/home/user/Sources/firefox-kde-opensuse/src/mozilla-release/python/virtualenv/virtualenv.py", line 2308, in <module>
  86. main()
  87. File "/home/user/Sources/firefox-kde-opensuse/src/mozilla-release/python/virtualenv/virtualenv.py", line 821, in main
  88. symlink=options.symlink)
  89. File "/home/user/Sources/firefox-kde-opensuse/src/mozilla-release/python/virtualenv/virtualenv.py", line 956, in create_environment
  90. site_packages=site_packages, clear=clear, symlink=symlink))
  91. File "/home/user/Sources/firefox-kde-opensuse/src/mozilla-release/python/virtualenv/virtualenv.py", line 1398, in install_python
  92. raise e
  93. OSError: [Errno 40] Too many levels of symbolic links
  94. Traceback (most recent call last):
  95. File "/home/user/Sources/firefox-kde-opensuse/src/mozilla-release/python/mozbuild/mozbuild/virtualenv.py", line 473, in <module>
  96. manager.ensure()
  97. File "/home/user/Sources/firefox-kde-opensuse/src/mozilla-release/python/mozbuild/mozbuild/virtualenv.py", line 128, in ensure
  98. return self.build()
  99. File "/home/user/Sources/firefox-kde-opensuse/src/mozilla-release/python/mozbuild/mozbuild/virtualenv.py", line 371, in build
  100. self.create()
  101. File "/home/user/Sources/firefox-kde-opensuse/src/mozilla-release/python/mozbuild/mozbuild/virtualenv.py", line 147, in create
  102. raise Exception('Error creating virtualenv.')
  103. Exception: Error creating virtualenv.
  104. ------ config.log ------
  105. This file contains any messages produced by compilers while
  106. running configure, to aid debugging if configure makes a mistake.
  107.  
  108. configure:1181: checking host system type
  109. configure:1202: checking target system type
  110. configure:1220: checking build system type
  111. configure:1295: checking for gawk
  112. configure:1381: checking for python2.7
  113. *** Fix above errors and then restart with "make -f client.mk build"
  114. /home/user/Sources/firefox-kde-opensuse/src/mozilla-release/client.mk:357: ошибка выполнения рецепта для цели «configure»
  115. make[2]: *** [configure] Ошибка 1
  116. make[2]: выход из каталога «/home/user/Sources/firefox-kde-opensuse/src/mozilla-release»
  117. /home/user/Sources/firefox-kde-opensuse/src/mozilla-release/client.mk:371: ошибка выполнения рецепта для цели «obj-i686-pc-linux-gnu/Makefile»
  118. make[1]: *** [obj-i686-pc-linux-gnu/Makefile] Ошибка 2
  119. make[1]: выход из каталога «/home/user/Sources/firefox-kde-opensuse/src/mozilla-release»
  120. client.mk:179: ошибка выполнения рецепта для цели «build»
  121. make: *** [build] Ошибка 2
RAW Paste Data