SHARE
TWEET

erro

thaylelrvilelacintra Jul 15th, 2019 70 in 147 days
Not a member of Pastebin yet? Sign Up, it unlocks many cool features!
  1. ild
  2. gyp ERR! configure error
  3. gyp ERR! stack Error: EACCES: permission denied, mkdir '/var/www/html/freelance/sense-design/App/node_modules/node-sass/build'
  4. gyp ERR! System Linux 4.15.0-54-generic
  5. gyp ERR! command "/usr/local/bin/node" "/var/www/html/freelance/sense-design/App/node_modules/node-gyp/bin/node-gyp.js" "rebuild" "--verbose" "--libsass_ext=" "--libsass_cflags=" "--libsass_ldflags=" "--libsass_library="
  6. gyp ERR! cwd /var/www/html/freelance/sense-design/App/node_modules/node-sass
  7. gyp ERR! node -v v10.16.0
  8. gyp ERR! node-gyp -v v3.8.0
  9. gyp ERR! not ok
  10. Build failed with error code: 1
  11. npm WARN optional SKIPPING OPTIONAL DEPENDENCY: fsevents@1.2.7 (node_modules/fsevents):
  12. npm WARN notsup SKIPPING OPTIONAL DEPENDENCY: Unsupported platform for fsevents@1.2.7: wanted {"os":"darwin","arch":"any"} (current: {"os":"linux","arch":"x64"})
  13.  
  14. npm ERR! code ELIFECYCLE
  15. npm ERR! errno 1
  16. npm ERR! node-sass@4.11.0 postinstall: `node scripts/build.js`
  17. npm ERR! Exit status 1
  18. npm ERR!
  19. npm ERR! Failed at the node-sass@4.11.0 postinstall script.
  20. npm ERR! This is probably not a problem with npm. There is likely additional logging output above.
  21.  
  22. npm ERR! A complete log of this run can be found in:
  23. npm ERR!     /home/darthd3v/.npm/_logs/2019-07-15T19_16_47_490Z-debug.log
RAW Paste Data
We use cookies for various purposes including analytics. By continuing to use Pastebin, you agree to our use of cookies as described in the Cookies Policy. OK, I Understand
 
Top