daily pastebin goal
49%
SHARE
TWEET

Untitled

a guest Jul 12th, 2018 52 Never
Not a member of Pastebin yet? Sign Up, it unlocks many cool features!
  1.      [echo] compiling functional tests ...
  2.     [javac] Compiling 4 source files to /tmp/reactor-deb2880d-834b-48b8-b235-264c2f263110/build/classes
  3.     [javac] warning: [options] bootstrap class path not set in conjunction with -source 1.6
  4.     [javac] 1 warning
  5.      [echo] Fail Tests... ...
  6.     [junit] Running tests.rounds.req.TestFinalRound
  7.     [junit] Testsuite: tests.rounds.req.TestFinalRound
  8.     [junit] Tests run: 10, Failures: 2, Errors: 5, Time elapsed: 0.17 sec
  9.     [junit] Tests run: 10, Failures: 2, Errors: 5, Time elapsed: 0.17 sec
  10.     [junit]
  11.     [junit] Testcase: testConstructor took 0.137 sec
  12.     [junit] Testcase: testRankingAfterConstruction took 0.002 sec
  13.     [junit]     Caused an ERROR
  14.     [junit] null
  15.     [junit] java.lang.NullPointerException
  16.     [junit]     at tests.rounds.req.TestFinalRound.testRankingAfterConstruction(TestFinalRound.java:69)
  17.     [junit]
  18.     [junit] Testcase: testSetAttemptForIllegalCompetitor took 0.001 sec
  19.     [junit] Testcase: testSetOneAttemptRanking took 0.001 sec
  20.     [junit]     Caused an ERROR
  21.     [junit] null
  22.     [junit] java.lang.NullPointerException
  23.     [junit]     at tests.rounds.req.TestFinalRound.testSetOneAttemptRanking(TestFinalRound.java:85)
  24.     [junit]
  25.     [junit] Testcase: testSetEqualAttemptsRanking took 0.001 sec
  26.     [junit]     FAILED
  27.     [junit] For equal results the ordering is not correct. expected:<[de.uniwue.jpp.ski.model.Attempt@6ee4b47f, de.uniwue.jpp.ski.model.Attempt@6437a676]> but was:<[de.uniwue.jpp.ski.model.Attempt@6437a676, de.uniwue.jpp.ski.model.Attempt@6ee4b47f]>
  28.     [junit] junit.framework.AssertionFailedError: For equal results the ordering is not correct. expected:<[de.uniwue.jpp.ski.model.Attempt@6ee4b47f, de.uniwue.jpp.ski.model.Attempt@6437a676]> but was:<[de.uniwue.jpp.ski.model.Attempt@6437a676, de.uniwue.jpp.ski.model.Attempt@6ee4b47f]>
  29.     [junit]     at tests.Util.assertEquals(Util.java:14)
  30.     [junit]     at tests.rounds.req.TestFinalRound.testSetEqualAttemptsRanking(TestFinalRound.java:98)
  31.     [junit]
  32.     [junit] Testcase: testConstructorRankingNull took 0 sec
  33.     [junit] Testcase: testCorrectSequence took 0.001 sec
  34.     [junit]     FAILED
  35.     [junit] The jumping sequence in the final round is not corret. expected:<[de.uniwue.jpp.ski.model.Competitor@7368e75e, de.uniwue.jpp.ski.model.Competitor@f99724dd, de.uniwue.jpp.ski.model.Competitor@d64fc745, de.uniwue.jpp.ski.model.Competitor@aa622e82, de.uniwue.jpp.ski.model.Competitor@969b1d02, de.uniwue.jpp.ski.model.Competitor@c0a8c1cc, de.uniwue.jpp.ski.model.Competitor@bafd5165, de.uniwue.jpp.ski.model.Competitor@f72cbc6b, de.uniwue.jpp.ski.model.Competitor@d400aa3a, de.uniwue.jpp.ski.model.Competitor@4528a9c2, de.uniwue.jpp.ski.model.Competitor@794ba877, de.uniwue.jpp.ski.model.Competitor@47671ba0]> but was:<[de.uniwue.jpp.ski.model.Competitor@47671ba0, de.uniwue.jpp.ski.model.Competitor@794ba877, de.uniwue.jpp.ski.model.Competitor@4528a9c2, de.uniwue.jpp.ski.model.Competitor@d400aa3a, de.uniwue.jpp.ski.model.Competitor@f72cbc6b, de.uniwue.jpp.ski.model.Competitor@bafd5165, de.uniwue.jpp.ski.model.Competitor@c0a8c1cc, de.uniwue.jpp.ski.model.Competitor@969b1d02, de.uniwue.jpp.ski.model.Competitor@aa622e82, de.uniwue.jpp.ski.model.Competitor@d64fc745, de.uniwue.jpp.ski.model.Competitor@f99724dd, de.uniwue.jpp.ski.model.Competitor@7368e75e]>
  36.     [junit] junit.framework.AssertionFailedError: The jumping sequence in the final round is not corret. expected:<[de.uniwue.jpp.ski.model.Competitor@7368e75e, de.uniwue.jpp.ski.model.Competitor@f99724dd, de.uniwue.jpp.ski.model.Competitor@d64fc745, de.uniwue.jpp.ski.model.Competitor@aa622e82, de.uniwue.jpp.ski.model.Competitor@969b1d02, de.uniwue.jpp.ski.model.Competitor@c0a8c1cc, de.uniwue.jpp.ski.model.Competitor@bafd5165, de.uniwue.jpp.ski.model.Competitor@f72cbc6b, de.uniwue.jpp.ski.model.Competitor@d400aa3a, de.uniwue.jpp.ski.model.Competitor@4528a9c2, de.uniwue.jpp.ski.model.Competitor@794ba877, de.uniwue.jpp.ski.model.Competitor@47671ba0]> but was:<[de.uniwue.jpp.ski.model.Competitor@47671ba0, de.uniwue.jpp.ski.model.Competitor@794ba877, de.uniwue.jpp.ski.model.Competitor@4528a9c2, de.uniwue.jpp.ski.model.Competitor@d400aa3a, de.uniwue.jpp.ski.model.Competitor@f72cbc6b, de.uniwue.jpp.ski.model.Competitor@bafd5165, de.uniwue.jpp.ski.model.Competitor@c0a8c1cc, de.uniwue.jpp.ski.model.Competitor@969b1d02, de.uniwue.jpp.ski.model.Competitor@aa622e82, de.uniwue.jpp.ski.model.Competitor@d64fc745, de.uniwue.jpp.ski.model.Competitor@f99724dd, de.uniwue.jpp.ski.model.Competitor@7368e75e]>
  37.     [junit]     at tests.Util.assertEquals(Util.java:14)
  38.     [junit]     at tests.rounds.req.TestFinalRound.testCorrectSequence(TestFinalRound.java:60)
  39.     [junit]
  40.     [junit] Testcase: testSetAllAttemptsRanking took 0.001 sec
  41.     [junit]     Caused an ERROR
  42.     [junit] null
  43.     [junit] java.lang.IllegalStateException
  44.     [junit]     at de.uniwue.jpp.ski.model.rounds.FinalRound.setAttempts(FinalRound.java:49)
  45.     [junit]     at tests.rounds.req.TestFinalRound.testSetAllAttemptsRanking(TestFinalRound.java:104)
  46.     [junit]
  47.     [junit] Testcase: testListenersCallingOnce took 0.001 sec
  48.     [junit]     Caused an ERROR
  49.     [junit] null
  50.     [junit] java.lang.IllegalStateException
  51.     [junit]     at de.uniwue.jpp.ski.model.rounds.FinalRound.setAttempts(FinalRound.java:49)
  52.     [junit]     at tests.rounds.req.TestFinalRound.testListenersCallingOnce(TestFinalRound.java:117)
  53.     [junit]
  54.     [junit] Testcase: testListenersCallingOften took 0.001 sec
  55.     [junit]     Caused an ERROR
  56.     [junit] null
  57.     [junit] java.lang.IllegalStateException
  58.     [junit]     at de.uniwue.jpp.ski.model.rounds.FinalRound.setAttempts(FinalRound.java:49)
  59.     [junit]     at tests.rounds.req.TestFinalRound.testListenersCallingOften(TestFinalRound.java:130)
  60.     [junit]
  61.     [junit] TEST tests.rounds.req.TestFinalRound FAILED
RAW Paste Data
We use cookies for various purposes including analytics. By continuing to use Pastebin, you agree to our use of cookies as described in the Cookies Policy. OK, I Understand
 
Top