Guest User

Untitled

a guest
Jul 9th, 2019
23
Never
Not a member of Pastebin yet? Sign Up, it unlocks many cool features!
  1. INFO] Scanning for projects...
  2. [INFO]
  3. [INFO] ------------------< org.apache.maven:standalone-pom >-------------------
  4. [INFO] Building Maven Stub Project (No POM) 1
  5. [INFO] --------------------------------[ pom ]---------------------------------
  6. [INFO]
  7. [INFO] --- openmrs-sdk-maven-plugin:3.13.2:deploy (default-cli) @ standalone-pom ---
  8. [INFO] ------------------------------------------------------------------------
  9. [INFO] BUILD FAILURE
  10. [INFO] ------------------------------------------------------------------------
  11. [INFO] Total time: 7.327 s
  12. [INFO] Finished at: 2019-07-09T21:22:00+05:30
  13. [INFO] ------------------------------------------------------------------------
  14. [ERROR] Failed to execute goal org.openmrs.maven.plugins:openmrs-sdk-maven-plugin:3.13.2:deploy (default-cli) on project standalone-pom: Execution default-cli of goal org.openmrs.maven.plugins:openmrs-sdk-maven-plugin:3.13.2:deploy failed: -1 -> [Help 1]
  15. [ERROR]
  16. [ERROR] To see the full stack trace of the errors, re-run Maven with the -e switch.
  17. [ERROR] Re-run Maven using the -X switch to enable full debug logging.
  18. [ERROR]
  19. [ERROR] For more information about the errors and possible solutions, please read the following articles:
  20. [ERROR] [Help 1] http://cwiki.apache.org/confluence/display/MAVEN/PluginExecutionException
RAW Paste Data Copied