Advertisement
Guest User

Untitled

a guest
Jul 14th, 2018
140
Never
Not a member of Pastebin yet? Sign Up, it unlocks many cool features!
text 81.27 KB | None
  1. ERROR - PatientSearch.createCompositionSearch(210) |2018-07-14 08:00:56,992| Error in token list
  2. java.lang.IllegalArgumentException: Unrecognized string token: male
  3. at org.openmrs.reporting.PatientSearch.createCompositionSearch(PatientSearch.java:196)
  4. at org.openmrs.reporting.PatientSearch.createCompositionSearch(PatientSearch.java:160)
  5. at org.openmrs.report.PepfarReportSerializationTest.shouldCohortSerialization(PepfarReportSerializationTest.java:138)
  6. at sun.reflect.NativeMethodAccessorImpl.invoke0(Native Method)
  7. at sun.reflect.NativeMethodAccessorImpl.invoke(NativeMethodAccessorImpl.java:57)
  8. at sun.reflect.DelegatingMethodAccessorImpl.invoke(DelegatingMethodAccessorImpl.java:43)
  9. at java.lang.reflect.Method.invoke(Method.java:606)
  10. at org.junit.runners.model.FrameworkMethod$1.runReflectiveCall(FrameworkMethod.java:47)
  11. at org.junit.internal.runners.model.ReflectiveCallable.run(ReflectiveCallable.java:12)
  12. at org.junit.runners.model.FrameworkMethod.invokeExplosively(FrameworkMethod.java:44)
  13. at org.junit.internal.runners.statements.InvokeMethod.evaluate(InvokeMethod.java:17)
  14. at org.junit.internal.runners.statements.RunBefores.evaluate(RunBefores.java:26)
  15. at org.springframework.test.context.junit4.statements.RunBeforeTestMethodCallbacks.evaluate(RunBeforeTestMethodCallbacks.java:74)
  16. at org.junit.internal.runners.statements.RunAfters.evaluate(RunAfters.java:27)
  17. at org.springframework.test.context.junit4.statements.RunAfterTestMethodCallbacks.evaluate(RunAfterTestMethodCallbacks.java:82)
  18. at org.springframework.test.context.junit4.statements.SpringRepeat.evaluate(SpringRepeat.java:72)
  19. at org.springframework.test.context.junit4.SpringJUnit4ClassRunner.runChild(SpringJUnit4ClassRunner.java:240)
  20. at org.junit.runners.BlockJUnit4ClassRunner.runChild(BlockJUnit4ClassRunner.java:50)
  21. at org.junit.runners.ParentRunner$3.run(ParentRunner.java:238)
  22. at org.junit.runners.ParentRunner$1.schedule(ParentRunner.java:63)
  23. at org.junit.runners.ParentRunner.runChildren(ParentRunner.java:236)
  24. at org.junit.runners.ParentRunner.access$000(ParentRunner.java:53)
  25. at org.junit.runners.ParentRunner$2.evaluate(ParentRunner.java:229)
  26. at org.springframework.test.context.junit4.statements.RunBeforeTestClassCallbacks.evaluate(RunBeforeTestClassCallbacks.java:61)
  27. at org.junit.internal.runners.statements.RunAfters.evaluate(RunAfters.java:27)
  28. at org.springframework.test.context.junit4.statements.RunAfterTestClassCallbacks.evaluate(RunAfterTestClassCallbacks.java:70)
  29. at org.junit.runners.ParentRunner.run(ParentRunner.java:309)
  30. at org.springframework.test.context.junit4.SpringJUnit4ClassRunner.run(SpringJUnit4ClassRunner.java:180)
  31. at org.apache.maven.surefire.junit4.JUnit4TestSet.execute(JUnit4TestSet.java:59)
  32. at org.apache.maven.surefire.suite.AbstractDirectoryTestSuite.executeTestSet(AbstractDirectoryTestSuite.java:115)
  33. at org.apache.maven.surefire.suite.AbstractDirectoryTestSuite.execute(AbstractDirectoryTestSuite.java:102)
  34. at org.apache.maven.surefire.Surefire.run(Surefire.java:180)
  35. at sun.reflect.NativeMethodAccessorImpl.invoke0(Native Method)
  36. at sun.reflect.NativeMethodAccessorImpl.invoke(NativeMethodAccessorImpl.java:57)
  37. at sun.reflect.DelegatingMethodAccessorImpl.invoke(DelegatingMethodAccessorImpl.java:43)
  38. at java.lang.reflect.Method.invoke(Method.java:606)
  39. at org.apache.maven.surefire.booter.SurefireBooter.runSuitesInProcess(SurefireBooter.java:350)
  40. at org.apache.maven.surefire.booter.SurefireBooter.main(SurefireBooter.java:1021)
  41. Tests run: 4, Failures: 0, Errors: 0, Skipped: 0, Time elapsed: 0.456 sec
  42. Running org.openmrs.api.LocationServiceTest
  43. Tests run: 70, Failures: 0, Errors: 0, Skipped: 2, Time elapsed: 4.402 sec
  44. Running org.openmrs.module.ModuleClassLoaderTest
  45. Tests run: 8, Failures: 0, Errors: 0, Skipped: 0, Time elapsed: 0.477 sec
  46. Running org.openmrs.report.PepfarReportTest
  47. Tests run: 1, Failures: 0, Errors: 0, Skipped: 0, Time elapsed: 0.117 sec
  48. Running org.openmrs.propertyeditor.RoleEditorTest
  49. Tests run: 2, Failures: 0, Errors: 0, Skipped: 0, Time elapsed: 0.13 sec
  50. Running org.openmrs.report.PepfarReportFromXmlTest
  51. ERROR - OpenmrsUtil.toPatientFilter(1791) |2018-07-14 08:01:02,524| class org.openmrs.reporting.ProgramStatePatientFilter . program should be class org.openmrs.Program but is given as class java.lang.Integer
  52. Tests run: 2, Failures: 0, Errors: 0, Skipped: 0, Time elapsed: 0.333 sec
  53. Running org.openmrs.validator.FormValidatorTest
  54. Tests run: 6, Failures: 0, Errors: 0, Skipped: 0, Time elapsed: 0.355 sec
  55. Running org.openmrs.validator.RequireNameValidatorTest
  56. Tests run: 2, Failures: 0, Errors: 0, Skipped: 0, Time elapsed: 0.001 sec
  57. Running org.openmrs.validator.PersonAttributeTypeValidatorTest
  58. Tests run: 4, Failures: 0, Errors: 0, Skipped: 0, Time elapsed: 0.242 sec
  59. Running org.openmrs.util.ExceptionUtilTest
  60. Tests run: 1, Failures: 0, Errors: 0, Skipped: 0, Time elapsed: 0.004 sec
  61. Running org.openmrs.propertyeditor.ConceptClassEditorTest
  62. Tests run: 2, Failures: 0, Errors: 0, Skipped: 0, Time elapsed: 0.128 sec
  63. Running org.openmrs.validator.PersonNameValidatorTest
  64. Tests run: 36, Failures: 0, Errors: 0, Skipped: 0, Time elapsed: 2.086 sec
  65. Running org.openmrs.api.PatientSetServiceTest
  66. Tests run: 28, Failures: 0, Errors: 0, Skipped: 0, Time elapsed: 1.753 sec
  67. Running org.openmrs.validator.LocationValidatorTest
  68. Tests run: 6, Failures: 0, Errors: 0, Skipped: 0, Time elapsed: 0.36 sec
  69. Running org.openmrs.annotation.OpenmrsProfileExcludeFilterTest
  70. Tests run: 7, Failures: 0, Errors: 0, Skipped: 0, Time elapsed: 0.415 sec
  71. Running org.openmrs.reporting.export.DataExportTest
  72. Tests run: 12, Failures: 0, Errors: 0, Skipped: 0, Time elapsed: 8.027 sec
  73. Running org.openmrs.validator.RelationshipTypeValidatorTest
  74. Tests run: 3, Failures: 0, Errors: 0, Skipped: 0, Time elapsed: 0.004 sec
  75. Running org.openmrs.api.UserServiceTest
  76. Tests run: 71, Failures: 0, Errors: 0, Skipped: 1, Time elapsed: 4.327 sec
  77. Running org.openmrs.api.db.ContextDAOTest
  78. Tests run: 20, Failures: 0, Errors: 0, Skipped: 0, Time elapsed: 1.31 sec
  79. Running org.openmrs.reporting.CachingPatientFilterTest
  80. Tests run: 1, Failures: 0, Errors: 0, Skipped: 0, Time elapsed: 0.081 sec
  81. Running org.openmrs.validator.SchedulerFormValidatorTest
  82. Tests run: 8, Failures: 0, Errors: 0, Skipped: 0, Time elapsed: 0.006 sec
  83. Running org.openmrs.validator.PatientIdentifierTypeValidatorTest
  84. Tests run: 6, Failures: 0, Errors: 0, Skipped: 0, Time elapsed: 0.399 sec
  85. Running org.openmrs.validator.PatientProgramValidatorTest
  86. Tests run: 16, Failures: 0, Errors: 0, Skipped: 0, Time elapsed: 0.998 sec
  87. Running org.openmrs.validator.ConceptMapTypeValidatorTest
  88. Tests run: 6, Failures: 0, Errors: 0, Skipped: 0, Time elapsed: 0.351 sec
  89. Running org.openmrs.util.OpenmrsClassLoaderTest
  90. Tests run: 1, Failures: 0, Errors: 0, Skipped: 0, Time elapsed: 0.011 sec
  91. Running org.openmrs.validator.UserValidatorTest
  92. Tests run: 17, Failures: 0, Errors: 0, Skipped: 0, Time elapsed: 0.969 sec
  93. Running org.openmrs.ConceptWordTest
  94. Tests run: 2, Failures: 0, Errors: 0, Skipped: 0, Time elapsed: 0.122 sec
  95. Running org.openmrs.api.handler.ExistingVisitAssignmentHandlerTest
  96. Tests run: 3, Failures: 0, Errors: 0, Skipped: 0, Time elapsed: 0.229 sec
  97. Running org.openmrs.api.AdministrationServiceTest
  98. ERROR - MutableResourceBundleMessageSource.findPropertiesFiles(319) |2018-07-14 08:01:26,283| Error generated
  99. java.io.FileNotFoundException: class path resource [WEB-INF/] cannot be resolved to URL because it does not exist
  100. at org.springframework.core.io.ClassPathResource.getURL(ClassPathResource.java:179)
  101. at org.springframework.core.io.AbstractFileResolvingResource.getFile(AbstractFileResolvingResource.java:48)
  102. at org.openmrs.messagesource.impl.MutableResourceBundleMessageSource.findPropertiesFiles(MutableResourceBundleMessageSource.java:307)
  103. at org.openmrs.messagesource.impl.MutableResourceBundleMessageSource.findLocales(MutableResourceBundleMessageSource.java:89)
  104. at org.openmrs.messagesource.impl.MutableResourceBundleMessageSource.getLocales(MutableResourceBundleMessageSource.java:66)
  105. at org.openmrs.messagesource.impl.MessageSourceServiceImpl.getLocales(MessageSourceServiceImpl.java:82)
  106. at sun.reflect.NativeMethodAccessorImpl.invoke0(Native Method)
  107. at sun.reflect.NativeMethodAccessorImpl.invoke(NativeMethodAccessorImpl.java:57)
  108. at sun.reflect.DelegatingMethodAccessorImpl.invoke(DelegatingMethodAccessorImpl.java:43)
  109. at java.lang.reflect.Method.invoke(Method.java:606)
  110. at org.springframework.aop.support.AopUtils.invokeJoinpointUsingReflection(AopUtils.java:309)
  111. at org.springframework.aop.framework.ReflectiveMethodInvocation.invokeJoinpoint(ReflectiveMethodInvocation.java:183)
  112. at org.springframework.aop.framework.ReflectiveMethodInvocation.proceed(ReflectiveMethodInvocation.java:150)
  113. at org.springframework.transaction.interceptor.TransactionInterceptor.invoke(TransactionInterceptor.java:110)
  114. at org.springframework.aop.framework.ReflectiveMethodInvocation.proceed(ReflectiveMethodInvocation.java:172)
  115. at org.openmrs.aop.LoggingAdvice.invoke(LoggingAdvice.java:118)
  116. at org.springframework.aop.framework.ReflectiveMethodInvocation.proceed(ReflectiveMethodInvocation.java:172)
  117. at org.springframework.aop.framework.adapter.MethodBeforeAdviceInterceptor.invoke(MethodBeforeAdviceInterceptor.java:50)
  118. at org.springframework.aop.framework.ReflectiveMethodInvocation.proceed(ReflectiveMethodInvocation.java:172)
  119. at org.springframework.aop.framework.adapter.MethodBeforeAdviceInterceptor.invoke(MethodBeforeAdviceInterceptor.java:50)
  120. at org.springframework.aop.framework.ReflectiveMethodInvocation.proceed(ReflectiveMethodInvocation.java:172)
  121. at org.springframework.aop.framework.JdkDynamicAopProxy.invoke(JdkDynamicAopProxy.java:202)
  122. at com.sun.proxy.$Proxy19.getLocales(Unknown Source)
  123. at sun.reflect.NativeMethodAccessorImpl.invoke0(Native Method)
  124. at sun.reflect.NativeMethodAccessorImpl.invoke(NativeMethodAccessorImpl.java:57)
  125. at sun.reflect.DelegatingMethodAccessorImpl.invoke(DelegatingMethodAccessorImpl.java:43)
  126. at java.lang.reflect.Method.invoke(Method.java:606)
  127. at org.springframework.aop.support.AopUtils.invokeJoinpointUsingReflection(AopUtils.java:309)
  128. at org.springframework.aop.framework.ReflectiveMethodInvocation.invokeJoinpoint(ReflectiveMethodInvocation.java:183)
  129. at org.springframework.aop.framework.ReflectiveMethodInvocation.proceed(ReflectiveMethodInvocation.java:150)
  130. at org.springframework.transaction.interceptor.TransactionInterceptor.invoke(TransactionInterceptor.java:110)
  131. at org.springframework.aop.framework.ReflectiveMethodInvocation.proceed(ReflectiveMethodInvocation.java:172)
  132. at org.springframework.aop.framework.JdkDynamicAopProxy.invoke(JdkDynamicAopProxy.java:202)
  133. at com.sun.proxy.$Proxy71.getLocales(Unknown Source)
  134. at org.openmrs.api.impl.AdministrationServiceImpl.getPresentationLocales(AdministrationServiceImpl.java:1014)
  135. at sun.reflect.NativeMethodAccessorImpl.invoke0(Native Method)
  136. at sun.reflect.NativeMethodAccessorImpl.invoke(NativeMethodAccessorImpl.java:57)
  137. at sun.reflect.DelegatingMethodAccessorImpl.invoke(DelegatingMethodAccessorImpl.java:43)
  138. at java.lang.reflect.Method.invoke(Method.java:606)
  139. at org.springframework.aop.support.AopUtils.invokeJoinpointUsingReflection(AopUtils.java:309)
  140. at org.springframework.aop.framework.ReflectiveMethodInvocation.invokeJoinpoint(ReflectiveMethodInvocation.java:183)
  141. at org.springframework.aop.framework.ReflectiveMethodInvocation.proceed(ReflectiveMethodInvocation.java:150)
  142. at org.springframework.transaction.interceptor.TransactionInterceptor.invoke(TransactionInterceptor.java:110)
  143. at org.springframework.aop.framework.ReflectiveMethodInvocation.proceed(ReflectiveMethodInvocation.java:172)
  144. at org.springframework.aop.framework.JdkDynamicAopProxy.invoke(JdkDynamicAopProxy.java:202)
  145. at com.sun.proxy.$Proxy21.getPresentationLocales(Unknown Source)
  146. at sun.reflect.NativeMethodAccessorImpl.invoke0(Native Method)
  147. at sun.reflect.NativeMethodAccessorImpl.invoke(NativeMethodAccessorImpl.java:57)
  148. at sun.reflect.DelegatingMethodAccessorImpl.invoke(DelegatingMethodAccessorImpl.java:43)
  149. at java.lang.reflect.Method.invoke(Method.java:606)
  150. at org.springframework.aop.support.AopUtils.invokeJoinpointUsingReflection(AopUtils.java:309)
  151. at org.springframework.aop.framework.ReflectiveMethodInvocation.invokeJoinpoint(ReflectiveMethodInvocation.java:183)
  152. at org.springframework.aop.framework.ReflectiveMethodInvocation.proceed(ReflectiveMethodInvocation.java:150)
  153. at org.springframework.transaction.interceptor.TransactionInterceptor.invoke(TransactionInterceptor.java:110)
  154. at org.springframework.aop.framework.ReflectiveMethodInvocation.proceed(ReflectiveMethodInvocation.java:172)
  155. at org.openmrs.aop.LoggingAdvice.invoke(LoggingAdvice.java:118)
  156. at org.springframework.aop.framework.ReflectiveMethodInvocation.proceed(ReflectiveMethodInvocation.java:172)
  157. at org.springframework.aop.framework.adapter.MethodBeforeAdviceInterceptor.invoke(MethodBeforeAdviceInterceptor.java:50)
  158. at org.springframework.aop.framework.ReflectiveMethodInvocation.proceed(ReflectiveMethodInvocation.java:172)
  159. at org.springframework.aop.framework.adapter.MethodBeforeAdviceInterceptor.invoke(MethodBeforeAdviceInterceptor.java:50)
  160. at org.springframework.aop.framework.ReflectiveMethodInvocation.proceed(ReflectiveMethodInvocation.java:172)
  161. at org.springframework.aop.framework.JdkDynamicAopProxy.invoke(JdkDynamicAopProxy.java:202)
  162. at com.sun.proxy.$Proxy40.getPresentationLocales(Unknown Source)
  163. at sun.reflect.NativeMethodAccessorImpl.invoke0(Native Method)
  164. at sun.reflect.NativeMethodAccessorImpl.invoke(NativeMethodAccessorImpl.java:57)
  165. at sun.reflect.DelegatingMethodAccessorImpl.invoke(DelegatingMethodAccessorImpl.java:43)
  166. at java.lang.reflect.Method.invoke(Method.java:606)
  167. at org.springframework.aop.support.AopUtils.invokeJoinpointUsingReflection(AopUtils.java:309)
  168. at org.springframework.aop.framework.ReflectiveMethodInvocation.invokeJoinpoint(ReflectiveMethodInvocation.java:183)
  169. at org.springframework.aop.framework.ReflectiveMethodInvocation.proceed(ReflectiveMethodInvocation.java:150)
  170. at org.springframework.transaction.interceptor.TransactionInterceptor.invoke(TransactionInterceptor.java:110)
  171. at org.springframework.aop.framework.ReflectiveMethodInvocation.proceed(ReflectiveMethodInvocation.java:172)
  172. at org.springframework.aop.framework.JdkDynamicAopProxy.invoke(JdkDynamicAopProxy.java:202)
  173. at com.sun.proxy.$Proxy40.getPresentationLocales(Unknown Source)
  174. at org.openmrs.api.AdministrationServiceTest.getPresentationLocales_shouldNotReturnMoreLocalesThanMessageSourceServiceLocales(AdministrationServiceTest.java:414)
  175. at sun.reflect.NativeMethodAccessorImpl.invoke0(Native Method)
  176. at sun.reflect.NativeMethodAccessorImpl.invoke(NativeMethodAccessorImpl.java:57)
  177. at sun.reflect.DelegatingMethodAccessorImpl.invoke(DelegatingMethodAccessorImpl.java:43)
  178. at java.lang.reflect.Method.invoke(Method.java:606)
  179. at org.junit.runners.model.FrameworkMethod$1.runReflectiveCall(FrameworkMethod.java:47)
  180. at org.junit.internal.runners.model.ReflectiveCallable.run(ReflectiveCallable.java:12)
  181. at org.junit.runners.model.FrameworkMethod.invokeExplosively(FrameworkMethod.java:44)
  182. at org.junit.internal.runners.statements.InvokeMethod.evaluate(InvokeMethod.java:17)
  183. at org.junit.internal.runners.statements.RunBefores.evaluate(RunBefores.java:26)
  184. at org.springframework.test.context.junit4.statements.RunBeforeTestMethodCallbacks.evaluate(RunBeforeTestMethodCallbacks.java:74)
  185. at org.junit.internal.runners.statements.RunAfters.evaluate(RunAfters.java:27)
  186. at org.springframework.test.context.junit4.statements.RunAfterTestMethodCallbacks.evaluate(RunAfterTestMethodCallbacks.java:82)
  187. at org.springframework.test.context.junit4.statements.SpringRepeat.evaluate(SpringRepeat.java:72)
  188. at org.springframework.test.context.junit4.SpringJUnit4ClassRunner.runChild(SpringJUnit4ClassRunner.java:240)
  189. at org.junit.runners.BlockJUnit4ClassRunner.runChild(BlockJUnit4ClassRunner.java:50)
  190. at org.junit.runners.ParentRunner$3.run(ParentRunner.java:238)
  191. at org.junit.runners.ParentRunner$1.schedule(ParentRunner.java:63)
  192. at org.junit.runners.ParentRunner.runChildren(ParentRunner.java:236)
  193. at org.junit.runners.ParentRunner.access$000(ParentRunner.java:53)
  194. at org.junit.runners.ParentRunner$2.evaluate(ParentRunner.java:229)
  195. at org.springframework.test.context.junit4.statements.RunBeforeTestClassCallbacks.evaluate(RunBeforeTestClassCallbacks.java:61)
  196. at org.junit.internal.runners.statements.RunAfters.evaluate(RunAfters.java:27)
  197. at org.springframework.test.context.junit4.statements.RunAfterTestClassCallbacks.evaluate(RunAfterTestClassCallbacks.java:70)
  198. at org.junit.runners.ParentRunner.run(ParentRunner.java:309)
  199. at org.springframework.test.context.junit4.SpringJUnit4ClassRunner.run(SpringJUnit4ClassRunner.java:180)
  200. at org.apache.maven.surefire.junit4.JUnit4TestSet.execute(JUnit4TestSet.java:59)
  201. at org.apache.maven.surefire.suite.AbstractDirectoryTestSuite.executeTestSet(AbstractDirectoryTestSuite.java:115)
  202. at org.apache.maven.surefire.suite.AbstractDirectoryTestSuite.execute(AbstractDirectoryTestSuite.java:102)
  203. at org.apache.maven.surefire.Surefire.run(Surefire.java:180)
  204. at sun.reflect.NativeMethodAccessorImpl.invoke0(Native Method)
  205. at sun.reflect.NativeMethodAccessorImpl.invoke(NativeMethodAccessorImpl.java:57)
  206. at sun.reflect.DelegatingMethodAccessorImpl.invoke(DelegatingMethodAccessorImpl.java:43)
  207. at java.lang.reflect.Method.invoke(Method.java:606)
  208. at org.apache.maven.surefire.booter.SurefireBooter.runSuitesInProcess(SurefireBooter.java:350)
  209. at org.apache.maven.surefire.booter.SurefireBooter.main(SurefireBooter.java:1021)
  210. Tests run: 41, Failures: 0, Errors: 0, Skipped: 4, Time elapsed: 2.259 sec
  211. Running org.openmrs.report.RowPerObsDatasetTest
  212. Tests run: 1, Failures: 0, Errors: 0, Skipped: 0, Time elapsed: 0.064 sec
  213. Running org.openmrs.annotation.OpenmrsProfileIncludeFilterTest
  214. Tests run: 2, Failures: 0, Errors: 0, Skipped: 0, Time elapsed: 0.12 sec
  215. Running org.openmrs.api.PersonServiceTest
  216. Tests run: 112, Failures: 0, Errors: 0, Skipped: 2, Time elapsed: 7.137 sec
  217. Running org.openmrs.validator.ConceptDatatypeValidatorTest
  218. Tests run: 3, Failures: 0, Errors: 0, Skipped: 0, Time elapsed: 0.003 sec
  219. Running org.openmrs.api.ConceptServiceTest
  220. ERROR - JDBCExceptionReporter.logExceptions(234) |2018-07-14 08:01:41,625| NULL not allowed for column "DESCRIPTION"; SQL statement:
  221. insert into concept_name_tag (concept_name_tag_id, tag, description, date_created, creator, voided, date_voided, void_reason, voided_by, uuid) values (null, ?, ?, ?, ?, ?, ?, ?, ?, ?) [90006-135]
  222. ERROR - JDBCExceptionReporter.logExceptions(234) |2018-07-14 08:01:42,851| NULL not allowed for column "DESCRIPTION"; SQL statement:
  223. insert into concept_name_tag (concept_name_tag_id, tag, description, date_created, creator, voided, date_voided, void_reason, voided_by, uuid) values (null, ?, ?, ?, ?, ?, ?, ?, ?, ?) [90006-135]
  224. Tests run: 170, Failures: 0, Errors: 0, Skipped: 0, Time elapsed: 10.54 sec
  225. Running org.openmrs.patient.impl.LuhnIdentifierValidatorTest
  226. Tests run: 3, Failures: 0, Errors: 0, Skipped: 0, Time elapsed: 0.002 sec
  227. Running org.openmrs.api.db.UserDAOTest
  228. Tests run: 8, Failures: 0, Errors: 0, Skipped: 0, Time elapsed: 0.488 sec
  229. Running org.openmrs.validator.StateConversionValidatorTest
  230. Tests run: 4, Failures: 0, Errors: 0, Skipped: 0, Time elapsed: 0.244 sec
  231. Running org.openmrs.propertyeditor.UserEditorTest
  232. Tests run: 2, Failures: 0, Errors: 0, Skipped: 0, Time elapsed: 0.124 sec
  233. Running org.openmrs.api.PatientServiceTest
  234. Tests run: 162, Failures: 0, Errors: 0, Skipped: 2, Time elapsed: 11.369 sec
  235. Running org.openmrs.api.ObsServiceTest
  236. ERROR - ImageHandler.getObs(70) |2018-07-14 08:02:01,056| Trying to read file: /var/folders/mk/4rc4cr1949l440b2lgzqt1gc0000gn/T/appdir-for-unit-tests-3155911846716566407/complex_obs/openmrs_logo_small.gif
  237. javax.imageio.IIOException: Can't read input file!
  238. at javax.imageio.ImageIO.read(ImageIO.java:1301)
  239. at org.openmrs.obs.handler.ImageHandler.getObs(ImageHandler.java:67)
  240. at org.openmrs.api.impl.ObsServiceImpl.getComplexObs(ObsServiceImpl.java:710)
  241. at sun.reflect.NativeMethodAccessorImpl.invoke0(Native Method)
  242. at sun.reflect.NativeMethodAccessorImpl.invoke(NativeMethodAccessorImpl.java:57)
  243. at sun.reflect.DelegatingMethodAccessorImpl.invoke(DelegatingMethodAccessorImpl.java:43)
  244. at java.lang.reflect.Method.invoke(Method.java:606)
  245. at org.springframework.aop.support.AopUtils.invokeJoinpointUsingReflection(AopUtils.java:309)
  246. at org.springframework.aop.framework.ReflectiveMethodInvocation.invokeJoinpoint(ReflectiveMethodInvocation.java:183)
  247. at org.springframework.aop.framework.ReflectiveMethodInvocation.proceed(ReflectiveMethodInvocation.java:150)
  248. at org.springframework.transaction.interceptor.TransactionInterceptor.invoke(TransactionInterceptor.java:110)
  249. at org.springframework.aop.framework.ReflectiveMethodInvocation.proceed(ReflectiveMethodInvocation.java:172)
  250. at org.springframework.aop.framework.JdkDynamicAopProxy.invoke(JdkDynamicAopProxy.java:202)
  251. at com.sun.proxy.$Proxy30.getComplexObs(Unknown Source)
  252. at sun.reflect.NativeMethodAccessorImpl.invoke0(Native Method)
  253. at sun.reflect.NativeMethodAccessorImpl.invoke(NativeMethodAccessorImpl.java:57)
  254. at sun.reflect.DelegatingMethodAccessorImpl.invoke(DelegatingMethodAccessorImpl.java:43)
  255. at java.lang.reflect.Method.invoke(Method.java:606)
  256. at org.springframework.aop.support.AopUtils.invokeJoinpointUsingReflection(AopUtils.java:309)
  257. at org.springframework.aop.framework.ReflectiveMethodInvocation.invokeJoinpoint(ReflectiveMethodInvocation.java:183)
  258. at org.springframework.aop.framework.ReflectiveMethodInvocation.proceed(ReflectiveMethodInvocation.java:150)
  259. at org.springframework.transaction.interceptor.TransactionInterceptor.invoke(TransactionInterceptor.java:110)
  260. at org.springframework.aop.framework.ReflectiveMethodInvocation.proceed(ReflectiveMethodInvocation.java:172)
  261. at org.openmrs.aop.LoggingAdvice.invoke(LoggingAdvice.java:118)
  262. at org.springframework.aop.framework.ReflectiveMethodInvocation.proceed(ReflectiveMethodInvocation.java:172)
  263. at org.springframework.aop.framework.adapter.MethodBeforeAdviceInterceptor.invoke(MethodBeforeAdviceInterceptor.java:50)
  264. at org.springframework.aop.framework.ReflectiveMethodInvocation.proceed(ReflectiveMethodInvocation.java:172)
  265. at org.springframework.aop.framework.adapter.MethodBeforeAdviceInterceptor.invoke(MethodBeforeAdviceInterceptor.java:50)
  266. at org.springframework.aop.framework.ReflectiveMethodInvocation.proceed(ReflectiveMethodInvocation.java:172)
  267. at org.springframework.aop.framework.JdkDynamicAopProxy.invoke(JdkDynamicAopProxy.java:202)
  268. at com.sun.proxy.$Proxy31.getComplexObs(Unknown Source)
  269. at sun.reflect.NativeMethodAccessorImpl.invoke0(Native Method)
  270. at sun.reflect.NativeMethodAccessorImpl.invoke(NativeMethodAccessorImpl.java:57)
  271. at sun.reflect.DelegatingMethodAccessorImpl.invoke(DelegatingMethodAccessorImpl.java:43)
  272. at java.lang.reflect.Method.invoke(Method.java:606)
  273. at org.springframework.aop.support.AopUtils.invokeJoinpointUsingReflection(AopUtils.java:309)
  274. at org.springframework.aop.framework.ReflectiveMethodInvocation.invokeJoinpoint(ReflectiveMethodInvocation.java:183)
  275. at org.springframework.aop.framework.ReflectiveMethodInvocation.proceed(ReflectiveMethodInvocation.java:150)
  276. at org.springframework.transaction.interceptor.TransactionInterceptor.invoke(TransactionInterceptor.java:110)
  277. at org.springframework.aop.framework.ReflectiveMethodInvocation.proceed(ReflectiveMethodInvocation.java:172)
  278. at org.springframework.aop.framework.JdkDynamicAopProxy.invoke(JdkDynamicAopProxy.java:202)
  279. at com.sun.proxy.$Proxy31.getComplexObs(Unknown Source)
  280. at org.openmrs.api.ObsServiceTest.getComplexObs_shouldNotFailWithNullView(ObsServiceTest.java:414)
  281. at sun.reflect.NativeMethodAccessorImpl.invoke0(Native Method)
  282. at sun.reflect.NativeMethodAccessorImpl.invoke(NativeMethodAccessorImpl.java:57)
  283. at sun.reflect.DelegatingMethodAccessorImpl.invoke(DelegatingMethodAccessorImpl.java:43)
  284. at java.lang.reflect.Method.invoke(Method.java:606)
  285. at org.junit.runners.model.FrameworkMethod$1.runReflectiveCall(FrameworkMethod.java:47)
  286. at org.junit.internal.runners.model.ReflectiveCallable.run(ReflectiveCallable.java:12)
  287. at org.junit.runners.model.FrameworkMethod.invokeExplosively(FrameworkMethod.java:44)
  288. at org.junit.internal.runners.statements.InvokeMethod.evaluate(InvokeMethod.java:17)
  289. at org.junit.internal.runners.statements.RunBefores.evaluate(RunBefores.java:26)
  290. at org.springframework.test.context.junit4.statements.RunBeforeTestMethodCallbacks.evaluate(RunBeforeTestMethodCallbacks.java:74)
  291. at org.junit.internal.runners.statements.RunAfters.evaluate(RunAfters.java:27)
  292. at org.springframework.test.context.junit4.statements.RunAfterTestMethodCallbacks.evaluate(RunAfterTestMethodCallbacks.java:82)
  293. at org.springframework.test.context.junit4.statements.SpringRepeat.evaluate(SpringRepeat.java:72)
  294. at org.springframework.test.context.junit4.SpringJUnit4ClassRunner.runChild(SpringJUnit4ClassRunner.java:240)
  295. at org.junit.runners.BlockJUnit4ClassRunner.runChild(BlockJUnit4ClassRunner.java:50)
  296. at org.junit.runners.ParentRunner$3.run(ParentRunner.java:238)
  297. at org.junit.runners.ParentRunner$1.schedule(ParentRunner.java:63)
  298. at org.junit.runners.ParentRunner.runChildren(ParentRunner.java:236)
  299. at org.junit.runners.ParentRunner.access$000(ParentRunner.java:53)
  300. at org.junit.runners.ParentRunner$2.evaluate(ParentRunner.java:229)
  301. at org.springframework.test.context.junit4.statements.RunBeforeTestClassCallbacks.evaluate(RunBeforeTestClassCallbacks.java:61)
  302. at org.junit.internal.runners.statements.RunAfters.evaluate(RunAfters.java:27)
  303. at org.springframework.test.context.junit4.statements.RunAfterTestClassCallbacks.evaluate(RunAfterTestClassCallbacks.java:70)
  304. at org.junit.runners.ParentRunner.run(ParentRunner.java:309)
  305. at org.springframework.test.context.junit4.SpringJUnit4ClassRunner.run(SpringJUnit4ClassRunner.java:180)
  306. at org.apache.maven.surefire.junit4.JUnit4TestSet.execute(JUnit4TestSet.java:59)
  307. at org.apache.maven.surefire.suite.AbstractDirectoryTestSuite.executeTestSet(AbstractDirectoryTestSuite.java:115)
  308. at org.apache.maven.surefire.suite.AbstractDirectoryTestSuite.execute(AbstractDirectoryTestSuite.java:102)
  309. at org.apache.maven.surefire.Surefire.run(Surefire.java:180)
  310. at sun.reflect.NativeMethodAccessorImpl.invoke0(Native Method)
  311. at sun.reflect.NativeMethodAccessorImpl.invoke(NativeMethodAccessorImpl.java:57)
  312. at sun.reflect.DelegatingMethodAccessorImpl.invoke(DelegatingMethodAccessorImpl.java:43)
  313. at java.lang.reflect.Method.invoke(Method.java:606)
  314. at org.apache.maven.surefire.booter.SurefireBooter.runSuitesInProcess(SurefireBooter.java:350)
  315. at org.apache.maven.surefire.booter.SurefireBooter.main(SurefireBooter.java:1021)
  316. ERROR - ImageHandler.getObs(70) |2018-07-14 08:02:01,178| Trying to read file: /var/folders/mk/4rc4cr1949l440b2lgzqt1gc0000gn/T/appdir-for-unit-tests-2822704620966486314/complex_obs/openmrs_logo_small.gif
  317. javax.imageio.IIOException: Can't read input file!
  318. at javax.imageio.ImageIO.read(ImageIO.java:1301)
  319. at org.openmrs.obs.handler.ImageHandler.getObs(ImageHandler.java:67)
  320. at org.openmrs.api.impl.ObsServiceImpl.getComplexObs(ObsServiceImpl.java:710)
  321. at sun.reflect.NativeMethodAccessorImpl.invoke0(Native Method)
  322. at sun.reflect.NativeMethodAccessorImpl.invoke(NativeMethodAccessorImpl.java:57)
  323. at sun.reflect.DelegatingMethodAccessorImpl.invoke(DelegatingMethodAccessorImpl.java:43)
  324. at java.lang.reflect.Method.invoke(Method.java:606)
  325. at org.springframework.aop.support.AopUtils.invokeJoinpointUsingReflection(AopUtils.java:309)
  326. at org.springframework.aop.framework.ReflectiveMethodInvocation.invokeJoinpoint(ReflectiveMethodInvocation.java:183)
  327. at org.springframework.aop.framework.ReflectiveMethodInvocation.proceed(ReflectiveMethodInvocation.java:150)
  328. at org.springframework.transaction.interceptor.TransactionInterceptor.invoke(TransactionInterceptor.java:110)
  329. at org.springframework.aop.framework.ReflectiveMethodInvocation.proceed(ReflectiveMethodInvocation.java:172)
  330. at org.springframework.aop.framework.JdkDynamicAopProxy.invoke(JdkDynamicAopProxy.java:202)
  331. at com.sun.proxy.$Proxy30.getComplexObs(Unknown Source)
  332. at sun.reflect.NativeMethodAccessorImpl.invoke0(Native Method)
  333. at sun.reflect.NativeMethodAccessorImpl.invoke(NativeMethodAccessorImpl.java:57)
  334. at sun.reflect.DelegatingMethodAccessorImpl.invoke(DelegatingMethodAccessorImpl.java:43)
  335. at java.lang.reflect.Method.invoke(Method.java:606)
  336. at org.springframework.aop.support.AopUtils.invokeJoinpointUsingReflection(AopUtils.java:309)
  337. at org.springframework.aop.framework.ReflectiveMethodInvocation.invokeJoinpoint(ReflectiveMethodInvocation.java:183)
  338. at org.springframework.aop.framework.ReflectiveMethodInvocation.proceed(ReflectiveMethodInvocation.java:150)
  339. at org.springframework.transaction.interceptor.TransactionInterceptor.invoke(TransactionInterceptor.java:110)
  340. at org.springframework.aop.framework.ReflectiveMethodInvocation.proceed(ReflectiveMethodInvocation.java:172)
  341. at org.openmrs.aop.LoggingAdvice.invoke(LoggingAdvice.java:118)
  342. at org.springframework.aop.framework.ReflectiveMethodInvocation.proceed(ReflectiveMethodInvocation.java:172)
  343. at org.springframework.aop.framework.adapter.MethodBeforeAdviceInterceptor.invoke(MethodBeforeAdviceInterceptor.java:50)
  344. at org.springframework.aop.framework.ReflectiveMethodInvocation.proceed(ReflectiveMethodInvocation.java:172)
  345. at org.springframework.aop.framework.adapter.MethodBeforeAdviceInterceptor.invoke(MethodBeforeAdviceInterceptor.java:50)
  346. at org.springframework.aop.framework.ReflectiveMethodInvocation.proceed(ReflectiveMethodInvocation.java:172)
  347. at org.springframework.aop.framework.JdkDynamicAopProxy.invoke(JdkDynamicAopProxy.java:202)
  348. at com.sun.proxy.$Proxy31.getComplexObs(Unknown Source)
  349. at sun.reflect.NativeMethodAccessorImpl.invoke0(Native Method)
  350. at sun.reflect.NativeMethodAccessorImpl.invoke(NativeMethodAccessorImpl.java:57)
  351. at sun.reflect.DelegatingMethodAccessorImpl.invoke(DelegatingMethodAccessorImpl.java:43)
  352. at java.lang.reflect.Method.invoke(Method.java:606)
  353. at org.springframework.aop.support.AopUtils.invokeJoinpointUsingReflection(AopUtils.java:309)
  354. at org.springframework.aop.framework.ReflectiveMethodInvocation.invokeJoinpoint(ReflectiveMethodInvocation.java:183)
  355. at org.springframework.aop.framework.ReflectiveMethodInvocation.proceed(ReflectiveMethodInvocation.java:150)
  356. at org.springframework.transaction.interceptor.TransactionInterceptor.invoke(TransactionInterceptor.java:110)
  357. at org.springframework.aop.framework.ReflectiveMethodInvocation.proceed(ReflectiveMethodInvocation.java:172)
  358. at org.springframework.aop.framework.JdkDynamicAopProxy.invoke(JdkDynamicAopProxy.java:202)
  359. at com.sun.proxy.$Proxy31.getComplexObs(Unknown Source)
  360. at org.openmrs.api.ObsServiceTest.getComplexObs_shouldFillInComplexDataObjectForComplexObs(ObsServiceTest.java:396)
  361. at sun.reflect.NativeMethodAccessorImpl.invoke0(Native Method)
  362. at sun.reflect.NativeMethodAccessorImpl.invoke(NativeMethodAccessorImpl.java:57)
  363. at sun.reflect.DelegatingMethodAccessorImpl.invoke(DelegatingMethodAccessorImpl.java:43)
  364. at java.lang.reflect.Method.invoke(Method.java:606)
  365. at org.junit.runners.model.FrameworkMethod$1.runReflectiveCall(FrameworkMethod.java:47)
  366. at org.junit.internal.runners.model.ReflectiveCallable.run(ReflectiveCallable.java:12)
  367. at org.junit.runners.model.FrameworkMethod.invokeExplosively(FrameworkMethod.java:44)
  368. at org.junit.internal.runners.statements.InvokeMethod.evaluate(InvokeMethod.java:17)
  369. at org.junit.internal.runners.statements.RunBefores.evaluate(RunBefores.java:26)
  370. at org.springframework.test.context.junit4.statements.RunBeforeTestMethodCallbacks.evaluate(RunBeforeTestMethodCallbacks.java:74)
  371. at org.junit.internal.runners.statements.RunAfters.evaluate(RunAfters.java:27)
  372. at org.springframework.test.context.junit4.statements.RunAfterTestMethodCallbacks.evaluate(RunAfterTestMethodCallbacks.java:82)
  373. at org.springframework.test.context.junit4.statements.SpringRepeat.evaluate(SpringRepeat.java:72)
  374. at org.springframework.test.context.junit4.SpringJUnit4ClassRunner.runChild(SpringJUnit4ClassRunner.java:240)
  375. at org.junit.runners.BlockJUnit4ClassRunner.runChild(BlockJUnit4ClassRunner.java:50)
  376. at org.junit.runners.ParentRunner$3.run(ParentRunner.java:238)
  377. at org.junit.runners.ParentRunner$1.schedule(ParentRunner.java:63)
  378. at org.junit.runners.ParentRunner.runChildren(ParentRunner.java:236)
  379. at org.junit.runners.ParentRunner.access$000(ParentRunner.java:53)
  380. at org.junit.runners.ParentRunner$2.evaluate(ParentRunner.java:229)
  381. at org.springframework.test.context.junit4.statements.RunBeforeTestClassCallbacks.evaluate(RunBeforeTestClassCallbacks.java:61)
  382. at org.junit.internal.runners.statements.RunAfters.evaluate(RunAfters.java:27)
  383. at org.springframework.test.context.junit4.statements.RunAfterTestClassCallbacks.evaluate(RunAfterTestClassCallbacks.java:70)
  384. at org.junit.runners.ParentRunner.run(ParentRunner.java:309)
  385. at org.springframework.test.context.junit4.SpringJUnit4ClassRunner.run(SpringJUnit4ClassRunner.java:180)
  386. at org.apache.maven.surefire.junit4.JUnit4TestSet.execute(JUnit4TestSet.java:59)
  387. at org.apache.maven.surefire.suite.AbstractDirectoryTestSuite.executeTestSet(AbstractDirectoryTestSuite.java:115)
  388. at org.apache.maven.surefire.suite.AbstractDirectoryTestSuite.execute(AbstractDirectoryTestSuite.java:102)
  389. at org.apache.maven.surefire.Surefire.run(Surefire.java:180)
  390. at sun.reflect.NativeMethodAccessorImpl.invoke0(Native Method)
  391. at sun.reflect.NativeMethodAccessorImpl.invoke(NativeMethodAccessorImpl.java:57)
  392. at sun.reflect.DelegatingMethodAccessorImpl.invoke(DelegatingMethodAccessorImpl.java:43)
  393. at java.lang.reflect.Method.invoke(Method.java:606)
  394. at org.apache.maven.surefire.booter.SurefireBooter.runSuitesInProcess(SurefireBooter.java:350)
  395. at org.apache.maven.surefire.booter.SurefireBooter.main(SurefireBooter.java:1021)
  396. Tests run: 65, Failures: 0, Errors: 0, Skipped: 0, Time elapsed: 3.94 sec
  397. Running org.openmrs.scheduler.SchedulerUtilTest
  398. Tests run: 1, Failures: 0, Errors: 0, Skipped: 0, Time elapsed: 0.002 sec
  399. Running org.openmrs.propertyeditor.ConceptSourceEditorTest
  400. Tests run: 2, Failures: 0, Errors: 0, Skipped: 0, Time elapsed: 0.122 sec
  401. Running org.openmrs.propertyeditor.PersonAttributeTypeEditorTest
  402. Tests run: 2, Failures: 0, Errors: 0, Skipped: 0, Time elapsed: 0.121 sec
  403. Running org.openmrs.hl7.HL7ServiceTest
  404. Tests run: 26, Failures: 0, Errors: 0, Skipped: 2, Time elapsed: 1.603 sec
  405. Running org.openmrs.propertyeditor.OrderTypeEditorTest
  406. Tests run: 2, Failures: 0, Errors: 0, Skipped: 0, Time elapsed: 0.121 sec
  407. Running org.openmrs.notification.AlertServiceTest
  408. Tests run: 1, Failures: 0, Errors: 0, Skipped: 0, Time elapsed: 0.072 sec
  409. Running org.openmrs.report.RowPerProgramEnrollmentDatasetTest
  410. Tests run: 1, Failures: 0, Errors: 0, Skipped: 0, Time elapsed: 0.081 sec
  411.  
  412. Results :
  413.  
  414. Tests run: 2249, Failures: 0, Errors: 0, Skipped: 26
  415.  
  416. [INFO]
  417. [INFO] --- maven-jar-plugin:2.3.2:jar (default-jar) @ openmrs-api ---
  418. [INFO] Building jar: /Users/larry/workspace/lesidi/openmrs-core/api/target/openmrs-api-1.9.11.jar
  419. [INFO]
  420. [INFO] --- maven-jar-plugin:2.3.2:test-jar (default) @ openmrs-api ---
  421. [INFO] Building jar: /Users/larry/workspace/lesidi/openmrs-core/api/target/openmrs-api-1.9.11-tests.jar
  422. [INFO]
  423. [INFO] --- license-maven-plugin:2.6:check (default) @ openmrs-api ---
  424. [INFO] Checking licenses...
  425. [INFO]
  426. [INFO] --- maven-install-plugin:2.4:install (default-install) @ openmrs-api ---
  427. [INFO] Installing /Users/larry/workspace/lesidi/openmrs-core/api/target/openmrs-api-1.9.11.jar to /Users/larry/.m2/repository/org/openmrs/api/openmrs-api/1.9.11/openmrs-api-1.9.11.jar
  428. [INFO] Installing /Users/larry/workspace/lesidi/openmrs-core/api/pom.xml to /Users/larry/.m2/repository/org/openmrs/api/openmrs-api/1.9.11/openmrs-api-1.9.11.pom
  429. [INFO] Installing /Users/larry/workspace/lesidi/openmrs-core/api/target/openmrs-api-1.9.11-tests.jar to /Users/larry/.m2/repository/org/openmrs/api/openmrs-api/1.9.11/openmrs-api-1.9.11-tests.jar
  430. [INFO]
  431. [INFO] ------------------------------------------------------------------------
  432. [INFO] Building openmrs-web 1.9.11
  433. [INFO] ------------------------------------------------------------------------
  434. [INFO]
  435. [INFO] --- maven-clean-plugin:2.5:clean (default-clean) @ openmrs-web ---
  436. [INFO] Deleting /Users/larry/workspace/lesidi/openmrs-core/web/target
  437. [INFO]
  438. [INFO] --- buildnumber-maven-plugin:1.1:create (default) @ openmrs-web ---
  439. [INFO]
  440. [INFO] --- build-helper-maven-plugin:1.5:parse-version (parse-version) @ openmrs-web ---
  441. [INFO]
  442. [INFO] --- maven-java-formatter-plugin:0.3:format (default) @ openmrs-web ---
  443. [INFO] Using 'UTF-8' encoding to format source files.
  444. [INFO] Number of files to be formatted: 408
  445. [INFO] Successfully formatted: 0 file(s)
  446. [INFO] Fail to format : 0 file(s)
  447. [INFO] Skipped : 408 file(s)
  448. [INFO] Approximate time taken: 0s
  449. [INFO]
  450. [INFO] --- maven-resources-plugin:2.4:resources (default-resources) @ openmrs-web ---
  451. [INFO] Using 'UTF-8' encoding to copy filtered resources.
  452. [INFO] Copying 22 resources
  453. [INFO]
  454. [INFO] --- maven-compiler-plugin:2.1:compile (default-compile) @ openmrs-web ---
  455. [INFO] Compiling 345 source files to /Users/larry/workspace/lesidi/openmrs-core/web/target/classes
  456. [INFO]
  457. [INFO] --- maven-resources-plugin:2.4:testResources (default-testResources) @ openmrs-web ---
  458. [INFO] Using 'UTF-8' encoding to copy filtered resources.
  459. [INFO] Copying 18 resources
  460. [INFO]
  461. [INFO] --- maven-compiler-plugin:2.1:testCompile (default-testCompile) @ openmrs-web ---
  462. [INFO] Compiling 63 source files to /Users/larry/workspace/lesidi/openmrs-core/web/target/test-classes
  463. [INFO]
  464. [INFO] --- maven-surefire-plugin:2.5:test (default-test) @ openmrs-web ---
  465. [INFO] Surefire report directory: /Users/larry/workspace/lesidi/openmrs-core/web/target/surefire-reports
  466.  
  467. -------------------------------------------------------
  468. T E S T S
  469. -------------------------------------------------------
  470. Running org.openmrs.web.controller.encounter.LocationFormControllerTest
  471. Tests run: 3, Failures: 0, Errors: 0, Skipped: 0, Time elapsed: 9.857 sec
  472. Running org.openmrs.web.controller.user.RoleFormControllerTest
  473. Tests run: 1, Failures: 0, Errors: 0, Skipped: 0, Time elapsed: 0.303 sec
  474. Running org.openmrs.web.WebUtilTest
  475. Tests run: 7, Failures: 0, Errors: 0, Skipped: 0, Time elapsed: 0.008 sec
  476. Running org.openmrs.web.taglib.RequireTagTest
  477. Tests run: 6, Failures: 0, Errors: 0, Skipped: 0, Time elapsed: 0.313 sec
  478. Running org.openmrs.web.filter.update.UpdateFilterTest
  479. Tests run: 5, Failures: 0, Errors: 0, Skipped: 0, Time elapsed: 0.642 sec
  480. Running org.openmrs.web.controller.person.PersonAttributeTypeListControllerTest
  481. Tests run: 9, Failures: 0, Errors: 0, Skipped: 0, Time elapsed: 0.905 sec
  482. Running org.openmrs.web.controller.person.AddPersonControllerTest
  483. Tests run: 2, Failures: 0, Errors: 0, Skipped: 0, Time elapsed: 0.241 sec
  484. Running org.openmrs.web.order.OrderTest
  485. Tests run: 1, Failures: 0, Errors: 0, Skipped: 0, Time elapsed: 0.123 sec
  486. Running org.openmrs.web.servlet.ShowGraphServletTest
  487. Tests run: 7, Failures: 0, Errors: 0, Skipped: 0, Time elapsed: 0.943 sec
  488. Running org.openmrs.module.web.WebModuleUtilTest
  489. SLF4J: Class path contains multiple SLF4J bindings.
  490. SLF4J: Found binding in [jar:file:/Users/larry/.m2/repository/org/slf4j/slf4j-log4j12/1.6.0/slf4j-log4j12-1.6.0.jar!/org/slf4j/impl/StaticLoggerBinder.class]
  491. SLF4J: Found binding in [jar:file:/Users/larry/.m2/repository/org/slf4j/slf4j-log4j12/1.6.0/slf4j-log4j12-1.6.0.jar!/org/slf4j/impl/StaticLoggerBinder.class]
  492. SLF4J: See http://www.slf4j.org/codes.html#multiple_bindings for an explanation.
  493. Tests run: 2, Failures: 0, Errors: 0, Skipped: 0, Time elapsed: 1.872 sec
  494. Running org.openmrs.layout.web.NameTemplateTest
  495. Tests run: 2, Failures: 0, Errors: 0, Skipped: 0, Time elapsed: 0.005 sec
  496. Running org.openmrs.web.taglib.ForEachEncounterTagTest
  497. Tests run: 2, Failures: 0, Errors: 0, Skipped: 0, Time elapsed: 0.175 sec
  498. Running org.openmrs.web.dwr.DWRPatientServiceTest
  499. Tests run: 6, Failures: 0, Errors: 0, Skipped: 2, Time elapsed: 0.487 sec
  500. Running org.openmrs.scheduler.web.controller.SchedulerFormControllerTest
  501. Tests run: 3, Failures: 0, Errors: 0, Skipped: 0, Time elapsed: 0.294 sec
  502. Running org.openmrs.web.servlet.LoginServletTest
  503. Tests run: 3, Failures: 0, Errors: 0, Skipped: 0, Time elapsed: 0.232 sec
  504. Running org.openmrs.web.controller.concept.ConceptStopWordFormControllerTest
  505. Tests run: 2, Failures: 0, Errors: 0, Skipped: 0, Time elapsed: 0.17 sec
  506. Running org.openmrs.web.ForgotPasswordFormControllerTest
  507. WARN - HibernateUserDAO.getUserByUsername(103) |2018-07-14 08:02:28,399| request for username 'invaliduser' not found
  508. WARN - HibernateUserDAO.getUserByUsername(103) |2018-07-14 08:02:28,402| request for username 'invaliduser' not found
  509. WARN - HibernateUserDAO.getUserByUsername(103) |2018-07-14 08:02:28,403| request for username 'invaliduser' not found
  510. WARN - HibernateUserDAO.getUserByUsername(103) |2018-07-14 08:02:28,404| request for username 'invaliduser' not found
  511. WARN - HibernateUserDAO.getUserByUsername(103) |2018-07-14 08:02:28,488| request for username 'invaliduser' not found
  512. WARN - HibernateUserDAO.getUserByUsername(103) |2018-07-14 08:02:28,490| request for username 'invaliduser' not found
  513. WARN - HibernateUserDAO.getUserByUsername(103) |2018-07-14 08:02:28,490| request for username 'invaliduser' not found
  514. WARN - HibernateUserDAO.getUserByUsername(103) |2018-07-14 08:02:28,491| request for username 'invaliduser' not found
  515. WARN - HibernateUserDAO.getUserByUsername(103) |2018-07-14 08:02:28,492| request for username 'invaliduser' not found
  516. WARN - HibernateUserDAO.getUserByUsername(103) |2018-07-14 08:02:28,640| request for username 'invaliduser' not found
  517. WARN - HibernateUserDAO.getUserByUsername(103) |2018-07-14 08:02:28,641| request for username 'invaliduser' not found
  518. WARN - HibernateUserDAO.getUserByUsername(103) |2018-07-14 08:02:28,642| request for username 'invaliduser' not found
  519. WARN - HibernateUserDAO.getUserByUsername(103) |2018-07-14 08:02:28,643| request for username 'invaliduser' not found
  520. WARN - HibernateUserDAO.getUserByUsername(103) |2018-07-14 08:02:28,644| request for username 'invaliduser' not found
  521. Tests run: 8, Failures: 0, Errors: 0, Skipped: 0, Time elapsed: 0.659 sec
  522. Running org.openmrs.web.patient.PatientDashboardGraphControllerTest
  523. Tests run: 2, Failures: 0, Errors: 0, Skipped: 0, Time elapsed: 0.187 sec
  524. Running org.openmrs.scheduler.web.controller.SchedulerFormTest
  525. Tests run: 1, Failures: 0, Errors: 0, Skipped: 0, Time elapsed: 0.077 sec
  526. Running org.openmrs.web.dwr.ProviderListItemTest
  527. Tests run: 4, Failures: 0, Errors: 0, Skipped: 0, Time elapsed: 0.005 sec
  528. Running org.openmrs.web.controller.user.UserFormControllerTest
  529. Tests run: 2, Failures: 0, Errors: 0, Skipped: 0, Time elapsed: 0.213 sec
  530. Running org.openmrs.web.controller.user.ChangePasswordFormControllerTest
  531. Tests run: 13, Failures: 0, Errors: 0, Skipped: 0, Time elapsed: 0.907 sec
  532. Running org.openmrs.web.controller.patient.ShortPatientFormValidatorTest
  533. Tests run: 14, Failures: 0, Errors: 0, Skipped: 0, Time elapsed: 1.066 sec
  534. Running org.openmrs.web.filter.update.util.FilterUtilTest
  535. Tests run: 2, Failures: 0, Errors: 0, Skipped: 2, Time elapsed: 0.001 sec
  536. Running org.openmrs.web.dwr.DWRConceptServiceTest
  537. Tests run: 11, Failures: 0, Errors: 0, Skipped: 0, Time elapsed: 1.203 sec
  538. Running org.openmrs.web.controller.concept.ConceptSourceListControllerTest
  539. Tests run: 1, Failures: 0, Errors: 0, Skipped: 0, Time elapsed: 0.078 sec
  540. Running org.openmrs.web.controller.patient.ShortPatientFormControllerTest
  541. Tests run: 14, Failures: 0, Errors: 0, Skipped: 0, Time elapsed: 1.278 sec
  542. Running org.openmrs.web.controller.UserPropertiesTest
  543. Tests run: 6, Failures: 0, Errors: 0, Skipped: 0, Time elapsed: 0.003 sec
  544. Running org.openmrs.web.controller.OptionsFormControllerTest
  545. ERROR - MutableResourceBundleMessageSource.findPropertiesFiles(319) |2018-07-14 08:02:33,911| Error generated
  546. java.io.FileNotFoundException: class path resource [WEB-INF/] cannot be resolved to URL because it does not exist
  547. at org.springframework.core.io.ClassPathResource.getURL(ClassPathResource.java:179)
  548. at org.springframework.core.io.AbstractFileResolvingResource.getFile(AbstractFileResolvingResource.java:48)
  549. at org.openmrs.messagesource.impl.MutableResourceBundleMessageSource.findPropertiesFiles(MutableResourceBundleMessageSource.java:307)
  550. at org.openmrs.messagesource.impl.MutableResourceBundleMessageSource.findLocales(MutableResourceBundleMessageSource.java:89)
  551. at org.openmrs.messagesource.impl.MutableResourceBundleMessageSource.getLocales(MutableResourceBundleMessageSource.java:66)
  552. at sun.reflect.NativeMethodAccessorImpl.invoke0(Native Method)
  553. at sun.reflect.NativeMethodAccessorImpl.invoke(NativeMethodAccessorImpl.java:57)
  554. at sun.reflect.DelegatingMethodAccessorImpl.invoke(DelegatingMethodAccessorImpl.java:43)
  555. at java.lang.reflect.Method.invoke(Method.java:606)
  556. at org.springframework.aop.support.AopUtils.invokeJoinpointUsingReflection(AopUtils.java:309)
  557. at org.springframework.aop.framework.ReflectiveMethodInvocation.invokeJoinpoint(ReflectiveMethodInvocation.java:183)
  558. at org.springframework.aop.framework.ReflectiveMethodInvocation.proceed(ReflectiveMethodInvocation.java:150)
  559. at org.springframework.transaction.interceptor.TransactionInterceptor.invoke(TransactionInterceptor.java:110)
  560. at org.springframework.aop.framework.ReflectiveMethodInvocation.proceed(ReflectiveMethodInvocation.java:172)
  561. at org.springframework.aop.framework.JdkDynamicAopProxy.invoke(JdkDynamicAopProxy.java:202)
  562. at com.sun.proxy.$Proxy23.getLocales(Unknown Source)
  563. at org.openmrs.messagesource.impl.MessageSourceServiceImpl.getLocales(MessageSourceServiceImpl.java:82)
  564. at sun.reflect.NativeMethodAccessorImpl.invoke0(Native Method)
  565. at sun.reflect.NativeMethodAccessorImpl.invoke(NativeMethodAccessorImpl.java:57)
  566. at sun.reflect.DelegatingMethodAccessorImpl.invoke(DelegatingMethodAccessorImpl.java:43)
  567. at java.lang.reflect.Method.invoke(Method.java:606)
  568. at org.springframework.aop.support.AopUtils.invokeJoinpointUsingReflection(AopUtils.java:309)
  569. at org.springframework.aop.framework.ReflectiveMethodInvocation.invokeJoinpoint(ReflectiveMethodInvocation.java:183)
  570. at org.springframework.aop.framework.ReflectiveMethodInvocation.proceed(ReflectiveMethodInvocation.java:150)
  571. at org.springframework.transaction.interceptor.TransactionInterceptor.invoke(TransactionInterceptor.java:110)
  572. at org.springframework.aop.framework.ReflectiveMethodInvocation.proceed(ReflectiveMethodInvocation.java:172)
  573. at org.openmrs.aop.LoggingAdvice.invoke(LoggingAdvice.java:118)
  574. at org.springframework.aop.framework.ReflectiveMethodInvocation.proceed(ReflectiveMethodInvocation.java:172)
  575. at org.springframework.aop.framework.adapter.MethodBeforeAdviceInterceptor.invoke(MethodBeforeAdviceInterceptor.java:50)
  576. at org.springframework.aop.framework.ReflectiveMethodInvocation.proceed(ReflectiveMethodInvocation.java:172)
  577. at org.springframework.aop.framework.adapter.MethodBeforeAdviceInterceptor.invoke(MethodBeforeAdviceInterceptor.java:50)
  578. at org.springframework.aop.framework.ReflectiveMethodInvocation.proceed(ReflectiveMethodInvocation.java:172)
  579. at org.springframework.aop.framework.JdkDynamicAopProxy.invoke(JdkDynamicAopProxy.java:202)
  580. at com.sun.proxy.$Proxy21.getLocales(Unknown Source)
  581. at sun.reflect.NativeMethodAccessorImpl.invoke0(Native Method)
  582. at sun.reflect.NativeMethodAccessorImpl.invoke(NativeMethodAccessorImpl.java:57)
  583. at sun.reflect.DelegatingMethodAccessorImpl.invoke(DelegatingMethodAccessorImpl.java:43)
  584. at java.lang.reflect.Method.invoke(Method.java:606)
  585. at org.springframework.aop.support.AopUtils.invokeJoinpointUsingReflection(AopUtils.java:309)
  586. at org.springframework.aop.framework.ReflectiveMethodInvocation.invokeJoinpoint(ReflectiveMethodInvocation.java:183)
  587. at org.springframework.aop.framework.ReflectiveMethodInvocation.proceed(ReflectiveMethodInvocation.java:150)
  588. at org.springframework.transaction.interceptor.TransactionInterceptor.invoke(TransactionInterceptor.java:110)
  589. at org.springframework.aop.framework.ReflectiveMethodInvocation.proceed(ReflectiveMethodInvocation.java:172)
  590. at org.springframework.aop.framework.JdkDynamicAopProxy.invoke(JdkDynamicAopProxy.java:202)
  591. at com.sun.proxy.$Proxy75.getLocales(Unknown Source)
  592. at org.openmrs.api.impl.AdministrationServiceImpl.getPresentationLocales(AdministrationServiceImpl.java:1014)
  593. at sun.reflect.NativeMethodAccessorImpl.invoke0(Native Method)
  594. at sun.reflect.NativeMethodAccessorImpl.invoke(NativeMethodAccessorImpl.java:57)
  595. at sun.reflect.DelegatingMethodAccessorImpl.invoke(DelegatingMethodAccessorImpl.java:43)
  596. at java.lang.reflect.Method.invoke(Method.java:606)
  597. at org.springframework.aop.support.AopUtils.invokeJoinpointUsingReflection(AopUtils.java:309)
  598. at org.springframework.aop.framework.ReflectiveMethodInvocation.invokeJoinpoint(ReflectiveMethodInvocation.java:183)
  599. at org.springframework.aop.framework.ReflectiveMethodInvocation.proceed(ReflectiveMethodInvocation.java:150)
  600. at org.springframework.transaction.interceptor.TransactionInterceptor.invoke(TransactionInterceptor.java:110)
  601. at org.springframework.aop.framework.ReflectiveMethodInvocation.proceed(ReflectiveMethodInvocation.java:172)
  602. at org.springframework.aop.framework.JdkDynamicAopProxy.invoke(JdkDynamicAopProxy.java:202)
  603. at com.sun.proxy.$Proxy25.getPresentationLocales(Unknown Source)
  604. at sun.reflect.NativeMethodAccessorImpl.invoke0(Native Method)
  605. at sun.reflect.NativeMethodAccessorImpl.invoke(NativeMethodAccessorImpl.java:57)
  606. at sun.reflect.DelegatingMethodAccessorImpl.invoke(DelegatingMethodAccessorImpl.java:43)
  607. at java.lang.reflect.Method.invoke(Method.java:606)
  608. at org.springframework.aop.support.AopUtils.invokeJoinpointUsingReflection(AopUtils.java:309)
  609. at org.springframework.aop.framework.ReflectiveMethodInvocation.invokeJoinpoint(ReflectiveMethodInvocation.java:183)
  610. at org.springframework.aop.framework.ReflectiveMethodInvocation.proceed(ReflectiveMethodInvocation.java:150)
  611. at org.springframework.transaction.interceptor.TransactionInterceptor.invoke(TransactionInterceptor.java:110)
  612. at org.springframework.aop.framework.ReflectiveMethodInvocation.proceed(ReflectiveMethodInvocation.java:172)
  613. at org.openmrs.aop.LoggingAdvice.invoke(LoggingAdvice.java:118)
  614. at org.springframework.aop.framework.ReflectiveMethodInvocation.proceed(ReflectiveMethodInvocation.java:172)
  615. at org.springframework.aop.framework.adapter.MethodBeforeAdviceInterceptor.invoke(MethodBeforeAdviceInterceptor.java:50)
  616. at org.springframework.aop.framework.ReflectiveMethodInvocation.proceed(ReflectiveMethodInvocation.java:172)
  617. at org.springframework.aop.framework.adapter.MethodBeforeAdviceInterceptor.invoke(MethodBeforeAdviceInterceptor.java:50)
  618. at org.springframework.aop.framework.ReflectiveMethodInvocation.proceed(ReflectiveMethodInvocation.java:172)
  619. at org.springframework.aop.framework.JdkDynamicAopProxy.invoke(JdkDynamicAopProxy.java:202)
  620. at com.sun.proxy.$Proxy43.getPresentationLocales(Unknown Source)
  621. at sun.reflect.NativeMethodAccessorImpl.invoke0(Native Method)
  622. at sun.reflect.NativeMethodAccessorImpl.invoke(NativeMethodAccessorImpl.java:57)
  623. at sun.reflect.DelegatingMethodAccessorImpl.invoke(DelegatingMethodAccessorImpl.java:43)
  624. at java.lang.reflect.Method.invoke(Method.java:606)
  625. at org.springframework.aop.support.AopUtils.invokeJoinpointUsingReflection(AopUtils.java:309)
  626. at org.springframework.aop.framework.ReflectiveMethodInvocation.invokeJoinpoint(ReflectiveMethodInvocation.java:183)
  627. at org.springframework.aop.framework.ReflectiveMethodInvocation.proceed(ReflectiveMethodInvocation.java:150)
  628. at org.springframework.transaction.interceptor.TransactionInterceptor.invoke(TransactionInterceptor.java:110)
  629. at org.springframework.aop.framework.ReflectiveMethodInvocation.proceed(ReflectiveMethodInvocation.java:172)
  630. at org.springframework.aop.framework.JdkDynamicAopProxy.invoke(JdkDynamicAopProxy.java:202)
  631. at com.sun.proxy.$Proxy43.getPresentationLocales(Unknown Source)
  632. at org.openmrs.web.controller.OptionsFormController.referenceData(OptionsFormController.java:311)
  633. at org.springframework.web.servlet.mvc.SimpleFormController.referenceData(SimpleFormController.java:218)
  634. at org.springframework.web.servlet.mvc.AbstractFormController.showForm(AbstractFormController.java:578)
  635. at org.springframework.web.servlet.mvc.SimpleFormController.showForm(SimpleFormController.java:201)
  636. at org.springframework.web.servlet.mvc.SimpleFormController.showForm(SimpleFormController.java:178)
  637. at org.springframework.web.servlet.mvc.SimpleFormController.processFormSubmission(SimpleFormController.java:263)
  638. at org.openmrs.web.controller.OptionsFormController.processFormSubmission(OptionsFormController.java:96)
  639. at org.springframework.web.servlet.mvc.AbstractFormController.handleRequestInternal(AbstractFormController.java:268)
  640. at org.springframework.web.servlet.mvc.AbstractController.handleRequest(AbstractController.java:153)
  641. at org.openmrs.web.controller.OptionsFormControllerTest.shouldRejectEmptySecretAnswer(OptionsFormControllerTest.java:71)
  642. at sun.reflect.NativeMethodAccessorImpl.invoke0(Native Method)
  643. at sun.reflect.NativeMethodAccessorImpl.invoke(NativeMethodAccessorImpl.java:57)
  644. at sun.reflect.DelegatingMethodAccessorImpl.invoke(DelegatingMethodAccessorImpl.java:43)
  645. at java.lang.reflect.Method.invoke(Method.java:606)
  646. at org.junit.runners.model.FrameworkMethod$1.runReflectiveCall(FrameworkMethod.java:47)
  647. at org.junit.internal.runners.model.ReflectiveCallable.run(ReflectiveCallable.java:12)
  648. at org.junit.runners.model.FrameworkMethod.invokeExplosively(FrameworkMethod.java:44)
  649. at org.junit.internal.runners.statements.InvokeMethod.evaluate(InvokeMethod.java:17)
  650. at org.junit.internal.runners.statements.RunBefores.evaluate(RunBefores.java:26)
  651. at org.springframework.test.context.junit4.statements.RunBeforeTestMethodCallbacks.evaluate(RunBeforeTestMethodCallbacks.java:74)
  652. at org.junit.internal.runners.statements.RunAfters.evaluate(RunAfters.java:27)
  653. at org.springframework.test.context.junit4.statements.RunAfterTestMethodCallbacks.evaluate(RunAfterTestMethodCallbacks.java:82)
  654. at org.springframework.test.context.junit4.statements.SpringRepeat.evaluate(SpringRepeat.java:72)
  655. at org.springframework.test.context.junit4.SpringJUnit4ClassRunner.runChild(SpringJUnit4ClassRunner.java:240)
  656. at org.junit.runners.BlockJUnit4ClassRunner.runChild(BlockJUnit4ClassRunner.java:50)
  657. at org.junit.runners.ParentRunner$3.run(ParentRunner.java:238)
  658. at org.junit.runners.ParentRunner$1.schedule(ParentRunner.java:63)
  659. at org.junit.runners.ParentRunner.runChildren(ParentRunner.java:236)
  660. at org.junit.runners.ParentRunner.access$000(ParentRunner.java:53)
  661. at org.junit.runners.ParentRunner$2.evaluate(ParentRunner.java:229)
  662. at org.springframework.test.context.junit4.statements.RunBeforeTestClassCallbacks.evaluate(RunBeforeTestClassCallbacks.java:61)
  663. at org.junit.internal.runners.statements.RunAfters.evaluate(RunAfters.java:27)
  664. at org.springframework.test.context.junit4.statements.RunAfterTestClassCallbacks.evaluate(RunAfterTestClassCallbacks.java:70)
  665. at org.junit.runners.ParentRunner.run(ParentRunner.java:309)
  666. at org.springframework.test.context.junit4.SpringJUnit4ClassRunner.run(SpringJUnit4ClassRunner.java:180)
  667. at org.apache.maven.surefire.junit4.JUnit4TestSet.execute(JUnit4TestSet.java:59)
  668. at org.apache.maven.surefire.suite.AbstractDirectoryTestSuite.executeTestSet(AbstractDirectoryTestSuite.java:115)
  669. at org.apache.maven.surefire.suite.AbstractDirectoryTestSuite.execute(AbstractDirectoryTestSuite.java:102)
  670. at org.apache.maven.surefire.Surefire.run(Surefire.java:180)
  671. at sun.reflect.NativeMethodAccessorImpl.invoke0(Native Method)
  672. at sun.reflect.NativeMethodAccessorImpl.invoke(NativeMethodAccessorImpl.java:57)
  673. at sun.reflect.DelegatingMethodAccessorImpl.invoke(DelegatingMethodAccessorImpl.java:43)
  674. at java.lang.reflect.Method.invoke(Method.java:606)
  675. at org.apache.maven.surefire.booter.SurefireBooter.runSuitesInProcess(SurefireBooter.java:350)
  676. at org.apache.maven.surefire.booter.SurefireBooter.main(SurefireBooter.java:1021)
  677. Tests run: 3, Failures: 0, Errors: 0, Skipped: 0, Time elapsed: 0.217 sec
  678. Running org.openmrs.web.dwr.PersonListItemTest
  679. Tests run: 8, Failures: 0, Errors: 0, Skipped: 0, Time elapsed: 0.537 sec
  680. Running org.openmrs.web.controller.encounter.EncounterTypeFormControllerTest
  681. Tests run: 2, Failures: 0, Errors: 0, Skipped: 0, Time elapsed: 0.132 sec
  682. Running org.openmrs.web.taglib.PortletTagTest
  683. SLF4J: Class path contains multiple SLF4J bindings.
  684. SLF4J: Found binding in [jar:file:/Users/larry/.m2/repository/org/slf4j/slf4j-log4j12/1.6.0/slf4j-log4j12-1.6.0.jar!/org/slf4j/impl/StaticLoggerBinder.class]
  685. SLF4J: Found binding in [jar:file:/Users/larry/.m2/repository/org/slf4j/slf4j-log4j12/1.6.0/slf4j-log4j12-1.6.0.jar!/org/slf4j/impl/StaticLoggerBinder.class]
  686. SLF4J: See http://www.slf4j.org/codes.html#multiple_bindings for an explanation.
  687. Tests run: 7, Failures: 0, Errors: 0, Skipped: 0, Time elapsed: 1.762 sec
  688. Running org.openmrs.web.controller.concept.ConceptStopWordListControllerTest
  689. ERROR - ConceptStopWordListController.handleSubmission(66) |2018-07-14 08:02:36,618| Error on deleting concept stop word
  690. org.openmrs.api.ConceptStopWordException: ConceptStopWord.error.notfound
  691. at org.openmrs.api.impl.ConceptServiceImpl.deleteConceptStopWord(ConceptServiceImpl.java:1789)
  692. at sun.reflect.NativeMethodAccessorImpl.invoke0(Native Method)
  693. at sun.reflect.NativeMethodAccessorImpl.invoke(NativeMethodAccessorImpl.java:57)
  694. at sun.reflect.DelegatingMethodAccessorImpl.invoke(DelegatingMethodAccessorImpl.java:43)
  695. at java.lang.reflect.Method.invoke(Method.java:606)
  696. at org.springframework.aop.support.AopUtils.invokeJoinpointUsingReflection(AopUtils.java:309)
  697. at org.springframework.aop.framework.ReflectiveMethodInvocation.invokeJoinpoint(ReflectiveMethodInvocation.java:183)
  698. at org.springframework.aop.framework.ReflectiveMethodInvocation.proceed(ReflectiveMethodInvocation.java:150)
  699. at org.springframework.transaction.interceptor.TransactionInterceptor.invoke(TransactionInterceptor.java:110)
  700. at org.springframework.aop.framework.ReflectiveMethodInvocation.proceed(ReflectiveMethodInvocation.java:172)
  701. at org.springframework.aop.framework.JdkDynamicAopProxy.invoke(JdkDynamicAopProxy.java:202)
  702. at com.sun.proxy.$Proxy31.deleteConceptStopWord(Unknown Source)
  703. at sun.reflect.NativeMethodAccessorImpl.invoke0(Native Method)
  704. at sun.reflect.NativeMethodAccessorImpl.invoke(NativeMethodAccessorImpl.java:57)
  705. at sun.reflect.DelegatingMethodAccessorImpl.invoke(DelegatingMethodAccessorImpl.java:43)
  706. at java.lang.reflect.Method.invoke(Method.java:606)
  707. at org.springframework.aop.support.AopUtils.invokeJoinpointUsingReflection(AopUtils.java:309)
  708. at org.springframework.aop.framework.ReflectiveMethodInvocation.invokeJoinpoint(ReflectiveMethodInvocation.java:183)
  709. at org.springframework.aop.framework.ReflectiveMethodInvocation.proceed(ReflectiveMethodInvocation.java:150)
  710. at org.springframework.transaction.interceptor.TransactionInterceptor.invoke(TransactionInterceptor.java:110)
  711. at org.springframework.aop.framework.ReflectiveMethodInvocation.proceed(ReflectiveMethodInvocation.java:172)
  712. at org.openmrs.aop.LoggingAdvice.invoke(LoggingAdvice.java:118)
  713. at org.springframework.aop.framework.ReflectiveMethodInvocation.proceed(ReflectiveMethodInvocation.java:172)
  714. at org.springframework.aop.framework.adapter.MethodBeforeAdviceInterceptor.invoke(MethodBeforeAdviceInterceptor.java:50)
  715. at org.springframework.aop.framework.ReflectiveMethodInvocation.proceed(ReflectiveMethodInvocation.java:172)
  716. at org.springframework.aop.framework.adapter.MethodBeforeAdviceInterceptor.invoke(MethodBeforeAdviceInterceptor.java:50)
  717. at org.springframework.aop.framework.ReflectiveMethodInvocation.proceed(ReflectiveMethodInvocation.java:172)
  718. at org.springframework.aop.framework.JdkDynamicAopProxy.invoke(JdkDynamicAopProxy.java:202)
  719. at com.sun.proxy.$Proxy32.deleteConceptStopWord(Unknown Source)
  720. at sun.reflect.NativeMethodAccessorImpl.invoke0(Native Method)
  721. at sun.reflect.NativeMethodAccessorImpl.invoke(NativeMethodAccessorImpl.java:57)
  722. at sun.reflect.DelegatingMethodAccessorImpl.invoke(DelegatingMethodAccessorImpl.java:43)
  723. at java.lang.reflect.Method.invoke(Method.java:606)
  724. at org.springframework.aop.support.AopUtils.invokeJoinpointUsingReflection(AopUtils.java:309)
  725. at org.springframework.aop.framework.ReflectiveMethodInvocation.invokeJoinpoint(ReflectiveMethodInvocation.java:183)
  726. at org.springframework.aop.framework.ReflectiveMethodInvocation.proceed(ReflectiveMethodInvocation.java:150)
  727. at org.springframework.transaction.interceptor.TransactionInterceptor.invoke(TransactionInterceptor.java:110)
  728. at org.springframework.aop.framework.ReflectiveMethodInvocation.proceed(ReflectiveMethodInvocation.java:172)
  729. at org.springframework.aop.framework.JdkDynamicAopProxy.invoke(JdkDynamicAopProxy.java:202)
  730. at com.sun.proxy.$Proxy32.deleteConceptStopWord(Unknown Source)
  731. at org.openmrs.web.controller.concept.ConceptStopWordListController.handleSubmission(ConceptStopWordListController.java:62)
  732. at org.openmrs.web.controller.concept.ConceptStopWordListControllerTest.handleSubmission_shouldAddTheDeleteErrorMessageInSession(ConceptStopWordListControllerTest.java:120)
  733. at sun.reflect.NativeMethodAccessorImpl.invoke0(Native Method)
  734. at sun.reflect.NativeMethodAccessorImpl.invoke(NativeMethodAccessorImpl.java:57)
  735. at sun.reflect.DelegatingMethodAccessorImpl.invoke(DelegatingMethodAccessorImpl.java:43)
  736. at java.lang.reflect.Method.invoke(Method.java:606)
  737. at org.junit.runners.model.FrameworkMethod$1.runReflectiveCall(FrameworkMethod.java:47)
  738. at org.junit.internal.runners.model.ReflectiveCallable.run(ReflectiveCallable.java:12)
  739. at org.junit.runners.model.FrameworkMethod.invokeExplosively(FrameworkMethod.java:44)
  740. at org.junit.internal.runners.statements.InvokeMethod.evaluate(InvokeMethod.java:17)
  741. at org.junit.internal.runners.statements.RunBefores.evaluate(RunBefores.java:26)
  742. at org.springframework.test.context.junit4.statements.RunBeforeTestMethodCallbacks.evaluate(RunBeforeTestMethodCallbacks.java:74)
  743. at org.junit.internal.runners.statements.RunAfters.evaluate(RunAfters.java:27)
  744. at org.springframework.test.context.junit4.statements.RunAfterTestMethodCallbacks.evaluate(RunAfterTestMethodCallbacks.java:82)
  745. at org.springframework.test.context.junit4.statements.SpringRepeat.evaluate(SpringRepeat.java:72)
  746. at org.springframework.test.context.junit4.SpringJUnit4ClassRunner.runChild(SpringJUnit4ClassRunner.java:240)
  747. at org.junit.runners.BlockJUnit4ClassRunner.runChild(BlockJUnit4ClassRunner.java:50)
  748. at org.junit.runners.ParentRunner$3.run(ParentRunner.java:238)
  749. at org.junit.runners.ParentRunner$1.schedule(ParentRunner.java:63)
  750. at org.junit.runners.ParentRunner.runChildren(ParentRunner.java:236)
  751. at org.junit.runners.ParentRunner.access$000(ParentRunner.java:53)
  752. at org.junit.runners.ParentRunner$2.evaluate(ParentRunner.java:229)
  753. at org.springframework.test.context.junit4.statements.RunBeforeTestClassCallbacks.evaluate(RunBeforeTestClassCallbacks.java:61)
  754. at org.junit.internal.runners.statements.RunAfters.evaluate(RunAfters.java:27)
  755. at org.springframework.test.context.junit4.statements.RunAfterTestClassCallbacks.evaluate(RunAfterTestClassCallbacks.java:70)
  756. at org.junit.runners.ParentRunner.run(ParentRunner.java:309)
  757. at org.springframework.test.context.junit4.SpringJUnit4ClassRunner.run(SpringJUnit4ClassRunner.java:180)
  758. at org.apache.maven.surefire.junit4.JUnit4TestSet.execute(JUnit4TestSet.java:59)
  759. at org.apache.maven.surefire.suite.AbstractDirectoryTestSuite.executeTestSet(AbstractDirectoryTestSuite.java:115)
  760. at org.apache.maven.surefire.suite.AbstractDirectoryTestSuite.execute(AbstractDirectoryTestSuite.java:102)
  761. at org.apache.maven.surefire.Surefire.run(Surefire.java:180)
  762. at sun.reflect.NativeMethodAccessorImpl.invoke0(Native Method)
  763. at sun.reflect.NativeMethodAccessorImpl.invoke(NativeMethodAccessorImpl.java:57)
  764. at sun.reflect.DelegatingMethodAccessorImpl.invoke(DelegatingMethodAccessorImpl.java:43)
  765. at java.lang.reflect.Method.invoke(Method.java:606)
  766. at org.apache.maven.surefire.booter.SurefireBooter.runSuitesInProcess(SurefireBooter.java:350)
  767. at org.apache.maven.surefire.booter.SurefireBooter.main(SurefireBooter.java:1021)
  768. Caused by: org.openmrs.api.db.DAOException: Concept Stop Word not found or already deleted
  769. at org.openmrs.api.db.hibernate.HibernateConceptDAO.deleteConceptStopWord(HibernateConceptDAO.java:1360)
  770. at org.openmrs.api.impl.ConceptServiceImpl.deleteConceptStopWord(ConceptServiceImpl.java:1785)
  771. ... 76 more
  772. Tests run: 5, Failures: 0, Errors: 0, Skipped: 0, Time elapsed: 0.321 sec
  773. Running org.openmrs.web.obs.ObsFormControllerTest
  774. Tests run: 2, Failures: 0, Errors: 0, Skipped: 0, Time elapsed: 0.152 sec
  775. Running org.openmrs.web.encounter.EncounterDisplayControllerTest
  776. Tests run: 2, Failures: 0, Errors: 0, Skipped: 0, Time elapsed: 0.126 sec
  777. Running org.openmrs.web.controller.form.FieldFormControllerTest
  778. Tests run: 3, Failures: 0, Errors: 0, Skipped: 1, Time elapsed: 0.154 sec
  779. Running org.openmrs.web.controller.form.FieldTypeListControllerTest
  780. ERROR - JDBCExceptionReporter.logExceptions(234) |2018-07-14 08:02:37,320| Referential integrity constraint violation: "FK5CEA0FA808FB57F: PUBLIC.FIELD FOREIGN KEY(FIELD_TYPE) REFERENCES PUBLIC.FIELD_TYPE(FIELD_TYPE_ID)"; SQL statement:
  781. delete from field_type where field_type_id=? [23003-135]
  782. ERROR - JDBCExceptionReporter.logExceptions(234) |2018-07-14 08:02:37,320| Referential integrity constraint violation: "FK5CEA0FA808FB57F: PUBLIC.FIELD FOREIGN KEY(FIELD_TYPE) REFERENCES PUBLIC.FIELD_TYPE(FIELD_TYPE_ID)"; SQL statement:
  783. delete from field_type where field_type_id=? [23003-135]
  784. ERROR - FieldTypeListController.onSubmit(83) |2018-07-14 08:02:37,321| Unable to delete a field type because it is in use. fieldTypeId: 1
  785. org.springframework.dao.DataIntegrityViolationException: Could not execute JDBC batch update; SQL [delete from field_type where field_type_id=?]; constraint ["FK5CEA0FA808FB57F: PUBLIC.FIELD FOREIGN KEY(FIELD_TYPE) REFERENCES PUBLIC.FIELD_TYPE(FIELD_TYPE_ID)"; SQL statement:
  786. delete from field_type where field_type_id=? [23003-135]]; nested exception is org.hibernate.exception.ConstraintViolationException: Could not execute JDBC batch update
  787. at org.springframework.orm.hibernate3.SessionFactoryUtils.convertHibernateAccessException(SessionFactoryUtils.java:637)
  788. at org.springframework.orm.hibernate3.HibernateTransactionManager.convertHibernateAccessException(HibernateTransactionManager.java:793)
  789. at org.springframework.orm.hibernate3.HibernateTransactionManager.doCommit(HibernateTransactionManager.java:664)
  790. at org.springframework.transaction.support.AbstractPlatformTransactionManager.processCommit(AbstractPlatformTransactionManager.java:754)
  791. at org.springframework.transaction.support.AbstractPlatformTransactionManager.commit(AbstractPlatformTransactionManager.java:723)
  792. at org.springframework.transaction.interceptor.TransactionAspectSupport.commitTransactionAfterReturning(TransactionAspectSupport.java:393)
  793. at org.springframework.transaction.interceptor.TransactionInterceptor.invoke(TransactionInterceptor.java:120)
  794. at org.springframework.aop.framework.ReflectiveMethodInvocation.proceed(ReflectiveMethodInvocation.java:172)
  795. at org.springframework.aop.framework.JdkDynamicAopProxy.invoke(JdkDynamicAopProxy.java:202)
  796. at com.sun.proxy.$Proxy42.purgeFieldType(Unknown Source)
  797. at org.openmrs.web.controller.form.FieldTypeListController.onSubmit(FieldTypeListController.java:71)
  798. at org.springframework.web.servlet.mvc.SimpleFormController.processFormSubmission(SimpleFormController.java:272)
  799. at org.springframework.web.servlet.mvc.AbstractFormController.handleRequestInternal(AbstractFormController.java:268)
  800. at org.springframework.web.servlet.mvc.AbstractController.handleRequest(AbstractController.java:153)
  801. at org.springframework.web.servlet.mvc.SimpleControllerHandlerAdapter.handle(SimpleControllerHandlerAdapter.java:48)
  802. at org.openmrs.web.test.WebTestHelper.handle(WebTestHelper.java:126)
  803. at org.openmrs.web.controller.form.FieldTypeListControllerTest.onSubmit_shouldDisplayAUserFriendlyErrorMessage(FieldTypeListControllerTest.java:44)
  804. at sun.reflect.NativeMethodAccessorImpl.invoke0(Native Method)
  805. at sun.reflect.NativeMethodAccessorImpl.invoke(NativeMethodAccessorImpl.java:57)
  806. at sun.reflect.DelegatingMethodAccessorImpl.invoke(DelegatingMethodAccessorImpl.java:43)
  807. at java.lang.reflect.Method.invoke(Method.java:606)
  808. at org.junit.runners.model.FrameworkMethod$1.runReflectiveCall(FrameworkMethod.java:47)
  809. at org.junit.internal.runners.model.ReflectiveCallable.run(ReflectiveCallable.java:12)
  810. at org.junit.runners.model.FrameworkMethod.invokeExplosively(FrameworkMethod.java:44)
  811. at org.junit.internal.runners.statements.InvokeMethod.evaluate(InvokeMethod.java:17)
  812. at org.junit.internal.runners.statements.RunBefores.evaluate(RunBefores.java:26)
  813. at org.springframework.test.context.junit4.statements.RunBeforeTestMethodCallbacks.evaluate(RunBeforeTestMethodCallbacks.java:74)
  814. at org.junit.internal.runners.statements.RunAfters.evaluate(RunAfters.java:27)
  815. at org.springframework.test.context.junit4.statements.RunAfterTestMethodCallbacks.evaluate(RunAfterTestMethodCallbacks.java:82)
  816. at org.springframework.test.context.junit4.statements.SpringRepeat.evaluate(SpringRepeat.java:72)
  817. at org.springframework.test.context.junit4.SpringJUnit4ClassRunner.runChild(SpringJUnit4ClassRunner.java:240)
  818. at org.junit.runners.BlockJUnit4ClassRunner.runChild(BlockJUnit4ClassRunner.java:50)
  819. at org.junit.runners.ParentRunner$3.run(ParentRunner.java:238)
  820. at org.junit.runners.ParentRunner$1.schedule(ParentRunner.java:63)
  821. at org.junit.runners.ParentRunner.runChildren(ParentRunner.java:236)
  822. at org.junit.runners.ParentRunner.access$000(ParentRunner.java:53)
  823. at org.junit.runners.ParentRunner$2.evaluate(ParentRunner.java:229)
  824. at org.springframework.test.context.junit4.statements.RunBeforeTestClassCallbacks.evaluate(RunBeforeTestClassCallbacks.java:61)
  825. at org.junit.internal.runners.statements.RunAfters.evaluate(RunAfters.java:27)
  826. at org.springframework.test.context.junit4.statements.RunAfterTestClassCallbacks.evaluate(RunAfterTestClassCallbacks.java:70)
  827. at org.junit.runners.ParentRunner.run(ParentRunner.java:309)
  828. at org.springframework.test.context.junit4.SpringJUnit4ClassRunner.run(SpringJUnit4ClassRunner.java:180)
  829. at org.apache.maven.surefire.junit4.JUnit4TestSet.execute(JUnit4TestSet.java:59)
  830. at org.apache.maven.surefire.suite.AbstractDirectoryTestSuite.executeTestSet(AbstractDirectoryTestSuite.java:115)
  831. at org.apache.maven.surefire.suite.AbstractDirectoryTestSuite.execute(AbstractDirectoryTestSuite.java:102)
  832. at org.apache.maven.surefire.Surefire.run(Surefire.java:180)
  833. at sun.reflect.NativeMethodAccessorImpl.invoke0(Native Method)
  834. at sun.reflect.NativeMethodAccessorImpl.invoke(NativeMethodAccessorImpl.java:57)
  835. at sun.reflect.DelegatingMethodAccessorImpl.invoke(DelegatingMethodAccessorImpl.java:43)
  836. at java.lang.reflect.Method.invoke(Method.java:606)
  837. at org.apache.maven.surefire.booter.SurefireBooter.runSuitesInProcess(SurefireBooter.java:350)
  838. at org.apache.maven.surefire.booter.SurefireBooter.main(SurefireBooter.java:1021)
  839. Caused by: org.hibernate.exception.ConstraintViolationException: Could not execute JDBC batch update
  840. at org.hibernate.exception.SQLStateConverter.convert(SQLStateConverter.java:96)
  841. at org.hibernate.exception.JDBCExceptionHelper.convert(JDBCExceptionHelper.java:66)
  842. at org.hibernate.jdbc.AbstractBatcher.executeBatch(AbstractBatcher.java:275)
  843. at org.hibernate.engine.ActionQueue.executeActions(ActionQueue.java:268)
  844. at org.hibernate.engine.ActionQueue.executeActions(ActionQueue.java:189)
  845. at org.hibernate.event.def.AbstractFlushingEventListener.performExecutions(AbstractFlushingEventListener.java:321)
  846. at org.hibernate.event.def.DefaultFlushEventListener.onFlush(DefaultFlushEventListener.java:51)
  847. at org.hibernate.impl.SessionImpl.flush(SessionImpl.java:1216)
  848. at org.hibernate.impl.SessionImpl.managedFlush(SessionImpl.java:383)
  849. at org.hibernate.transaction.JDBCTransaction.commit(JDBCTransaction.java:133)
  850. at org.springframework.orm.hibernate3.HibernateTransactionManager.doCommit(HibernateTransactionManager.java:656)
  851. ... 49 more
  852. Caused by: org.h2.jdbc.JdbcBatchUpdateException: Referential integrity constraint violation: "FK5CEA0FA808FB57F: PUBLIC.FIELD FOREIGN KEY(FIELD_TYPE) REFERENCES PUBLIC.FIELD_TYPE(FIELD_TYPE_ID)"; SQL statement:
  853. delete from field_type where field_type_id=? [23003-135]
  854. at org.h2.jdbc.JdbcPreparedStatement.executeBatch(JdbcPreparedStatement.java:1098)
  855. at com.mchange.v2.c3p0.impl.NewProxyPreparedStatement.executeBatch(NewProxyPreparedStatement.java:1723)
  856. at org.hibernate.jdbc.BatchingBatcher.doExecuteBatch(BatchingBatcher.java:70)
  857. at org.hibernate.jdbc.AbstractBatcher.executeBatch(AbstractBatcher.java:268)
  858. ... 57 more
  859. Tests run: 1, Failures: 0, Errors: 0, Skipped: 0, Time elapsed: 0.09 sec
  860. Running org.openmrs.web.controller.maintenance.GlobalPropertyControllerTest
  861. Tests run: 2, Failures: 0, Errors: 0, Skipped: 0, Time elapsed: 0.151 sec
  862. Running org.openmrs.web.controller.PortletControllerTest
  863. Tests run: 2, Failures: 0, Errors: 0, Skipped: 0, Time elapsed: 0.202 sec
  864. Running org.openmrs.web.controller.program.ProgramFormControllerTest
  865. Tests run: 1, Failures: 0, Errors: 0, Skipped: 0, Time elapsed: 0.086 sec
  866. Running org.openmrs.web.taglib.FormatTagTest
  867. Tests run: 1, Failures: 0, Errors: 0, Skipped: 0, Time elapsed: 0.086 sec
  868. Running org.openmrs.web.controller.maintenance.SystemInformationControllerTest
  869. Tests run: 5, Failures: 0, Errors: 0, Skipped: 0, Time elapsed: 0.324 sec
  870. Running org.openmrs.web.controller.GlobalPropertyPortletControllerTest
  871. Tests run: 4, Failures: 0, Errors: 0, Skipped: 0, Time elapsed: 0.26 sec
  872. Running org.openmrs.web.controller.encounter.EncounterTypeListControllerTest
  873. Tests run: 1, Failures: 0, Errors: 0, Skipped: 0, Time elapsed: 0.07 sec
  874. Running org.openmrs.module.web.controller.ModuleListControllerTest
  875. Tests run: 1, Failures: 0, Errors: 0, Skipped: 0, Time elapsed: 0.002 sec
  876. Running org.openmrs.web.controller.ConceptFormControllerTest
  877. Tests run: 26, Failures: 0, Errors: 0, Skipped: 0, Time elapsed: 2.021 sec
  878. Running org.openmrs.web.dwr.ConceptListItemTest
  879. Tests run: 4, Failures: 0, Errors: 0, Skipped: 0, Time elapsed: 0.002 sec
  880. Running org.openmrs.module.web.extension.ExtensionUtilTest
  881. SLF4J: Class path contains multiple SLF4J bindings.
  882. SLF4J: Found binding in [jar:file:/Users/larry/.m2/repository/org/slf4j/slf4j-log4j12/1.6.0/slf4j-log4j12-1.6.0.jar!/org/slf4j/impl/StaticLoggerBinder.class]
  883. SLF4J: Found binding in [jar:file:/Users/larry/.m2/repository/org/slf4j/slf4j-log4j12/1.6.0/slf4j-log4j12-1.6.0.jar!/org/slf4j/impl/StaticLoggerBinder.class]
  884. SLF4J: See http://www.slf4j.org/codes.html#multiple_bindings for an explanation.
  885. Tests run: 2, Failures: 0, Errors: 0, Skipped: 0, Time elapsed: 1.571 sec
  886. Running org.openmrs.web.dwr.DWRProgramWorkflowServiceTest
  887. Tests run: 1, Failures: 0, Errors: 0, Skipped: 0, Time elapsed: 0.078 sec
  888. Running org.openmrs.web.dwr.DWRProviderServiceTest
  889. Tests run: 4, Failures: 0, Errors: 0, Skipped: 1, Time elapsed: 0.229 sec
  890. Running org.openmrs.web.dwr.DWRPersonServiceTest
  891. Tests run: 2, Failures: 0, Errors: 0, Skipped: 0, Time elapsed: 0.141 sec
  892. Running org.openmrs.web.controller.encounter.EncounterRoleFormControllerTest
  893. Tests run: 8, Failures: 0, Errors: 0, Skipped: 0, Time elapsed: 0.59 sec
  894. Running org.openmrs.web.taglib.OpenmrsMessageTagTest
  895. Tests run: 8, Failures: 0, Errors: 0, Skipped: 0, Time elapsed: 0.514 sec
  896. Running org.openmrs.web.controller.concept.ConceptProposalFormControllerTest
  897. Tests run: 1, Failures: 0, Errors: 0, Skipped: 0, Time elapsed: 0.104 sec
  898. Running org.openmrs.web.controller.provider.ProviderFormControllerTest
  899. Tests run: 2, Failures: 0, Errors: 0, Skipped: 0, Time elapsed: 0.16 sec
  900. Running org.openmrs.web.controller.user.UserListControllerTest
  901. Tests run: 4, Failures: 0, Errors: 0, Skipped: 0, Time elapsed: 0.284 sec
  902.  
  903. Results :
  904.  
  905. Tests run: 251, Failures: 0, Errors: 0, Skipped: 6
  906.  
  907. [INFO]
  908. [INFO] --- maven-jar-plugin:2.3.2:jar (default-jar) @ openmrs-web ---
  909. [INFO] Building jar: /Users/larry/workspace/lesidi/openmrs-core/web/target/openmrs-web-1.9.11.jar
  910. [INFO]
  911. [INFO] --- maven-jar-plugin:2.3.2:test-jar (default) @ openmrs-web ---
  912. [INFO] Building jar: /Users/larry/workspace/lesidi/openmrs-core/web/target/openmrs-web-1.9.11-tests.jar
  913. [INFO]
  914. [INFO] --- license-maven-plugin:2.6:check (default) @ openmrs-web ---
  915. [INFO] Checking licenses...
  916. [INFO]
  917. [INFO] --- maven-install-plugin:2.4:install (default-install) @ openmrs-web ---
  918. [INFO] Installing /Users/larry/workspace/lesidi/openmrs-core/web/target/openmrs-web-1.9.11.jar to /Users/larry/.m2/repository/org/openmrs/web/openmrs-web/1.9.11/openmrs-web-1.9.11.jar
  919. [INFO] Installing /Users/larry/workspace/lesidi/openmrs-core/web/pom.xml to /Users/larry/.m2/repository/org/openmrs/web/openmrs-web/1.9.11/openmrs-web-1.9.11.pom
  920. [INFO] Installing /Users/larry/workspace/lesidi/openmrs-core/web/target/openmrs-web-1.9.11-tests.jar to /Users/larry/.m2/repository/org/openmrs/web/openmrs-web/1.9.11/openmrs-web-1.9.11-tests.jar
  921. [INFO]
  922. [INFO] ------------------------------------------------------------------------
  923. [INFO] Building openmrs-webapp 1.9.11
  924. [INFO] ------------------------------------------------------------------------
  925. [INFO]
  926. [INFO] --- maven-clean-plugin:2.5:clean (default-clean) @ openmrs-webapp ---
  927. [INFO] Deleting /Users/larry/workspace/lesidi/openmrs-core/webapp/target
  928. [INFO]
  929. [INFO] --- buildnumber-maven-plugin:1.1:create (default) @ openmrs-webapp ---
  930. [INFO]
  931. [INFO] --- build-helper-maven-plugin:1.5:parse-version (parse-version) @ openmrs-webapp ---
  932. [INFO]
  933. [INFO] --- maven-resources-plugin:2.4:resources (default-resources) @ openmrs-webapp ---
  934. [INFO] Using 'UTF-8' encoding to copy filtered resources.
  935. [INFO] Copying 7 resources
  936. [INFO] Copying 1 resource to ../jetty
  937. [INFO]
  938. [INFO] --- maven-antrun-plugin:1.4:run (default) @ openmrs-webapp ---
  939. project.artifactId
  940. [INFO] Executing tasks
  941. [unzip] Expanding: /Users/larry/workspace/lesidi/openmrs-core/webapp/src/main/resources/liquibase-demo-data.zip into /Users/larry/workspace/lesidi/openmrs-core/webapp/target/classes
  942. [INFO] Executed tasks
  943. [INFO]
  944. [INFO] --- maven-compiler-plugin:2.1:compile (default-compile) @ openmrs-webapp ---
  945. [INFO] No sources to compile
  946. [INFO]
  947. [INFO] --- maven-resources-plugin:2.4:testResources (default-testResources) @ openmrs-webapp ---
  948. [INFO] Using 'UTF-8' encoding to copy filtered resources.
  949. [INFO] Copying 1 resource
  950. [INFO]
  951. [INFO] --- maven-compiler-plugin:2.1:testCompile (default-testCompile) @ openmrs-webapp ---
  952. [INFO] No sources to compile
  953. [INFO]
  954. [INFO] --- maven-surefire-plugin:2.5:test (default-test) @ openmrs-webapp ---
  955. Downloading: http://mavenrepo.openmrs.org/nexus/content/repositories/public/org/apache/maven/surefire/surefire-junit/2.5/surefire-junit-2.5.pom
  956. Downloading: https://dl.bintray.com/openmrs/maven/org/apache/maven/surefire/surefire-junit/2.5/surefire-junit-2.5.pom
  957. Downloading: https://repo.maven.apache.org/maven2/org/apache/maven/surefire/surefire-junit/2.5/surefire-junit-2.5.pom
  958. [INFO] Failure detected.
  959. [INFO] ------------------------------------------------------------------------
  960. [INFO] Reactor Summary:
  961. [INFO]
  962. [INFO] OpenMRS ............................................ SUCCESS [ 1.251 s]
  963. [INFO] openmrs-tools ...................................... SUCCESS [ 0.797 s]
  964. [INFO] openmrs-test ....................................... SUCCESS [ 0.020 s]
  965. [INFO] openmrs-api ........................................ SUCCESS [02:45 min]
  966. [INFO] openmrs-web ........................................ SUCCESS [ 39.369 s]
  967. [INFO] openmrs-webapp ..................................... FAILURE [ 4.707 s]
  968. [INFO] ------------------------------------------------------------------------
  969. [INFO] BUILD FAILURE
  970. [INFO] ------------------------------------------------------------------------
  971. [INFO] Total time: 03:31 min
  972. [INFO] Finished at: 2018-07-14T08:02:49+01:00
  973. [INFO] Final Memory: 73M/626M
  974. [INFO] ------------------------------------------------------------------------
  975. [ERROR] Failed to execute goal org.apache.maven.plugins:maven-surefire-plugin:2.5:test (default-test) on project openmrs-webapp: Error to resolving surefire provider dependency: Unable to get dependency information for org.apache.maven.surefire:surefire-junit:jar:2.5: Failed to retrieve POM for org.apache.maven.surefire:surefire-junit:jar:2.5: Could not transfer artifact org.apache.maven.surefire:surefire-junit:pom:2.5 from/to openmrs-repo (http://mavenrepo.openmrs.org/nexus/content/repositories/public): sun.security.validator.ValidatorException: PKIX path building failed: sun.security.provider.certpath.SunCertPathBuilderException: unable to find valid certification path to requested target
  976. [ERROR] org.apache.maven.surefire:surefire-junit:jar:2.5
  977. [ERROR]
  978. [ERROR] from the specified remote repositories:
  979. [ERROR] openmrs-repo (http://mavenrepo.openmrs.org/nexus/content/repositories/public, releases=true, snapshots=false),
  980. [ERROR] openmrs-bintray-repo (https://dl.bintray.com/openmrs/maven/, releases=true, snapshots=true),
  981. [ERROR] central (https://repo.maven.apache.org/maven2, releases=true, snapshots=false)
  982. [ERROR] Path to dependency:
  983. [ERROR] 1) dummy:dummy:jar:1.0
  984. [ERROR]
  985. [ERROR]
  986. [ERROR] -> [Help 1]
  987. [ERROR]
  988. [ERROR] To see the full stack trace of the errors, re-run Maven with the -e switch.
  989. [ERROR] Re-run Maven using the -X switch to enable full debug logging.
  990. [ERROR]
  991. [ERROR] For more information about the errors and possible solutions, please read the following articles:
  992. [ERROR] [Help 1] http://cwiki.apache.org/confluence/display/MAVEN/MojoExecutionException
  993. [ERROR]
  994. [ERROR] After correcting the problems, you can resume the build with the command
  995. [ERROR] mvn <goals> -rf :openmrs-webapp
Advertisement
RAW Paste Data Copied
Advertisement