Advertisement
Guest User

gperf fails

a guest
Aug 5th, 2016
61
0
Never
Not a member of Pastebin yet? Sign Up, it unlocks many cool features!
text 31.54 KB | None | 0 0
  1. version:1
  2. :msg:main ---> Computing dependencies for gperf:info:main .:debug:main gperf has no conflicts
  3. :debug:main Searching for dependency: clang-3.7
  4. :debug:main Found Dependency: receipt exists for clang-3.7
  5. :msg:main
  6. :debug:main Executing org.macports.main (gperf)
  7. :debug:main changing euid/egid - current euid: 0 - current egid: 0
  8. :debug:main egid changed to: 501
  9. :debug:main euid changed to: 502
  10. :debug:archivefetch archivefetch phase started at Fri Aug 5 14:52:41 EDT 2016
  11. :debug:archivefetch Executing org.macports.archivefetch (gperf)
  12. :debug:archivefetch Privilege de-escalation not attempted as not running as root.
  13. :debug:fetch fetch phase started at Fri Aug 5 14:52:41 EDT 2016
  14. :notice:fetch ---> Fetching distfiles for gperf
  15. :debug:fetch Executing org.macports.fetch (gperf)
  16. :debug:fetch Privilege de-escalation not attempted as not running as root.
  17. :debug:checksum checksum phase started at Fri Aug 5 14:52:41 EDT 2016
  18. :notice:checksum ---> Verifying checksums for gperf
  19. :debug:checksum Executing org.macports.checksum (gperf)
  20. :info:checksum ---> Checksumming gperf-3.0.4.tar.gz
  21. :debug:checksum Calculated (md5) is c1f1db32fb6598d6a93e6e88796a8632
  22. :debug:checksum Correct (md5) checksum for gperf-3.0.4.tar.gz
  23. :debug:checksum Calculated (sha1) is e32d4aff8f0c730c9a56554377b2c6d82d0951b8
  24. :debug:checksum Correct (sha1) checksum for gperf-3.0.4.tar.gz
  25. :debug:checksum Calculated (rmd160) is aeaed644501d2424f88d203dd68c997b6a90f116
  26. :debug:checksum Correct (rmd160) checksum for gperf-3.0.4.tar.gz
  27. :debug:checksum Privilege de-escalation not attempted as not running as root.
  28. :debug:extract extract phase started at Fri Aug 5 14:52:41 EDT 2016
  29. :notice:extract ---> Extracting gperf
  30. :debug:extract Executing org.macports.extract (gperf)
  31. :info:extract ---> Extracting gperf-3.0.4.tar.gz
  32. :debug:extract setting option extract.args to '/opt/local/var/macports/distfiles/gperf/gperf-3.0.4.tar.gz'
  33. :debug:extract Environment:
  34. CC_PRINT_OPTIONS='YES'
  35. CC_PRINT_OPTIONS_FILE='/opt/local/var/macports/build/_opt_local_var_macports_sources_rsync.macports.org_release_tarballs_ports_devel_gperf/gperf/work/.CC_PRINT_OPTIONS'
  36. CPATH='/opt/local/include'
  37. LIBRARY_PATH='/opt/local/lib'
  38. MACOSX_DEPLOYMENT_TARGET='10.6'
  39. :debug:extract Assembled command: 'cd "/opt/local/var/macports/build/_opt_local_var_macports_sources_rsync.macports.org_release_tarballs_ports_devel_gperf/gperf/work" && /usr/bin/gzip -dc '/opt/local/var/macports/distfiles/gperf/gperf-3.0.4.tar.gz' | /usr/bin/gnutar --no-same-owner -xf -'
  40. :debug:extract Executing command line: cd "/opt/local/var/macports/build/_opt_local_var_macports_sources_rsync.macports.org_release_tarballs_ports_devel_gperf/gperf/work" && /usr/bin/gzip -dc '/opt/local/var/macports/distfiles/gperf/gperf-3.0.4.tar.gz' | /usr/bin/gnutar --no-same-owner -xf -
  41. :debug:extract euid/egid changed to: 0/0
  42. :debug:extract chowned /opt/local/var/macports/build/_opt_local_var_macports_sources_rsync.macports.org_release_tarballs_ports_devel_gperf/gperf/work to macports
  43. :debug:extract euid/egid changed to: 502/501
  44. :debug:extract Privilege de-escalation not attempted as not running as root.
  45. :debug:patch patch phase started at Fri Aug 5 14:52:41 EDT 2016
  46. :debug:patch Executing org.macports.patch (gperf)
  47. :notice:patch ---> Applying patches to gperf
  48. :info:patch ---> Applying c99.patch
  49. :debug:patch Environment:
  50. CC_PRINT_OPTIONS='YES'
  51. CC_PRINT_OPTIONS_FILE='/opt/local/var/macports/build/_opt_local_var_macports_sources_rsync.macports.org_release_tarballs_ports_devel_gperf/gperf/work/.CC_PRINT_OPTIONS'
  52. CPATH='/opt/local/include'
  53. LIBRARY_PATH='/opt/local/lib'
  54. MACOSX_DEPLOYMENT_TARGET='10.6'
  55. :debug:patch Assembled command: 'cd "/opt/local/var/macports/build/_opt_local_var_macports_sources_rsync.macports.org_release_tarballs_ports_devel_gperf/gperf/work/gperf-3.0.4" && /usr/bin/patch -p0'
  56. :debug:patch Executing command line: cd "/opt/local/var/macports/build/_opt_local_var_macports_sources_rsync.macports.org_release_tarballs_ports_devel_gperf/gperf/work/gperf-3.0.4" && /usr/bin/patch -p0 < '/opt/local/var/macports/sources/rsync.macports.org/release/tarballs/ports/devel/gperf/files/c99.patch'
  57. :info:patch patching file src/output.cc
  58. :debug:patch Privilege de-escalation not attempted as not running as root.
  59. :debug:configure configure phase started at Fri Aug 5 14:52:41 EDT 2016
  60. :notice:configure ---> Configuring gperf
  61. :debug:configure Using compiler 'MacPorts Clang 3.7'
  62. :debug:configure Executing org.macports.configure (gperf)
  63. :debug:configure Environment:
  64. CC='/opt/local/bin/clang-mp-3.7'
  65. CC_PRINT_OPTIONS='YES'
  66. CC_PRINT_OPTIONS_FILE='/opt/local/var/macports/build/_opt_local_var_macports_sources_rsync.macports.org_release_tarballs_ports_devel_gperf/gperf/work/.CC_PRINT_OPTIONS'
  67. CFLAGS='-pipe -Os -arch x86_64 -arch i386'
  68. CPATH='/opt/local/include'
  69. CPPFLAGS='-I/opt/local/include'
  70. CXX='/opt/local/bin/clang++-mp-3.7'
  71. CXXFLAGS='-pipe -Os -arch x86_64 -arch i386 -stdlib=libc++'
  72. F90FLAGS='-pipe -Os'
  73. FCFLAGS='-pipe -Os'
  74. FFLAGS='-pipe -Os'
  75. INSTALL='/usr/bin/install -c'
  76. LDFLAGS='-L/opt/local/lib -Wl,-headerpad_max_install_names -arch x86_64 -arch i386'
  77. LIBRARY_PATH='/opt/local/lib'
  78. MACOSX_DEPLOYMENT_TARGET='10.6'
  79. OBJC='/opt/local/bin/clang-mp-3.7'
  80. OBJCFLAGS='-pipe -Os -arch x86_64 -arch i386'
  81. OBJCXX='/opt/local/bin/clang++-mp-3.7'
  82. OBJCXXFLAGS='-pipe -Os -arch x86_64 -arch i386 -stdlib=libc++'
  83. :debug:configure Assembled command: 'cd "/opt/local/var/macports/build/_opt_local_var_macports_sources_rsync.macports.org_release_tarballs_ports_devel_gperf/gperf/work/gperf-3.0.4" && ./configure --prefix=/opt/local --disable-dependency-tracking --infodir=/opt/local/share/info'
  84. :debug:configure Executing command line: cd "/opt/local/var/macports/build/_opt_local_var_macports_sources_rsync.macports.org_release_tarballs_ports_devel_gperf/gperf/work/gperf-3.0.4" && ./configure --prefix=/opt/local --disable-dependency-tracking --infodir=/opt/local/share/info
  85. :info:configure checking whether make sets $(MAKE)... yes
  86. :info:configure configure: creating ./config.status
  87. :info:configure config.status: creating Makefile
  88. :info:configure === configuring in lib (/opt/local/var/macports/build/_opt_local_var_macports_sources_rsync.macports.org_release_tarballs_ports_devel_gperf/gperf/work/gperf-3.0.4/lib)
  89. :info:configure configure: running /bin/sh ./configure '--prefix=/opt/local' '--disable-dependency-tracking' '--infodir=/opt/local/share/info' --cache-file=/dev/null --srcdir=.
  90. :info:configure checking whether make sets $(MAKE)... yes
  91. :info:configure checking for gcc... /opt/local/bin/clang-mp-3.7
  92. :info:configure checking for C compiler default output file name... a.out
  93. :info:configure checking whether the C compiler works... yes
  94. :info:configure checking whether we are cross compiling... no
  95. :info:configure checking for suffix of executables...
  96. :info:configure checking for suffix of object files... o
  97. :info:configure checking whether we are using the GNU C compiler... yes
  98. :info:configure checking whether /opt/local/bin/clang-mp-3.7 accepts -g... yes
  99. :info:configure checking for /opt/local/bin/clang-mp-3.7 option to accept ISO C89... none needed
  100. :info:configure checking how to run the C preprocessor... /opt/local/bin/clang-mp-3.7 -E
  101. :info:configure checking whether we are using the GNU C++ compiler... yes
  102. :info:configure checking whether /opt/local/bin/clang++-mp-3.7 accepts -g... yes
  103. :info:configure checking how to run the C++ preprocessor... /opt/local/bin/clang++-mp-3.7 -E
  104. :info:configure checking for ranlib... ranlib
  105. :info:configure checking for a BSD compatible install... /usr/bin/install -c
  106. :info:configure configure: creating ./config.status
  107. :info:configure config.status: creating Makefile
  108. :info:configure === configuring in src (/opt/local/var/macports/build/_opt_local_var_macports_sources_rsync.macports.org_release_tarballs_ports_devel_gperf/gperf/work/gperf-3.0.4/src)
  109. :info:configure configure: running /bin/sh ./configure '--prefix=/opt/local' '--disable-dependency-tracking' '--infodir=/opt/local/share/info' --cache-file=/dev/null --srcdir=.
  110. :info:configure checking whether make sets $(MAKE)... yes
  111. :info:configure checking for gcc... /opt/local/bin/clang-mp-3.7
  112. :info:configure checking for C compiler default output file name... a.out
  113. :info:configure checking whether the C compiler works... yes
  114. :info:configure checking whether we are cross compiling... no
  115. :info:configure checking for suffix of executables...
  116. :info:configure checking for suffix of object files... o
  117. :info:configure checking whether we are using the GNU C compiler... yes
  118. :info:configure checking whether /opt/local/bin/clang-mp-3.7 accepts -g... yes
  119. :info:configure checking for /opt/local/bin/clang-mp-3.7 option to accept ISO C89... none needed
  120. :info:configure checking how to run the C preprocessor... /opt/local/bin/clang-mp-3.7 -E
  121. :info:configure checking whether we are using the GNU C++ compiler... yes
  122. :info:configure checking whether /opt/local/bin/clang++-mp-3.7 accepts -g... yes
  123. :info:configure checking how to run the C++ preprocessor... /opt/local/bin/clang++-mp-3.7 -E
  124. :info:configure checking for a BSD compatible install... /usr/bin/install -c
  125. :info:configure checking for stack-allocated variable-size arrays... yes
  126. :info:configure checking for rand in -lm... yes
  127. :info:configure configure: creating ./config.status
  128. :info:configure config.status: creating Makefile
  129. :info:configure config.status: creating config.h
  130. :info:configure === configuring in tests (/opt/local/var/macports/build/_opt_local_var_macports_sources_rsync.macports.org_release_tarballs_ports_devel_gperf/gperf/work/gperf-3.0.4/tests)
  131. :info:configure configure: running /bin/sh ./configure '--prefix=/opt/local' '--disable-dependency-tracking' '--infodir=/opt/local/share/info' --cache-file=/dev/null --srcdir=.
  132. :info:configure checking whether make sets $(MAKE)... yes
  133. :info:configure checking for gcc... /opt/local/bin/clang-mp-3.7
  134. :info:configure checking for C compiler default output file name... a.out
  135. :info:configure checking whether the C compiler works... yes
  136. :info:configure checking whether we are cross compiling... no
  137. :info:configure checking for suffix of executables...
  138. :info:configure checking for suffix of object files... o
  139. :info:configure checking whether we are using the GNU C compiler... yes
  140. :info:configure checking whether /opt/local/bin/clang-mp-3.7 accepts -g... yes
  141. :info:configure checking for /opt/local/bin/clang-mp-3.7 option to accept ISO C89... none needed
  142. :info:configure checking how to run the C preprocessor... /opt/local/bin/clang-mp-3.7 -E
  143. :info:configure checking whether we are using the GNU C++ compiler... yes
  144. :info:configure checking whether /opt/local/bin/clang++-mp-3.7 accepts -g... yes
  145. :info:configure checking how to run the C++ preprocessor... /opt/local/bin/clang++-mp-3.7 -E
  146. :info:configure configure: creating ./config.status
  147. :info:configure config.status: creating Makefile
  148. :info:configure === configuring in doc (/opt/local/var/macports/build/_opt_local_var_macports_sources_rsync.macports.org_release_tarballs_ports_devel_gperf/gperf/work/gperf-3.0.4/doc)
  149. :info:configure configure: running /bin/sh ./configure '--prefix=/opt/local' '--disable-dependency-tracking' '--infodir=/opt/local/share/info' --cache-file=/dev/null --srcdir=.
  150. :info:configure checking whether make sets $(MAKE)... yes
  151. :info:configure checking for a BSD compatible install... /usr/bin/install -c
  152. :info:configure configure: creating ./config.status
  153. :info:configure config.status: creating Makefile
  154. :debug:configure Privilege de-escalation not attempted as not running as root.
  155. :debug:build build phase started at Fri Aug 5 14:52:46 EDT 2016
  156. :notice:build ---> Building gperf
  157. :debug:build Executing org.macports.build (gperf)
  158. :debug:build Environment:
  159. CC_PRINT_OPTIONS='YES'
  160. CC_PRINT_OPTIONS_FILE='/opt/local/var/macports/build/_opt_local_var_macports_sources_rsync.macports.org_release_tarballs_ports_devel_gperf/gperf/work/.CC_PRINT_OPTIONS'
  161. CPATH='/opt/local/include'
  162. LIBRARY_PATH='/opt/local/lib'
  163. MACOSX_DEPLOYMENT_TARGET='10.6'
  164. :debug:build Assembled command: 'cd "/opt/local/var/macports/build/_opt_local_var_macports_sources_rsync.macports.org_release_tarballs_ports_devel_gperf/gperf/work/gperf-3.0.4" && /usr/bin/make -j4 -w all'
  165. :debug:build Executing command line: cd "/opt/local/var/macports/build/_opt_local_var_macports_sources_rsync.macports.org_release_tarballs_ports_devel_gperf/gperf/work/gperf-3.0.4" && /usr/bin/make -j4 -w all
  166. :info:build make: Entering directory `/opt/local/var/macports/build/_opt_local_var_macports_sources_rsync.macports.org_release_tarballs_ports_devel_gperf/gperf/work/gperf-3.0.4'
  167. :info:build cd lib; /usr/bin/make all
  168. :info:build make[1]: Entering directory `/opt/local/var/macports/build/_opt_local_var_macports_sources_rsync.macports.org_release_tarballs_ports_devel_gperf/gperf/work/gperf-3.0.4/lib'
  169. :info:build /opt/local/bin/clang-mp-3.7 -pipe -Os -arch x86_64 -arch i386 -I. -c ./getopt.c
  170. :info:build /opt/local/bin/clang-mp-3.7 -pipe -Os -arch x86_64 -arch i386 -I. -c ./getopt1.c
  171. :info:build /opt/local/bin/clang++-mp-3.7 -pipe -Os -arch x86_64 -arch i386 -stdlib=libc++ -I. -c ./getline.cc
  172. :info:build /opt/local/bin/clang++-mp-3.7 -pipe -Os -arch x86_64 -arch i386 -stdlib=libc++ -I. -c ./hash.cc
  173. :info:build ./getopt.c:567:30: warning: implicitly declaring library function 'strcmp' with type 'int (const char *, const char *)'
  174. :info:build if (optind != argc && !strcmp (argv[optind], "--"))
  175. :info:build ^
  176. :info:build ./getopt.c:567:30: note: include the header <string.h> or explicitly provide a declaration for 'strcmp'
  177. :info:build ./getopt.c:646:21: warning: implicitly declaring library function 'strlen' with type 'unsigned long (const char *)'
  178. :info:build == (unsigned int) strlen (p->name))
  179. :info:build ^
  180. :info:build ./getopt.c:646:21: note: include the header <string.h> or explicitly provide a declaration for 'strlen'
  181. :info:build ./getopt.c:694:6: warning: add explicit braces to avoid dangling else [-Wdangling-else]
  182. :info:build else
  183. :info:build ^
  184. :info:build 3 warnings generated.
  185. :info:build ./getopt.c:567:30: warning: implicitly declaring library function 'strcmp' with type 'int (const char *, const char *)'
  186. :info:build if (optind != argc && !strcmp (argv[optind], "--"))
  187. :info:build ^
  188. :info:build ./getopt.c:567:30: note: include the header <string.h> or explicitly provide a declaration for 'strcmp'
  189. :info:build ./getopt.c:646:21: warning: implicitly declaring library function 'strlen' with type 'unsigned long (const char *)'
  190. :info:build == (unsigned int) strlen (p->name))
  191. :info:build ^
  192. :info:build ./getopt.c:646:21: note: include the header <string.h> or explicitly provide a declaration for 'strlen'
  193. :info:build ./getopt.c:694:6: warning: add explicit braces to avoid dangling else [-Wdangling-else]
  194. :info:build else
  195. :info:build ^
  196. :info:build 3 warnings generated.
  197. :info:build rm -f libgp.a
  198. :info:build ar rc libgp.a getopt.o getopt1.o getline.o hash.o
  199. :info:build ranlib libgp.a
  200. :info:build make[1]: Leaving directory `/opt/local/var/macports/build/_opt_local_var_macports_sources_rsync.macports.org_release_tarballs_ports_devel_gperf/gperf/work/gperf-3.0.4/lib'
  201. :info:build cd src; /usr/bin/make all
  202. :info:build make[1]: Entering directory `/opt/local/var/macports/build/_opt_local_var_macports_sources_rsync.macports.org_release_tarballs_ports_devel_gperf/gperf/work/gperf-3.0.4/src'
  203. :info:build /opt/local/bin/clang++-mp-3.7 -pipe -Os -arch x86_64 -arch i386 -stdlib=libc++ -I. -I./../lib -c ./version.cc
  204. :info:build /opt/local/bin/clang++-mp-3.7 -pipe -Os -arch x86_64 -arch i386 -stdlib=libc++ -I. -I./../lib -c ./positions.cc
  205. :info:build /opt/local/bin/clang++-mp-3.7 -pipe -Os -arch x86_64 -arch i386 -stdlib=libc++ -I. -I./../lib -c ./options.cc
  206. :info:build /opt/local/bin/clang++-mp-3.7 -pipe -Os -arch x86_64 -arch i386 -stdlib=libc++ -I. -I./../lib -c ./keyword.cc
  207. :info:build /opt/local/bin/clang++-mp-3.7 -pipe -Os -arch x86_64 -arch i386 -stdlib=libc++ -I. -I./../lib -c ./keyword-list.cc
  208. :info:build ./options.cc:282:27: warning: '&&' within '||' [-Wlogical-op-parentheses]
  209. :info:build if (*arg >= 'A' && *arg <= 'Z' || *arg >= 'a' && *arg <= 'z')
  210. :info:build ~~~~~~~~~~~~^~~~~~~~~~~~~~ ~~
  211. :info:build ./options.cc:282:27: note: place parentheses around the '&&' expression to silence this warning
  212. :info:build if (*arg >= 'A' && *arg <= 'Z' || *arg >= 'a' && *arg <= 'z')
  213. :info:build ^
  214. :info:build ( )
  215. :info:build ./options.cc:282:57: warning: '&&' within '||' [-Wlogical-op-parentheses]
  216. :info:build if (*arg >= 'A' && *arg <= 'Z' || *arg >= 'a' && *arg <= 'z')
  217. :info:build ~~ ~~~~~~~~~~~~^~~~~~~~~~~~~~
  218. :info:build ./options.cc:282:57: note: place parentheses around the '&&' expression to silence this warning
  219. :info:build if (*arg >= 'A' && *arg <= 'Z' || *arg >= 'a' && *arg <= 'z')
  220. :info:build ^
  221. :info:build ( )
  222. :info:build ./options.cc:294:34: warning: '&&' within '||' [-Wlogical-op-parentheses]
  223. :info:build while (*arg >= 'A' && *arg <= 'Z' || *arg >= 'a' && *arg <= 'z' || *arg == '-');
  224. :info:build ~~~~~~~~~~~~^~~~~~~~~~~~~~ ~~
  225. :info:build ./options.cc:294:34: note: place parentheses around the '&&' expression to silence this warning
  226. :info:build while (*arg >= 'A' && *arg <= 'Z' || *arg >= 'a' && *arg <= 'z' || *arg == '-');
  227. :info:build ^
  228. :info:build ( )
  229. :info:build ./options.cc:294:64: warning: '&&' within '||' [-Wlogical-op-parentheses]
  230. :info:build while (*arg >= 'A' && *arg <= 'Z' || *arg >= 'a' && *arg <= 'z' || *arg == '-');
  231. :info:build ~~ ~~~~~~~~~~~~^~~~~~~~~~~~~~
  232. :info:build ./options.cc:294:64: note: place parentheses around the '&&' expression to silence this warning
  233. :info:build while (*arg >= 'A' && *arg <= 'Z' || *arg >= 'a' && *arg <= 'z' || *arg == '-');
  234. :info:build ^
  235. :info:build ( )
  236. :info:build /opt/local/bin/clang++-mp-3.7 -pipe -Os -arch x86_64 -arch i386 -stdlib=libc++ -I. -I./../lib -c ./input.cc
  237. :info:build /opt/local/bin/clang++-mp-3.7 -pipe -Os -arch x86_64 -arch i386 -stdlib=libc++ -I. -I./../lib -c ./bool-array.cc
  238. :info:build /opt/local/bin/clang++-mp-3.7 -pipe -Os -arch x86_64 -arch i386 -stdlib=libc++ -I. -I./../lib -c ./hash-table.cc
  239. :info:build /opt/local/bin/clang++-mp-3.7 -pipe -Os -arch x86_64 -arch i386 -stdlib=libc++ -I. -I./../lib -c ./search.cc
  240. :info:build 4 warnings generated.
  241. :info:build ./options.cc:282:27: warning: '&&' within '||' [-Wlogical-op-parentheses]
  242. :info:build if (*arg >= 'A' && *arg <= 'Z' || *arg >= 'a' && *arg <= 'z')
  243. :info:build ~~~~~~~~~~~~^~~~~~~~~~~~~~ ~~
  244. :info:build ./options.cc:282:27: note: place parentheses around the '&&' expression to silence this warning
  245. :info:build if (*arg >= 'A' && *arg <= 'Z' || *arg >= 'a' && *arg <= 'z')
  246. :info:build ^
  247. :info:build ( )
  248. :info:build ./options.cc:282:57: warning: '&&' within '||' [-Wlogical-op-parentheses]
  249. :info:build if (*arg >= 'A' && *arg <= 'Z' || *arg >= 'a' && *arg <= 'z')
  250. :info:build ~~ ~~~~~~~~~~~~^~~~~~~~~~~~~~
  251. :info:build ./options.cc:282:57: note: place parentheses around the '&&' expression to silence this warning
  252. :info:build if (*arg >= 'A' && *arg <= 'Z' || *arg >= 'a' && *arg <= 'z')
  253. :info:build ^
  254. :info:build ( )
  255. :info:build ./options.cc:294:34: warning: '&&' within '||' [-Wlogical-op-parentheses]
  256. :info:build while (*arg >= 'A' && *arg <= 'Z' || *arg >= 'a' && *arg <= 'z' || *arg == '-');
  257. :info:build ~~~~~~~~~~~~^~~~~~~~~~~~~~ ~~
  258. :info:build ./options.cc:294:34: note: place parentheses around the '&&' expression to silence this warning
  259. :info:build while (*arg >= 'A' && *arg <= 'Z' || *arg >= 'a' && *arg <= 'z' || *arg == '-');
  260. :info:build ^
  261. :info:build ( )
  262. :info:build ./options.cc:294:64: warning: '&&' within '||' [-Wlogical-op-parentheses]
  263. :info:build while (*arg >= 'A' && *arg <= 'Z' || *arg >= 'a' && *arg <= 'z' || *arg == '-');
  264. :info:build ~~ ~~~~~~~~~~~~^~~~~~~~~~~~~~
  265. :info:build ./options.cc:294:64: note: place parentheses around the '&&' expression to silence this warning
  266. :info:build while (*arg >= 'A' && *arg <= 'Z' || *arg >= 'a' && *arg <= 'z' || *arg == '-');
  267. :info:build ^
  268. :info:build ( )
  269. :info:build ./search.cc:163:5: warning: add explicit braces to avoid dangling else [-Wdangling-else]
  270. :info:build for (KeywordExt_List *temp = _head; temp; temp = temp->rest())
  271. :info:build ^
  272. :info:build ./search.cc:37:22: note: expanded from macro 'for'
  273. :info:build #define for if (0) ; else for
  274. :info:build ^
  275. :info:build ./search.cc:418:15: warning: add explicit braces to avoid dangling else [-Wdangling-else]
  276. :info:build for (int i3 = imax; i3 >= 0; i3--)
  277. :info:build ^
  278. :info:build ./search.cc:37:22: note: expanded from macro 'for'
  279. :info:build #define for if (0) ; else for
  280. :info:build ^
  281. :info:build ./search.cc:416:11: warning: add explicit braces to avoid dangling else [-Wdangling-else]
  282. :info:build for (int i2 = imax; i2 >= -1; i2--)
  283. :info:build ^
  284. :info:build ./search.cc:37:22: note: expanded from macro 'for'
  285. :info:build #define for if (0) ; else for
  286. :info:build ^
  287. :info:build /opt/local/bin/clang++-mp-3.7 -pipe -Os -arch x86_64 -arch i386 -stdlib=libc++ -I. -I./../lib -c ./output.cc
  288. :info:build ./search.cc:1639:5: warning: add explicit braces to avoid dangling else [-Wdangling-else]
  289. :info:build for (unsigned int c = 0; c < _alpha_size; c++)
  290. :info:build ^
  291. :info:build ./search.cc:37:22: note: expanded from macro 'for'
  292. :info:build #define for if (0) ; else for
  293. :info:build ^
  294. :info:build ./output.cc:1301:22: warning: format specifies type 'int' but the argument has type 'long' [-Wformat]
  295. :info:build dup_ptr - duplicates,
  296. :info:build ^~~~~~~~~~~~~~~~~~~~
  297. :info:build 4 warnings generated.
  298. :info:build /opt/local/bin/clang++-mp-3.7 -pipe -Os -arch x86_64 -arch i386 -stdlib=libc++ -I. -I./../lib -c ./main.cc
  299. :info:build 4 warnings generated.
  300. :info:build 1 warning generated.
  301. :info:build ./search.cc:163:5: warning: add explicit braces to avoid dangling else [-Wdangling-else]
  302. :info:build for (KeywordExt_List *temp = _head; temp; temp = temp->rest())
  303. :info:build ^
  304. :info:build ./search.cc:37:22: note: expanded from macro 'for'
  305. :info:build #define for if (0) ; else for
  306. :info:build ^
  307. :info:build ./search.cc:418:15: warning: add explicit braces to avoid dangling else [-Wdangling-else]
  308. :info:build for (int i3 = imax; i3 >= 0; i3--)
  309. :info:build ^
  310. :info:build ./search.cc:37:22: note: expanded from macro 'for'
  311. :info:build #define for if (0) ; else for
  312. :info:build ^
  313. :info:build ./search.cc:416:11: warning: add explicit braces to avoid dangling else [-Wdangling-else]
  314. :info:build for (int i2 = imax; i2 >= -1; i2--)
  315. :info:build ^
  316. :info:build ./search.cc:37:22: note: expanded from macro 'for'
  317. :info:build #define for if (0) ; else for
  318. :info:build ^
  319. :info:build ./search.cc:1639:5: warning: add explicit braces to avoid dangling else [-Wdangling-else]
  320. :info:build for (unsigned int c = 0; c < _alpha_size; c++)
  321. :info:build ^
  322. :info:build ./search.cc:37:22: note: expanded from macro 'for'
  323. :info:build #define for if (0) ; else for
  324. :info:build ^
  325. :info:build 4 warnings generated.
  326. :info:build /opt/local/bin/clang++-mp-3.7 -pipe -Os -arch x86_64 -arch i386 -stdlib=libc++ -L/opt/local/lib -Wl,-headerpad_max_install_names -arch x86_64 -arch i386 -o gperf version.o positions.o options.o keyword.o keyword-list.o input.o bool-array.o hash-table.o search.o output.o main.o ../lib/libgp.a -lm
  327. :info:build ld: warning: ignoring file /usr/lib/libc++.dylib, file was built for unsupported file format ( 0xcf 0xfa 0xed 0xfe 0x 7 0x 0 0x 0 0x 1 0x 3 0x 0 0x 0 0x 0 0x 6 0x 0 0x 0 0x 0 ) which is not the architecture being linked (i386): /usr/lib/libc++.dylib
  328. :info:build Undefined symbols for architecture i386:
  329. :info:build "std::terminate()", referenced from:
  330. :info:build ___clang_call_terminate in search.o
  331. :info:build ___clang_call_terminate in main.o
  332. :info:build "vtable for __cxxabiv1::__class_type_info", referenced from:
  333. :info:build typeinfo for Keyword_Factory in keyword.o
  334. :info:build typeinfo for Output_Constants in output.o
  335. :info:build typeinfo for Output_Expr in output.o
  336. :info:build typeinfo for Output_Compare in output.o
  337. :info:build NOTE: a missing vtable usually means the first non-inline virtual member function has no definition.
  338. :info:build "vtable for __cxxabiv1::__si_class_type_info", referenced from:
  339. :info:build typeinfo for Output_Defines in output.o
  340. :info:build typeinfo for Output_Enum in output.o
  341. :info:build typeinfo for Output_Expr1 in output.o
  342. :info:build typeinfo for Output_Compare_Strcmp in output.o
  343. :info:build typeinfo for Output_Compare_Strncmp in output.o
  344. :info:build typeinfo for Output_Compare_Memcmp in output.o
  345. :info:build typeinfo for KeywordExt_Factory in main.o
  346. :info:build ...
  347. :info:build NOTE: a missing vtable usually means the first non-inline virtual member function has no definition.
  348. :info:build "operator delete[](void*)", referenced from:
  349. :info:build KeywordExt::delete_selchars() in keyword.o
  350. :info:build Input::read_input() in input.o
  351. :info:build Input::~Input() in input.o
  352. :info:build Bool_Array::~Bool_Array() in bool-array.o
  353. :info:build Hash_Table::~Hash_Table() in hash-table.o
  354. :info:build Hash_Table::~Hash_Table() in hash-table.o
  355. :info:build Search::find_positions() in search.o
  356. :info:build ...
  357. :info:build "operator delete(void*)", referenced from:
  358. :info:build Keyword_Factory::~Keyword_Factory() in keyword.o
  359. :info:build delete_list(Keyword_List*) in keyword-list.o
  360. :info:build Input::read_input() in input.o
  361. :info:build Search::prepare_asso_values() in search.o
  362. :info:build Search::compute_partition(bool*) const in search.o
  363. :info:build Search::find_asso_values() in search.o
  364. :info:build delete_partition(EquivalenceClass*) in search.o
  365. :info:build ...
  366. :info:build "operator new[](unsigned long)", referenced from:
  367. :info:build KeywordExt::init_selchars_low(Positions const&, unsigned int const*, unsigned int const*) in keyword.o
  368. :info:build Input::read_input() in input.o
  369. :info:build is_declaration_with_arg(char const*, char const*, unsigned int, char const*, char**) in input.o
  370. :info:build is_define_declaration(char const*, char const*, unsigned int, char const*, char**) in input.o
  371. :info:build Hash_Table::Hash_Table(unsigned int, bool) in hash-table.o
  372. :info:build Search::compute_alpha_unify() const in search.o
  373. :info:build Search::compute_alpha_unify(Positions const&, unsigned int const*) const in search.o
  374. :info:build ...
  375. :info:build "operator new(unsigned long)", referenced from:
  376. :info:build copy_list(Keyword_List*) in keyword-list.o
  377. :info:build Input::read_input() in input.o
  378. :info:build Search::prepare_asso_values() in search.o
  379. :info:build Search::compute_partition(bool*) const in search.o
  380. :info:build Search::find_asso_values() in search.o
  381. :info:build KeywordExt_Factory::create_keyword(char const*, int, char const*) in main.o
  382. :info:build "___cxa_begin_catch", referenced from:
  383. :info:build ___clang_call_terminate in search.o
  384. :info:build ___clang_call_terminate in main.o
  385. :info:build "___cxa_pure_virtual", referenced from:
  386. :info:build vtable for Keyword_Factory in keyword.o
  387. :info:build "___gxx_personality_v0", referenced from:
  388. :info:build Dwarf Exception Unwind Info (__eh_frame) in input.o
  389. :info:build Dwarf Exception Unwind Info (__eh_frame) in search.o
  390. :info:build Dwarf Exception Unwind Info (__eh_frame) in output.o
  391. :info:build Dwarf Exception Unwind Info (__eh_frame) in main.o
  392. :info:build Dwarf Exception Unwind Info (__eh_frame) in input.o
  393. :info:build Dwarf Exception Unwind Info (__eh_frame) in search.o
  394. :info:build Dwarf Exception Unwind Info (__eh_frame) in output.o
  395. :info:build Dwarf Exception Unwind Info (__eh_frame) in main.o
  396. :info:build Dwarf Exception Unwind Info (__eh_frame) in input.o
  397. :info:build Dwarf Exception Unwind Info (__eh_frame) in search.o
  398. :info:build Dwarf Exception Unwind Info (__eh_frame) in output.o
  399. :info:build Dwarf Exception Unwind Info (__eh_frame) in main.o
  400. :info:build Dwarf Exception Unwind Info (__eh_frame) in input.o
  401. :info:build Dwarf Exception Unwind Info (__eh_frame) in search.o
  402. :info:build Dwarf Exception Unwind Info (__eh_frame) in output.o
  403. :info:build Dwarf Exception Unwind Info (__eh_frame) in main.o
  404. :info:build ld: symbol(s) not found for architecture i386
  405. :info:build clang: error: linker command failed with exit code 1 (use -v to see invocation)
  406. :info:build make[1]: *** [gperf] Error 1
  407. :info:build make[1]: Leaving directory `/opt/local/var/macports/build/_opt_local_var_macports_sources_rsync.macports.org_release_tarballs_ports_devel_gperf/gperf/work/gperf-3.0.4/src'
  408. :info:build make: *** [all] Error 2
  409. :info:build make: Leaving directory `/opt/local/var/macports/build/_opt_local_var_macports_sources_rsync.macports.org_release_tarballs_ports_devel_gperf/gperf/work/gperf-3.0.4'
  410. :info:build Command failed: cd "/opt/local/var/macports/build/_opt_local_var_macports_sources_rsync.macports.org_release_tarballs_ports_devel_gperf/gperf/work/gperf-3.0.4" && /usr/bin/make -j4 -w all
  411. :info:build Exit code: 2
  412. :error:build org.macports.build for port gperf returned: command execution failed
  413. :debug:build Error code: CHILDSTATUS 83478 2
  414. :debug:build Backtrace: command execution failed
  415. while executing
  416. "system -nice 0 $fullcmdstring"
  417. ("eval" body line 1)
  418. invoked from within
  419. "eval system $notty $nice \$fullcmdstring"
  420. invoked from within
  421. "command_exec build"
  422. (procedure "portbuild::build_main" line 8)
  423. invoked from within
  424. "portbuild::build_main org.macports.build"
  425. ("eval" body line 1)
  426. invoked from within
  427. "eval $procedure $targetname"
  428. :info:build Warning: targets not executed for gperf: org.macports.activate org.macports.build org.macports.destroot org.macports.install
  429. :notice:build Please see the log file for port gperf for details:
  430. /opt/local/var/macports/logs/_opt_local_var_macports_sources_rsync.macports.org_release_tarballs_ports_devel_gperf/gperf/main.log
Advertisement
Add Comment
Please, Sign In to add comment
Advertisement