SHARE
TWEET

Untitled

a guest Dec 17th, 2018 79 Never
Not a member of Pastebin yet? Sign Up, it unlocks many cool features!
  1. <command-line>:0:12: error: incomplete universal character name \U
  2. src\globalattributes.cpp:74:76: note: in expansion of macro 'SCHEMASDIR'
  3.   SCHEMAS_ROOT_DIR=getPathFromEnv(QString("PGMODELER_SCHEMAS_DIR"), QString(SCHEMASDIR), QString("./schemas")),
  4.                                                                             ^
  5. <command-line>:0:12: error: incomplete universal character name \U
  6. src\globalattributes.cpp:74:76: note: in expansion of macro 'SCHEMASDIR'
  7.   SCHEMAS_ROOT_DIR=getPathFromEnv(QString("PGMODELER_SCHEMAS_DIR"), QString(SCHEMASDIR), QString("./schemas")),
  8.                                                                             ^
  9. <command-line>:0:12: warning: unknown escape sequence: '\D'
  10. src\globalattributes.cpp:74:76: note: in expansion of macro 'SCHEMASDIR'
  11.   SCHEMAS_ROOT_DIR=getPathFromEnv(QString("PGMODELER_SCHEMAS_DIR"), QString(SCHEMASDIR), QString("./schemas")),
  12.                                                                             ^
  13. <command-line>:0:12: warning: unknown escape sequence: '\L'
  14. src\globalattributes.cpp:74:76: note: in expansion of macro 'SCHEMASDIR'
  15.   SCHEMAS_ROOT_DIR=getPathFromEnv(QString("PGMODELER_SCHEMAS_DIR"), QString(SCHEMASDIR), QString("./schemas")),
  16.                                                                             ^
  17. <command-line>:0:12: warning: unknown escape sequence: '\P'
  18. src\globalattributes.cpp:74:76: note: in expansion of macro 'SCHEMASDIR'
  19.   SCHEMAS_ROOT_DIR=getPathFromEnv(QString("PGMODELER_SCHEMAS_DIR"), QString(SCHEMASDIR), QString("./schemas")),
  20.                                                                             ^
  21. <command-line>:0:9: error: incomplete universal character name \U
  22. src\globalattributes.cpp:75:70: note: in expansion of macro 'LANGDIR'
  23.   LANGUAGES_DIR=getPathFromEnv(QString("PGMODELER_LANG_DIR"), QString(LANGDIR), QString("./lang")),
  24.                                                                       ^
  25. <command-line>:0:9: error: incomplete universal character name \U
  26. src\globalattributes.cpp:75:70: note: in expansion of macro 'LANGDIR'
  27.   LANGUAGES_DIR=getPathFromEnv(QString("PGMODELER_LANG_DIR"), QString(LANGDIR), QString("./lang")),
  28.                                                                       ^
  29. <command-line>:0:9: warning: unknown escape sequence: '\D'
  30. src\globalattributes.cpp:75:70: note: in expansion of macro 'LANGDIR'
  31.   LANGUAGES_DIR=getPathFromEnv(QString("PGMODELER_LANG_DIR"), QString(LANGDIR), QString("./lang")),
  32.                                                                       ^
  33. <command-line>:0:9: warning: unknown escape sequence: '\L'
  34. src\globalattributes.cpp:75:70: note: in expansion of macro 'LANGDIR'
  35.   LANGUAGES_DIR=getPathFromEnv(QString("PGMODELER_LANG_DIR"), QString(LANGDIR), QString("./lang")),
  36.                                                                       ^
  37. <command-line>:0:9: warning: unknown escape sequence: '\P'
  38. src\globalattributes.cpp:75:70: note: in expansion of macro 'LANGDIR'
  39.   LANGUAGES_DIR=getPathFromEnv(QString("PGMODELER_LANG_DIR"), QString(LANGDIR), QString("./lang")),
  40.                                                                       ^
  41. <command-line>:0:12: error: incomplete universal character name \U
  42. src\globalattributes.cpp:76:71: note: in expansion of macro 'SAMPLESDIR'
  43.   SAMPLES_DIR=getPathFromEnv(QString("PGMODELER_SAMPLES_DIR"), QString(SAMPLESDIR), QString("./samples")),
  44.                                                                        ^
  45. <command-line>:0:12: error: incomplete universal character name \U
  46. src\globalattributes.cpp:76:71: note: in expansion of macro 'SAMPLESDIR'
  47.   SAMPLES_DIR=getPathFromEnv(QString("PGMODELER_SAMPLES_DIR"), QString(SAMPLESDIR), QString("./samples")),
  48.                                                                        ^
  49. <command-line>:0:12: warning: unknown escape sequence: '\D'
  50. src\globalattributes.cpp:76:71: note: in expansion of macro 'SAMPLESDIR'
  51.   SAMPLES_DIR=getPathFromEnv(QString("PGMODELER_SAMPLES_DIR"), QString(SAMPLESDIR), QString("./samples")),
  52.                                                                        ^
  53. <command-line>:0:12: warning: unknown escape sequence: '\L'
  54. src\globalattributes.cpp:76:71: note: in expansion of macro 'SAMPLESDIR'
  55.   SAMPLES_DIR=getPathFromEnv(QString("PGMODELER_SAMPLES_DIR"), QString(SAMPLESDIR), QString("./samples")),
  56.                                                                        ^
  57. <command-line>:0:12: warning: unknown escape sequence: '\P'
  58. src\globalattributes.cpp:76:71: note: in expansion of macro 'SAMPLESDIR'
  59.   SAMPLES_DIR=getPathFromEnv(QString("PGMODELER_SAMPLES_DIR"), QString(SAMPLESDIR), QString("./samples")),
  60.                                                                        ^
  61. <command-line>:0:9: error: incomplete universal character name \U
  62. src\globalattributes.cpp:77:85: note: in expansion of macro 'CONFDIR'
  63.   TMPL_CONFIGURATIONS_DIR=getPathFromEnv(QString("PGMODELER_TMPL_CONF_DIR"), QString(CONFDIR), QString("./conf")),
  64.                                                                                      ^
  65. <command-line>:0:9: error: incomplete universal character name \U
  66. src\globalattributes.cpp:77:85: note: in expansion of macro 'CONFDIR'
  67.   TMPL_CONFIGURATIONS_DIR=getPathFromEnv(QString("PGMODELER_TMPL_CONF_DIR"), QString(CONFDIR), QString("./conf")),
  68.                                                                                      ^
  69. <command-line>:0:9: warning: unknown escape sequence: '\D'
  70. src\globalattributes.cpp:77:85: note: in expansion of macro 'CONFDIR'
  71.   TMPL_CONFIGURATIONS_DIR=getPathFromEnv(QString("PGMODELER_TMPL_CONF_DIR"), QString(CONFDIR), QString("./conf")),
  72.                                                                                      ^
  73. <command-line>:0:9: warning: unknown escape sequence: '\L'
  74. src\globalattributes.cpp:77:85: note: in expansion of macro 'CONFDIR'
  75.   TMPL_CONFIGURATIONS_DIR=getPathFromEnv(QString("PGMODELER_TMPL_CONF_DIR"), QString(CONFDIR), QString("./conf")),
  76.                                                                                      ^
  77. <command-line>:0:9: warning: unknown escape sequence: '\P'
  78. src\globalattributes.cpp:77:85: note: in expansion of macro 'CONFDIR'
  79.   TMPL_CONFIGURATIONS_DIR=getPathFromEnv(QString("PGMODELER_TMPL_CONF_DIR"), QString(CONFDIR), QString("./conf")),
  80.                                                                                      ^
  81. <command-line>:0:12: error: incomplete universal character name \U
  82. src\globalattributes.cpp:80:117: note: in expansion of macro 'PLUGINSDIR'
  83.   PLUGINS_DIR=getenv("PGMODELER_PLUGINS_DIR") ? QString(getenv("PGMODELER_PLUGINS_DIR")).replace('\\','/') : QString(PLUGINSDIR),
  84.                                                                                                                      ^
  85. <command-line>:0:12: error: incomplete universal character name \U
  86. src\globalattributes.cpp:80:117: note: in expansion of macro 'PLUGINSDIR'
  87.   PLUGINS_DIR=getenv("PGMODELER_PLUGINS_DIR") ? QString(getenv("PGMODELER_PLUGINS_DIR")).replace('\\','/') : QString(PLUGINSDIR),
  88.                                                                                                                      ^
  89. <command-line>:0:12: warning: unknown escape sequence: '\D'
  90. src\globalattributes.cpp:80:117: note: in expansion of macro 'PLUGINSDIR'
  91.   PLUGINS_DIR=getenv("PGMODELER_PLUGINS_DIR") ? QString(getenv("PGMODELER_PLUGINS_DIR")).replace('\\','/') : QString(PLUGINSDIR),
  92.                                                                                                                      ^
  93. <command-line>:0:12: warning: unknown escape sequence: '\L'
  94. src\globalattributes.cpp:80:117: note: in expansion of macro 'PLUGINSDIR'
  95.   PLUGINS_DIR=getenv("PGMODELER_PLUGINS_DIR") ? QString(getenv("PGMODELER_PLUGINS_DIR")).replace('\\','/') : QString(PLUGINSDIR),
  96.                                                                                                                      ^
  97. <command-line>:0:12: warning: unknown escape sequence: '\P'
  98. src\globalattributes.cpp:80:117: note: in expansion of macro 'PLUGINSDIR'
  99.   PLUGINS_DIR=getenv("PGMODELER_PLUGINS_DIR") ? QString(getenv("PGMODELER_PLUGINS_DIR")).replace('\\','/') : QString(PLUGINSDIR),
  100.                                                                                                                      ^
  101. <command-line>:0:15: error: incomplete universal character name \U
  102. src\globalattributes.cpp:129:22: note: in expansion of macro 'PRIVATEBINDIR'
  103.               QString(PRIVATEBINDIR) + QString("\\pgmodeler-ch.exe"),
  104.                       ^
  105. <command-line>:0:15: error: incomplete universal character name \U
  106. src\globalattributes.cpp:129:22: note: in expansion of macro 'PRIVATEBINDIR'
  107.               QString(PRIVATEBINDIR) + QString("\\pgmodeler-ch.exe"),
  108.                       ^
  109. <command-line>:0:15: warning: unknown escape sequence: '\D'
  110. src\globalattributes.cpp:129:22: note: in expansion of macro 'PRIVATEBINDIR'
  111.               QString(PRIVATEBINDIR) + QString("\\pgmodeler-ch.exe"),
  112.                       ^
  113. <command-line>:0:15: warning: unknown escape sequence: '\L'
  114. src\globalattributes.cpp:129:22: note: in expansion of macro 'PRIVATEBINDIR'
  115.               QString(PRIVATEBINDIR) + QString("\\pgmodeler-ch.exe"),
  116.                       ^
  117. <command-line>:0:15: warning: unknown escape sequence: '\P'
  118. src\globalattributes.cpp:129:22: note: in expansion of macro 'PRIVATEBINDIR'
  119.               QString(PRIVATEBINDIR) + QString("\\pgmodeler-ch.exe"),
  120.                       ^
  121. <command-line>:0:15: error: incomplete universal character name \U
  122. src\globalattributes.cpp:133:20: note: in expansion of macro 'PRIVATEBINDIR'
  123.             QString(PRIVATEBINDIR) + QString("\\pgmodeler-cli.exe"),
  124.                     ^
  125. <command-line>:0:15: error: incomplete universal character name \U
  126. src\globalattributes.cpp:133:20: note: in expansion of macro 'PRIVATEBINDIR'
  127.             QString(PRIVATEBINDIR) + QString("\\pgmodeler-cli.exe"),
  128.                     ^
  129. <command-line>:0:15: warning: unknown escape sequence: '\D'
  130. src\globalattributes.cpp:133:20: note: in expansion of macro 'PRIVATEBINDIR'
  131.             QString(PRIVATEBINDIR) + QString("\\pgmodeler-cli.exe"),
  132.                     ^
  133. <command-line>:0:15: warning: unknown escape sequence: '\L'
  134. src\globalattributes.cpp:133:20: note: in expansion of macro 'PRIVATEBINDIR'
  135.             QString(PRIVATEBINDIR) + QString("\\pgmodeler-cli.exe"),
  136.                     ^
  137. <command-line>:0:15: warning: unknown escape sequence: '\P'
  138. src\globalattributes.cpp:133:20: note: in expansion of macro 'PRIVATEBINDIR'
  139.             QString(PRIVATEBINDIR) + QString("\\pgmodeler-cli.exe"),
  140.                     ^
  141. <command-line>:0:8: error: incomplete universal character name \U
  142. src\globalattributes.cpp:137:20: note: in expansion of macro 'BINDIR'
  143.             QString(BINDIR) + QString("\\pgmodeler.exe"),
  144.                     ^
  145. <command-line>:0:8: error: incomplete universal character name \U
  146. src\globalattributes.cpp:137:20: note: in expansion of macro 'BINDIR'
  147.             QString(BINDIR) + QString("\\pgmodeler.exe"),
  148.                     ^
  149. <command-line>:0:8: warning: unknown escape sequence: '\D'
  150. src\globalattributes.cpp:137:20: note: in expansion of macro 'BINDIR'
  151.             QString(BINDIR) + QString("\\pgmodeler.exe"),
  152.                     ^
  153. <command-line>:0:8: warning: unknown escape sequence: '\L'
  154. src\globalattributes.cpp:137:20: note: in expansion of macro 'BINDIR'
  155.             QString(BINDIR) + QString("\\pgmodeler.exe"),
  156.                     ^
  157. <command-line>:0:8: warning: unknown escape sequence: '\P'
  158. src\globalattributes.cpp:137:20: note: in expansion of macro 'BINDIR'
  159.             QString(BINDIR) + QString("\\pgmodeler.exe"),
  160.                     ^
  161. Makefile.Release:311: recipe for target 'obj/globalattributes.o' failed
  162. mingw32-make[2]: *** [obj/globalattributes.o] Error 1
  163. mingw32-make[2]: Leaving directory 'C:/Users/Utilisateur/Desktop/Logiciels/PgModelere/pgmodeler/libutils'
  164. Makefile:36: recipe for target 'release' failed
  165. mingw32-make[1]: *** [release] Error 2
  166. mingw32-make[1]: Leaving directory 'C:/Users/Utilisateur/Desktop/Logiciels/PgModelere/pgmodeler/libutils'
  167. Makefile:48: recipe for target 'sub-libutils-make_first-ordered' failed
  168. mingw32-make: *** [sub-libutils-make_first-ordered] Error 2
RAW Paste Data
We use cookies for various purposes including analytics. By continuing to use Pastebin, you agree to our use of cookies as described in the Cookies Policy. OK, I Understand
 
Top