Guest User

Untitled

a guest
Dec 11th, 2019
109
Never
Not a member of Pastebin yet? Sign Up, it unlocks many cool features!
  1.  * Package: sys-apps/sandbox-2.13
  2.  * Repository: gentoo
  3.  * Maintainer: sandbox@gentoo.org
  4.  * USE: abi_x86_32 abi_x86_64 amd64 elibc_glibc kernel_linux userland_GNU
  5.  * FEATURES: network-sandbox preserve-libs userpriv
  6. >>> Unpacking source...
  7. >>> Unpacking sandbox-2.13.tar.xz to /var/tmp/portage/sys-apps/sandbox-2.13/work
  8. >>> Source unpacked in /var/tmp/portage/sys-apps/sandbox-2.13/work
  9. >>> Preparing source in /var/tmp/portage/sys-apps/sandbox-2.13/work/sandbox-2.13 ...
  10. >>> Source prepared.
  11. >>> Configuring source in /var/tmp/portage/sys-apps/sandbox-2.13/work/sandbox-2.13 ...
  12. * abi_x86_32.x86: running multilib-minimal_abi_src_configure
  13. * econf: updating sandbox-2.13/config.guess with /usr/share/gnuconfig/config.guess
  14. * econf: updating sandbox-2.13/config.sub with /usr/share/gnuconfig/config.sub
  15. /var/tmp/portage/sys-apps/sandbox-2.13/work/sandbox-2.13/configure --prefix=/usr --build=i686-pc-linux-gnu --host=i686-pc-linux-gnu --mandir=/usr/share/man --infodir=/usr/share/info --datadir=/usr/share --sysconfdir=/etc --localstatedir=/var/lib --disable-dependency-tracking --disable-silent-rules --docdir=/usr/share/doc/sandbox-2.13 --htmldir=/usr/share/doc/sandbox-2.13/html --libdir=/usr/lib32
  16. checking for a BSD-compatible install... /usr/lib/portage/python3.6/ebuild-helpers/xattr/install -c
  17. checking whether build environment is sane... yes
  18. checking for a thread-safe mkdir -p... /bin/mkdir -p
  19. checking for gawk... gawk
  20. checking whether make sets $(MAKE)... yes
  21. checking whether make supports nested variables... yes
  22. checking whether make supports nested variables... (cached) yes
  23. checking environment state... ok
  24. checking for i686-pc-linux-gnu-gcc... x86_64-pc-linux-gnu-gcc -m32
  25. checking whether the C compiler works... yes
  26. checking for C compiler default output file name... a.out
  27. checking for suffix of executables...
  28. checking whether we are cross compiling... no
  29. checking for suffix of object files... o
  30. checking whether we are using the GNU C compiler... yes
  31. checking whether x86_64-pc-linux-gnu-gcc -m32 accepts -g... yes
  32. checking for x86_64-pc-linux-gnu-gcc -m32 option to accept ISO C89... none needed
  33. checking whether x86_64-pc-linux-gnu-gcc -m32 understands -c and -o together... yes
  34. checking for style of include used by make... GNU
  35. checking dependency style of x86_64-pc-linux-gnu-gcc -m32... none
  36. checking for library containing strerror... none required
  37. checking how to run the C preprocessor... x86_64-pc-linux-gnu-gcc -m32 -E
  38. checking for grep that handles long lines and -e... /bin/grep
  39. checking for egrep... /bin/grep -E
  40. checking for ANSI C header files... yes
  41. checking for sys/types.h... yes
  42. checking for sys/stat.h... yes
  43. checking for stdlib.h... yes
  44. checking for string.h... yes
  45. checking for memory.h... yes
  46. checking for strings.h... yes
  47. checking for inttypes.h... yes
  48. checking for stdint.h... yes
  49. checking for unistd.h... yes
  50. checking minix/config.h usability... no
  51. checking minix/config.h presence... no
  52. checking for minix/config.h... no
  53. checking whether it is safe to define __EXTENSIONS__... yes
  54. checking for i686-pc-linux-gnu-ar... no
  55. checking for i686-pc-linux-gnu-lib... no
  56. checking for i686-pc-linux-gnu-link... no
  57. checking for ar... ar
  58. checking the archiver (ar) interface... ar
  59. checking whether make sets $(MAKE)... (cached) yes
  60. checking for gawk... (cached) gawk
  61. checking for egrep... (cached) /bin/grep -E
  62. checking for readelf... readelf
  63. checking build system type... i686-pc-linux-gnu
  64. checking host system type... i686-pc-linux-gnu
  65. checking how to print strings... printf
  66. checking for a sed that does not truncate output... /bin/sed
  67. checking for fgrep... /bin/grep -F
  68. checking for ld used by x86_64-pc-linux-gnu-gcc -m32... x86_64-pc-linux-gnu-ld -m elf_i386
  69. checking if the linker (x86_64-pc-linux-gnu-ld -m elf_i386) is GNU ld... yes
  70. checking for BSD- or MS-compatible name lister (nm)... /usr/bin/nm -B
  71. checking the name lister (/usr/bin/nm -B) interface... BSD nm
  72. checking whether ln -s works... yes
  73. checking the maximum length of command line arguments... 1572864
  74. checking how to convert i686-pc-linux-gnu file names to i686-pc-linux-gnu format... func_convert_file_noop
  75. checking how to convert i686-pc-linux-gnu file names to toolchain format... func_convert_file_noop
  76. checking for x86_64-pc-linux-gnu-ld -m elf_i386 option to reload object files... -r
  77. checking for i686-pc-linux-gnu-objdump... no
  78. checking for objdump... objdump
  79. checking how to recognize dependent libraries... pass_all
  80. checking for i686-pc-linux-gnu-dlltool... no
  81. checking for dlltool... no
  82. checking how to associate runtime and link libraries... printf %s\n
  83. checking for i686-pc-linux-gnu-ar... ar
  84. checking for archiver @FILE support... @
  85. checking for i686-pc-linux-gnu-strip... no
  86. checking for strip... strip
  87. checking for i686-pc-linux-gnu-ranlib... no
  88. checking for ranlib... ranlib
  89. checking command to parse /usr/bin/nm -B output from x86_64-pc-linux-gnu-gcc -m32 object... ok
  90. checking for sysroot... no
  91. checking for a working dd... /bin/dd
  92. checking how to truncate binary pipes... /bin/dd bs=4096 count=1
  93. checking for i686-pc-linux-gnu-mt... no
  94. checking for mt... no
  95. checking if : is a manifest tool... no
  96. checking for dlfcn.h... yes
  97. checking for objdir... .libs
  98. checking if x86_64-pc-linux-gnu-gcc -m32 supports -fno-rtti -fno-exceptions... no
  99. checking for x86_64-pc-linux-gnu-gcc -m32 option to produce PIC... -fPIC -DPIC
  100. checking if x86_64-pc-linux-gnu-gcc -m32 PIC flag -fPIC -DPIC works... yes
  101. checking if x86_64-pc-linux-gnu-gcc -m32 static flag -static works... yes
  102. checking if x86_64-pc-linux-gnu-gcc -m32 supports -c -o file.o... yes
  103. checking if x86_64-pc-linux-gnu-gcc -m32 supports -c -o file.o... (cached) yes
  104. checking whether the x86_64-pc-linux-gnu-gcc -m32 linker (x86_64-pc-linux-gnu-ld -m elf_i386) supports shared libraries... yes
  105. checking whether -lc should be explicitly linked in... no
  106. checking dynamic linker characteristics... GNU/Linux ld.so
  107. checking how to hardcode library paths into programs... immediate
  108. checking whether stripping libraries is possible... yes
  109. checking if libtool supports shared libraries... yes
  110. checking whether to build shared libraries... yes
  111. checking whether to build static libraries... no
  112. checking whether to use pre-compiled sandbox headers... yes
  113. checking for multiple personalities... auto
  114. checking checking for x86_64/-m64 compiler support... yes
  115. checking checking for x86/-m32 compiler support... yes
  116. checking checking for x32/-mx32 compiler support... no
  117. checking for size_t... yes
  118. checking for working alloca.h... yes
  119. checking for alloca... yes
  120. checking for dirent.h that defines DIR... yes
  121. checking for library containing opendir... none required
  122. checking for ANSI C header files... (cached) yes
  123. checking for sys/wait.h that is POSIX.1 compatible... yes
  124. checking for dirent.h... yes
  125. checking for dlfcn.h... (cached) yes
  126. checking for elf.h... yes
  127. checking for errno.h... yes
  128. checking for execinfo.h... yes
  129. checking for fcntl.h... yes
  130. checking for getopt.h... yes
  131. checking for grp.h... yes
  132. checking for inttypes.h... (cached) yes
  133. checking for libgen.h... yes
  134. checking for limits.h... yes
  135. checking for memory.h... (cached) yes
  136. checking for pthread.h... yes
  137. checking for pwd.h... yes
  138. checking for sched.h... yes
  139. checking for siginfo.h... no
  140. checking for signal.h... yes
  141. checking for sigsegv.h... (cached) no
  142. checking for stdarg.h... yes
  143. checking for stdbool.h... yes
  144. checking for stddef.h... yes
  145. checking for stdint.h... (cached) yes
  146. checking for stdio.h... yes
  147. checking for stdlib.h... (cached) yes
  148. checking for string.h... (cached) yes
  149. checking for strings.h... (cached) yes
  150. checking for syscall.h... yes
  151. checking for unistd.h... (cached) yes
  152. checking for utime.h... yes
  153. checking for sys/file.h... yes
  154. checking for sys/ioctl.h... yes
  155. checking for sys/mman.h... yes
  156. checking for sys/mount.h... yes
  157. checking for sys/param.h... yes
  158. checking for sys/ptrace.h... yes
  159. checking for sys/reg.h... yes
  160. checking for sys/socket.h... yes
  161. checking for sys/stat.h... (cached) yes
  162. checking for sys/syscall.h... yes
  163. checking for sys/time.h... yes
  164. checking for sys/types.h... (cached) yes
  165. checking for sys/uio.h... yes
  166. checking for sys/user.h... yes
  167. checking for sys/wait.h... (cached) yes
  168. checking for asm/ptrace.h... yes
  169. checking for linux/ptrace.h... yes
  170. checking for an ANSI C-conforming const... yes
  171. checking for uid_t in sys/types.h... yes
  172. checking for mode_t... yes
  173. checking for size_t... (cached) yes
  174. checking whether environ is declared... yes
  175. checking for ptrdiff_t... yes
  176. checking for sighandler_t... yes
  177. checking for sig_t... yes
  178. checking for __sighandler_t... yes
  179. checking for struct user_regs_struct... yes
  180. checking for struct pt_regs... yes
  181. checking size of struct user_regs_struct... 68
  182. checking size of struct pt_regs... 68
  183. checking for unistd.h... (cached) yes
  184. checking for working chown... yes
  185. checking for pid_t... yes
  186. checking vfork.h usability... no
  187. checking vfork.h presence... no
  188. checking for vfork.h... no
  189. checking for fork... yes
  190. checking for vfork... yes
  191. checking for working fork... yes
  192. checking for working vfork... (cached) yes
  193. checking whether lstat correctly handles trailing slash... yes
  194. checking whether lstat accepts an empty string... no
  195. checking whether lstat correctly handles trailing slash... (cached) yes
  196. checking return type of signal handlers... void
  197. checking whether stat accepts an empty string... no
  198. checking for backtrace... yes
  199. checking for clone... yes
  200. checking for __clone2... no
  201. checking for creat64... yes
  202. checking for faccessat... yes
  203. checking for fchmodat... yes
  204. checking for fchownat... yes
  205. checking for fopen64... yes
  206. checking for ftruncate... yes
  207. checking for futimesat... yes
  208. checking for getcwd... yes
  209. checking for lchown... yes
  210. checking for linkat... yes
  211. checking for lutimes... yes
  212. checking for memmove... yes
  213. checking for memcpy... yes
  214. checking for memset... yes
  215. checking for mkdir... yes
  216. checking for mkdirat... yes
  217. checking for mkdtemp... yes
  218. checking for mkfifoat... yes
  219. checking for mknodat... yes
  220. checking for mkostemp... yes
  221. checking for mkostemp64... yes
  222. checking for mkostemps... yes
  223. checking for mkostemps64... yes
  224. checking for mkstemp... yes
  225. checking for mkstemp64... yes
  226. checking for mkstemps... yes
  227. checking for mkstemps64... yes
  228. checking for open64... yes
  229. checking for openat... yes
  230. checking for openat64... yes
  231. checking for pathconf... yes
  232. checking for process_vm_readv... yes
  233. checking for ptrace... yes
  234. checking for realpath... yes
  235. checking for remove... yes
  236. checking for renameat... yes
  237. checking for rmdir... yes
  238. checking for setenv... yes
  239. checking for strcasecmp... yes
  240. checking for strchr... yes
  241. checking for strdup... yes
  242. checking for strerror... yes
  243. checking for strndup... yes
  244. checking for strrchr... yes
  245. checking for strspn... yes
  246. checking for strstr... yes
  247. checking for strtok_r... yes
  248. checking for symlinkat... yes
  249. checking for truncate64... yes
  250. checking for unlinkat... yes
  251. checking for unshare... yes
  252. checking for utime... yes
  253. checking for utimensat... yes
  254. checking for utimes... yes
  255. checking for stackoverflow_install_handler in -lsigsegv... (cached) false
  256. checking for __sync_lock_test_and_set... yes
  257. checking for va_copy... va_copy
  258. checking for library containing dlopen... no
  259. checking for dlvsym... no
  260. checking truncate argument type... off_t
  261. checking for RTLD_NEXT... yes
  262. checking libc path... /lib32/libc.so.6
  263. checking libc version... libc.so.6
  264. checking for /proc/self/fd... yes
  265. checking for /dev/fd... yes
  266. checking for /proc/self/cmdline... yes
  267. checking for /proc/1/cmdline... yes
  268. checking for /proc/122/cmdline... yes
  269. checking how to enable exception handling... -fexceptions
  270. checking CFLAGS for maximum warnings... -Wall
  271. checking whether C compiler accepts -Winvalid-pch... yes
  272. checking whether C compiler accepts -fdata-sections... yes
  273. checking whether C compiler accepts -ffunction-sections... yes
  274. checking whether C compiler accepts -fno-builtin-calloc... yes
  275. checking whether C compiler accepts -fno-builtin-malloc... yes
  276. checking whether C compiler accepts -fno-builtin-realloc... yes
  277. checking whether the linker accepts -Wl,--as-needed... yes
  278. checking whether the linker accepts -Wl,--gc-sections... yes
  279. checking whether the linker accepts -Wl,--no-undefined... yes
  280. checking whether the linker accepts -Wl,--version-script,conftest.map... yes
  281. checking that generated files are newer than configure... done
  282. configure: creating ./config.status
  283. config.status: creating src/sandbox.sh
  284. config.status: creating Makefile
  285. config.status: creating data/Makefile
  286. config.status: creating etc/Makefile
  287. config.status: creating etc/sandbox.d/00default
  288. config.status: creating etc/sandbox.d/Makefile
  289. config.status: creating libsandbox/Makefile
  290. config.status: creating libsbutil/Makefile
  291. config.status: creating scripts/Makefile
  292. config.status: creating src/Makefile
  293. config.status: creating tests/atlocal
  294. config.status: creating tests/Makefile
  295. config.status: creating tests/package.m4
  296. config.status: creating config.h
  297. config.status: executing depfiles commands
  298. config.status: executing libtool commands
  299. config.status: executing tests/atconfig commands
  300. * abi_x86_64.amd64: running multilib-minimal_abi_src_configure
  301. * econf: updating sandbox-2.13/config.guess with /usr/share/gnuconfig/config.guess
  302. * econf: updating sandbox-2.13/config.sub with /usr/share/gnuconfig/config.sub
  303. /var/tmp/portage/sys-apps/sandbox-2.13/work/sandbox-2.13/configure --prefix=/usr --build=x86_64-pc-linux-gnu --host=x86_64-pc-linux-gnu --mandir=/usr/share/man --infodir=/usr/share/info --datadir=/usr/share --sysconfdir=/etc --localstatedir=/var/lib --disable-dependency-tracking --disable-silent-rules --docdir=/usr/share/doc/sandbox-2.13 --htmldir=/usr/share/doc/sandbox-2.13/html --libdir=/usr/lib64
  304. checking for a BSD-compatible install... /usr/lib/portage/python3.6/ebuild-helpers/xattr/install -c
  305. checking whether build environment is sane... yes
  306. checking for a thread-safe mkdir -p... /bin/mkdir -p
  307. checking for gawk... gawk
  308. checking whether make sets $(MAKE)... yes
  309. checking whether make supports nested variables... yes
  310. checking whether make supports nested variables... (cached) yes
  311. checking environment state... ok
  312. checking for x86_64-pc-linux-gnu-gcc... x86_64-pc-linux-gnu-gcc
  313. checking whether the C compiler works... yes
  314. checking for C compiler default output file name... a.out
  315. checking for suffix of executables...
  316. checking whether we are cross compiling... no
  317. checking for suffix of object files... o
  318. checking whether we are using the GNU C compiler... yes
  319. checking whether x86_64-pc-linux-gnu-gcc accepts -g... yes
  320. checking for x86_64-pc-linux-gnu-gcc option to accept ISO C89... none needed
  321. checking whether x86_64-pc-linux-gnu-gcc understands -c and -o together... yes
  322. checking for style of include used by make... GNU
  323. checking dependency style of x86_64-pc-linux-gnu-gcc... none
  324. checking for library containing strerror... none required
  325. checking how to run the C preprocessor... x86_64-pc-linux-gnu-gcc -E
  326. checking for grep that handles long lines and -e... /bin/grep
  327. checking for egrep... /bin/grep -E
  328. checking for ANSI C header files... yes
  329. checking for sys/types.h... yes
  330. checking for sys/stat.h... yes
  331. checking for stdlib.h... yes
  332. checking for string.h... yes
  333. checking for memory.h... yes
  334. checking for strings.h... yes
  335. checking for inttypes.h... yes
  336. checking for stdint.h... yes
  337. checking for unistd.h... yes
  338. checking minix/config.h usability... no
  339. checking minix/config.h presence... no
  340. checking for minix/config.h... no
  341. checking whether it is safe to define __EXTENSIONS__... yes
  342. checking for x86_64-pc-linux-gnu-ar... x86_64-pc-linux-gnu-ar
  343. checking the archiver (x86_64-pc-linux-gnu-ar) interface... ar
  344. checking whether make sets $(MAKE)... (cached) yes
  345. checking for gawk... (cached) gawk
  346. checking for egrep... (cached) /bin/grep -E
  347. checking for readelf... readelf
  348. checking build system type... x86_64-pc-linux-gnu
  349. checking host system type... x86_64-pc-linux-gnu
  350. checking how to print strings... printf
  351. checking for a sed that does not truncate output... /bin/sed
  352. checking for fgrep... /bin/grep -F
  353. checking for ld used by x86_64-pc-linux-gnu-gcc... /usr/x86_64-pc-linux-gnu/bin/ld
  354. checking if the linker (/usr/x86_64-pc-linux-gnu/bin/ld) is GNU ld... yes
  355. checking for BSD- or MS-compatible name lister (nm)... /usr/bin/x86_64-pc-linux-gnu-nm -B
  356. checking the name lister (/usr/bin/x86_64-pc-linux-gnu-nm -B) interface... BSD nm
  357. checking whether ln -s works... yes
  358. checking the maximum length of command line arguments... 1572864
  359. checking how to convert x86_64-pc-linux-gnu file names to x86_64-pc-linux-gnu format... func_convert_file_noop
  360. checking how to convert x86_64-pc-linux-gnu file names to toolchain format... func_convert_file_noop
  361. checking for /usr/x86_64-pc-linux-gnu/bin/ld option to reload object files... -r
  362. checking for x86_64-pc-linux-gnu-objdump... x86_64-pc-linux-gnu-objdump
  363. checking how to recognize dependent libraries... pass_all
  364. checking for x86_64-pc-linux-gnu-dlltool... no
  365. checking for dlltool... no
  366. checking how to associate runtime and link libraries... printf %s\n
  367. checking for x86_64-pc-linux-gnu-ar... (cached) x86_64-pc-linux-gnu-ar
  368. checking for archiver @FILE support... @
  369. checking for x86_64-pc-linux-gnu-strip... x86_64-pc-linux-gnu-strip
  370. checking for x86_64-pc-linux-gnu-ranlib... x86_64-pc-linux-gnu-ranlib
  371. checking command to parse /usr/bin/x86_64-pc-linux-gnu-nm -B output from x86_64-pc-linux-gnu-gcc object... ok
  372. checking for sysroot... no
  373. checking for a working dd... /bin/dd
  374. checking how to truncate binary pipes... /bin/dd bs=4096 count=1
  375. checking for x86_64-pc-linux-gnu-mt... no
  376. checking for mt... no
  377. checking if : is a manifest tool... no
  378. checking for dlfcn.h... yes
  379. checking for objdir... .libs
  380. checking if x86_64-pc-linux-gnu-gcc supports -fno-rtti -fno-exceptions... no
  381. checking for x86_64-pc-linux-gnu-gcc option to produce PIC... -fPIC -DPIC
  382. checking if x86_64-pc-linux-gnu-gcc PIC flag -fPIC -DPIC works... yes
  383. checking if x86_64-pc-linux-gnu-gcc static flag -static works... yes
  384. checking if x86_64-pc-linux-gnu-gcc supports -c -o file.o... yes
  385. checking if x86_64-pc-linux-gnu-gcc supports -c -o file.o... (cached) yes
  386. checking whether the x86_64-pc-linux-gnu-gcc linker (/usr/x86_64-pc-linux-gnu/bin/ld -m elf_x86_64) supports shared libraries... yes
  387. checking whether -lc should be explicitly linked in... no
  388. checking dynamic linker characteristics... GNU/Linux ld.so
  389. checking how to hardcode library paths into programs... immediate
  390. checking whether stripping libraries is possible... yes
  391. checking if libtool supports shared libraries... yes
  392. checking whether to build shared libraries... yes
  393. checking whether to build static libraries... no
  394. checking whether to use pre-compiled sandbox headers... yes
  395. checking for multiple personalities... auto
  396. checking checking for x86_64/-m64 compiler support... yes
  397. checking checking for x86/-m32 compiler support... yes
  398. checking checking for x32/-mx32 compiler support... no
  399. checking for size_t... yes
  400. checking for working alloca.h... yes
  401. checking for alloca... yes
  402. checking for dirent.h that defines DIR... yes
  403. checking for library containing opendir... none required
  404. checking for ANSI C header files... (cached) yes
  405. checking for sys/wait.h that is POSIX.1 compatible... yes
  406. checking for dirent.h... yes
  407. checking for dlfcn.h... (cached) yes
  408. checking for elf.h... yes
  409. checking for errno.h... yes
  410. checking for execinfo.h... yes
  411. checking for fcntl.h... yes
  412. checking for getopt.h... yes
  413. checking for grp.h... yes
  414. checking for inttypes.h... (cached) yes
  415. checking for libgen.h... yes
  416. checking for limits.h... yes
  417. checking for memory.h... (cached) yes
  418. checking for pthread.h... yes
  419. checking for pwd.h... yes
  420. checking for sched.h... yes
  421. checking for siginfo.h... no
  422. checking for signal.h... yes
  423. checking for sigsegv.h... (cached) no
  424. checking for stdarg.h... yes
  425. checking for stdbool.h... yes
  426. checking for stddef.h... yes
  427. checking for stdint.h... (cached) yes
  428. checking for stdio.h... yes
  429. checking for stdlib.h... (cached) yes
  430. checking for string.h... (cached) yes
  431. checking for strings.h... (cached) yes
  432. checking for syscall.h... yes
  433. checking for unistd.h... (cached) yes
  434. checking for utime.h... yes
  435. checking for sys/file.h... yes
  436. checking for sys/ioctl.h... yes
  437. checking for sys/mman.h... yes
  438. checking for sys/mount.h... yes
  439. checking for sys/param.h... yes
  440. checking for sys/ptrace.h... yes
  441. checking for sys/reg.h... yes
  442. checking for sys/socket.h... yes
  443. checking for sys/stat.h... (cached) yes
  444. checking for sys/syscall.h... yes
  445. checking for sys/time.h... yes
  446. checking for sys/types.h... (cached) yes
  447. checking for sys/uio.h... yes
  448. checking for sys/user.h... yes
  449. checking for sys/wait.h... (cached) yes
  450. checking for asm/ptrace.h... yes
  451. checking for linux/ptrace.h... yes
  452. checking for an ANSI C-conforming const... yes
  453. checking for uid_t in sys/types.h... yes
  454. checking for mode_t... yes
  455. checking for size_t... (cached) yes
  456. checking whether environ is declared... yes
  457. checking for ptrdiff_t... yes
  458. checking for sighandler_t... yes
  459. checking for sig_t... yes
  460. checking for __sighandler_t... yes
  461. checking for struct user_regs_struct... yes
  462. checking for struct pt_regs... yes
  463. checking size of struct user_regs_struct... 216
  464. checking size of struct pt_regs... 168
  465. checking for unistd.h... (cached) yes
  466. checking for working chown... yes
  467. checking for pid_t... yes
  468. checking vfork.h usability... no
  469. checking vfork.h presence... no
  470. checking for vfork.h... no
  471. checking for fork... yes
  472. checking for vfork... yes
  473. checking for working fork... yes
  474. checking for working vfork... (cached) yes
  475. checking whether lstat correctly handles trailing slash... yes
  476. checking whether lstat accepts an empty string... no
  477. checking whether lstat correctly handles trailing slash... (cached) yes
  478. checking return type of signal handlers... void
  479. checking whether stat accepts an empty string... no
  480. checking for backtrace... yes
  481. checking for clone... yes
  482. checking for __clone2... no
  483. checking for creat64... yes
  484. checking for faccessat... yes
  485. checking for fchmodat... yes
  486. checking for fchownat... yes
  487. checking for fopen64... yes
  488. checking for ftruncate... yes
  489. checking for futimesat... yes
  490. checking for getcwd... yes
  491. checking for lchown... yes
  492. checking for linkat... yes
  493. checking for lutimes... yes
  494. checking for memmove... yes
  495. checking for memcpy... yes
  496. checking for memset... yes
  497. checking for mkdir... yes
  498. checking for mkdirat... yes
  499. checking for mkdtemp... yes
  500. checking for mkfifoat... yes
  501. checking for mknodat... yes
  502. checking for mkostemp... yes
  503. checking for mkostemp64... yes
  504. checking for mkostemps... yes
  505. checking for mkostemps64... yes
  506. checking for mkstemp... yes
  507. checking for mkstemp64... yes
  508. checking for mkstemps... yes
  509. checking for mkstemps64... yes
  510. checking for open64... yes
  511. checking for openat... yes
  512. checking for openat64... yes
  513. checking for pathconf... yes
  514. checking for process_vm_readv... yes
  515. checking for ptrace... yes
  516. checking for realpath... yes
  517. checking for remove... yes
  518. checking for renameat... yes
  519. checking for rmdir... yes
  520. checking for setenv... yes
  521. checking for strcasecmp... yes
  522. checking for strchr... yes
  523. checking for strdup... yes
  524. checking for strerror... yes
  525. checking for strndup... yes
  526. checking for strrchr... yes
  527. checking for strspn... yes
  528. checking for strstr... yes
  529. checking for strtok_r... yes
  530. checking for symlinkat... yes
  531. checking for truncate64... yes
  532. checking for unlinkat... yes
  533. checking for unshare... yes
  534. checking for utime... yes
  535. checking for utimensat... yes
  536. checking for utimes... yes
  537. checking for stackoverflow_install_handler in -lsigsegv... (cached) false
  538. checking for __sync_lock_test_and_set... yes
  539. checking for va_copy... va_copy
  540. checking for library containing dlopen... -ldl
  541. checking for dlvsym... yes
  542. checking truncate argument type... off_t
  543. checking for RTLD_NEXT... yes
  544. checking libc path... /lib64/libc.so.6
  545. checking libc version... libc.so.6
  546. checking for /proc/self/fd... yes
  547. checking for /dev/fd... yes
  548. checking for /proc/self/cmdline... yes
  549. checking for /proc/1/cmdline... yes
  550. checking for /proc/4361/cmdline... yes
  551. checking how to enable exception handling... -fexceptions
  552. checking CFLAGS for maximum warnings... -Wall
  553. checking whether C compiler accepts -Winvalid-pch... yes
  554. checking whether C compiler accepts -fdata-sections... yes
  555. checking whether C compiler accepts -ffunction-sections... yes
  556. checking whether C compiler accepts -fno-builtin-calloc... yes
  557. checking whether C compiler accepts -fno-builtin-malloc... yes
  558. checking whether C compiler accepts -fno-builtin-realloc... yes
  559. checking whether the linker accepts -Wl,--as-needed... yes
  560. checking whether the linker accepts -Wl,--gc-sections... yes
  561. checking whether the linker accepts -Wl,--no-undefined... yes
  562. checking whether the linker accepts -Wl,--version-script,conftest.map... yes
  563. checking that generated files are newer than configure... done
  564. configure: creating ./config.status
  565. config.status: creating src/sandbox.sh
  566. config.status: creating Makefile
  567. config.status: creating data/Makefile
  568. config.status: creating etc/Makefile
  569. config.status: creating etc/sandbox.d/00default
  570. config.status: creating etc/sandbox.d/Makefile
  571. config.status: creating libsandbox/Makefile
  572. config.status: creating libsbutil/Makefile
  573. config.status: creating scripts/Makefile
  574. config.status: creating src/Makefile
  575. config.status: creating tests/atlocal
  576. config.status: creating tests/Makefile
  577. config.status: creating tests/package.m4
  578. config.status: creating config.h
  579. config.status: executing depfiles commands
  580. config.status: executing libtool commands
  581. config.status: executing tests/atconfig commands
  582. >>> Source configured.
  583. >>> Compiling source in /var/tmp/portage/sys-apps/sandbox-2.13/work/sandbox-2.13 ...
  584. * abi_x86_32.x86: running multilib-minimal_abi_src_compile
  585. make -j2
  586. /bin/sh ./libtool --tag=CC --mode=compile x86_64-pc-linux-gnu-gcc -m32 -DHAVE_CONFIG_H -I. -I/var/tmp/portage/sys-apps/sandbox-2.13/work/sandbox-2.13 -DETCDIR="\"/etc\"" -DLIBSANDBOX_PATH="\"/usr/lib32\"" -DSANDBOX_BASHRC_PATH="\"/usr/share/sandbox\"" -D_REENTRANT -march=native -O2 -pipe -Wall -Winvalid-pch -fdata-sections -ffunction-sections -fno-builtin-calloc -fno-builtin-malloc -fno-builtin-realloc -c -o libsbutil/headers.h.gch.o /var/tmp/portage/sys-apps/sandbox-2.13/work/sandbox-2.13/headers.h && ( src=`dirname libsbutil/headers.h.gch`/.libs/`basename libsbutil/headers.h.gch`.o; test -e "$src" || src=libsbutil/headers.h.gch.o; cp $src libsbutil/headers.h.gch )
  587. /bin/sh ./libtool --tag=CC --mode=compile x86_64-pc-linux-gnu-gcc -m32 -DHAVE_CONFIG_H -I. -I/var/tmp/portage/sys-apps/sandbox-2.13/work/sandbox-2.13 -DETCDIR="\"/etc\"" -DLIBSANDBOX_PATH="\"/usr/lib32\"" -DSANDBOX_BASHRC_PATH="\"/usr/share/sandbox\"" -D_REENTRANT -march=native -O2 -pipe -Wall -Winvalid-pch -fdata-sections -ffunction-sections -fno-builtin-calloc -fno-builtin-malloc -fno-builtin-realloc -c -o libsandbox/headers.h.gch.o /var/tmp/portage/sys-apps/sandbox-2.13/work/sandbox-2.13/headers.h -fexceptions && ( src=`dirname libsandbox/headers.h.gch`/.libs/`basename libsandbox/headers.h.gch`.o; test -e "$src" || src=libsandbox/headers.h.gch.o; cp $src libsandbox/headers.h.gch )
  588. libtool: compile: x86_64-pc-linux-gnu-gcc -m32 -DHAVE_CONFIG_H -I. -I/var/tmp/portage/sys-apps/sandbox-2.13/work/sandbox-2.13 -DETCDIR=\"/etc\" -DLIBSANDBOX_PATH=\"/usr/lib32\" -DSANDBOX_BASHRC_PATH=\"/usr/share/sandbox\" -D_REENTRANT -march=native -O2 -pipe -Wall -Winvalid-pch -fdata-sections -ffunction-sections -fno-builtin-calloc -fno-builtin-malloc -fno-builtin-realloc -c /var/tmp/portage/sys-apps/sandbox-2.13/work/sandbox-2.13/headers.h -fPIC -DPIC -o libsbutil/.libs/headers.h.gch.o
  589. libtool: compile: x86_64-pc-linux-gnu-gcc -m32 -DHAVE_CONFIG_H -I. -I/var/tmp/portage/sys-apps/sandbox-2.13/work/sandbox-2.13 -DETCDIR=\"/etc\" -DLIBSANDBOX_PATH=\"/usr/lib32\" -DSANDBOX_BASHRC_PATH=\"/usr/share/sandbox\" -D_REENTRANT -march=native -O2 -pipe -Wall -Winvalid-pch -fdata-sections -ffunction-sections -fno-builtin-calloc -fno-builtin-malloc -fno-builtin-realloc -c /var/tmp/portage/sys-apps/sandbox-2.13/work/sandbox-2.13/headers.h -fexceptions -fPIC -DPIC -o libsandbox/.libs/headers.h.gch.o
  590. x86_64-pc-linux-gnu-gcc -m32 -DHAVE_CONFIG_H -I. -I/var/tmp/portage/sys-apps/sandbox-2.13/work/sandbox-2.13 -DETCDIR="\"/etc\"" -DLIBSANDBOX_PATH="\"/usr/lib32\"" -DSANDBOX_BASHRC_PATH="\"/usr/share/sandbox\"" -D_REENTRANT -march=native -O2 -pipe -Wall -Winvalid-pch -fdata-sections -ffunction-sections -fno-builtin-calloc -fno-builtin-malloc -fno-builtin-realloc -c -o headers.h.gch.o /var/tmp/portage/sys-apps/sandbox-2.13/work/sandbox-2.13/headers.h && ( src=`dirname headers.h.gch`/.libs/`basename headers.h.gch`.o; test -e "$src" || src=headers.h.gch.o; cp $src headers.h.gch )
  591. make all-recursive
  592. Making all in scripts
  593. make[2]: Nothing to be done for 'all'.
  594. Making all in etc
  595. Making all in sandbox.d
  596. make[3]: Nothing to be done for 'all'.
  597. make[3]: Nothing to be done for 'all-am'.
  598. Making all in data
  599. make[2]: Nothing to be done for 'all'.
  600. Making all in libsbutil
  601. /bin/sh ../libtool --tag=CC --mode=compile x86_64-pc-linux-gnu-gcc -m32 -DHAVE_CONFIG_H -I. -I/var/tmp/portage/sys-apps/sandbox-2.13/work/sandbox-2.13/libsbutil -I.. -I/var/tmp/portage/sys-apps/sandbox-2.13/work/sandbox-2.13 -I/var/tmp/portage/sys-apps/sandbox-2.13/work/sandbox-2.13/libsbutil/include -DETCDIR="\"/etc\"" -DLIBSANDBOX_PATH="\"/usr/lib32\"" -DSANDBOX_BASHRC_PATH="\"/usr/share/sandbox\"" -D_REENTRANT -march=native -O2 -pipe -Wall -Winvalid-pch -fdata-sections -ffunction-sections -fno-builtin-calloc -fno-builtin-malloc -fno-builtin-realloc -c -o get_sandbox_conf.lo /var/tmp/portage/sys-apps/sandbox-2.13/work/sandbox-2.13/libsbutil/get_sandbox_conf.c
  602. /bin/sh ../libtool --tag=CC --mode=compile x86_64-pc-linux-gnu-gcc -m32 -DHAVE_CONFIG_H -I. -I/var/tmp/portage/sys-apps/sandbox-2.13/work/sandbox-2.13/libsbutil -I.. -I/var/tmp/portage/sys-apps/sandbox-2.13/work/sandbox-2.13 -I/var/tmp/portage/sys-apps/sandbox-2.13/work/sandbox-2.13/libsbutil/include -DETCDIR="\"/etc\"" -DLIBSANDBOX_PATH="\"/usr/lib32\"" -DSANDBOX_BASHRC_PATH="\"/usr/share/sandbox\"" -D_REENTRANT -march=native -O2 -pipe -Wall -Winvalid-pch -fdata-sections -ffunction-sections -fno-builtin-calloc -fno-builtin-malloc -fno-builtin-realloc -c -o get_sandbox_confd.lo /var/tmp/portage/sys-apps/sandbox-2.13/work/sandbox-2.13/libsbutil/get_sandbox_confd.c
  603. libtool: compile: x86_64-pc-linux-gnu-gcc -m32 -DHAVE_CONFIG_H -I. -I/var/tmp/portage/sys-apps/sandbox-2.13/work/sandbox-2.13/libsbutil -I.. -I/var/tmp/portage/sys-apps/sandbox-2.13/work/sandbox-2.13 -I/var/tmp/portage/sys-apps/sandbox-2.13/work/sandbox-2.13/libsbutil/include -DETCDIR=\"/etc\" -DLIBSANDBOX_PATH=\"/usr/lib32\" -DSANDBOX_BASHRC_PATH=\"/usr/share/sandbox\" -D_REENTRANT -march=native -O2 -pipe -Wall -Winvalid-pch -fdata-sections -ffunction-sections -fno-builtin-calloc -fno-builtin-malloc -fno-builtin-realloc -c /var/tmp/portage/sys-apps/sandbox-2.13/work/sandbox-2.13/libsbutil/get_sandbox_conf.c -fPIC -DPIC -o .libs/get_sandbox_conf.o
  604. libtool: compile: x86_64-pc-linux-gnu-gcc -m32 -DHAVE_CONFIG_H -I. -I/var/tmp/portage/sys-apps/sandbox-2.13/work/sandbox-2.13/libsbutil -I.. -I/var/tmp/portage/sys-apps/sandbox-2.13/work/sandbox-2.13 -I/var/tmp/portage/sys-apps/sandbox-2.13/work/sandbox-2.13/libsbutil/include -DETCDIR=\"/etc\" -DLIBSANDBOX_PATH=\"/usr/lib32\" -DSANDBOX_BASHRC_PATH=\"/usr/share/sandbox\" -D_REENTRANT -march=native -O2 -pipe -Wall -Winvalid-pch -fdata-sections -ffunction-sections -fno-builtin-calloc -fno-builtin-malloc -fno-builtin-realloc -c /var/tmp/portage/sys-apps/sandbox-2.13/work/sandbox-2.13/libsbutil/get_sandbox_confd.c -fPIC -DPIC -o .libs/get_sandbox_confd.o
  605. /bin/sh ../libtool --tag=CC --mode=compile x86_64-pc-linux-gnu-gcc -m32 -DHAVE_CONFIG_H -I. -I/var/tmp/portage/sys-apps/sandbox-2.13/work/sandbox-2.13/libsbutil -I.. -I/var/tmp/portage/sys-apps/sandbox-2.13/work/sandbox-2.13 -I/var/tmp/portage/sys-apps/sandbox-2.13/work/sandbox-2.13/libsbutil/include -DETCDIR="\"/etc\"" -DLIBSANDBOX_PATH="\"/usr/lib32\"" -DSANDBOX_BASHRC_PATH="\"/usr/share/sandbox\"" -D_REENTRANT -march=native -O2 -pipe -Wall -Winvalid-pch -fdata-sections -ffunction-sections -fno-builtin-calloc -fno-builtin-malloc -fno-builtin-realloc -c -o get_sandbox_lib.lo /var/tmp/portage/sys-apps/sandbox-2.13/work/sandbox-2.13/libsbutil/get_sandbox_lib.c
  606. /bin/sh ../libtool --tag=CC --mode=compile x86_64-pc-linux-gnu-gcc -m32 -DHAVE_CONFIG_H -I. -I/var/tmp/portage/sys-apps/sandbox-2.13/work/sandbox-2.13/libsbutil -I.. -I/var/tmp/portage/sys-apps/sandbox-2.13/work/sandbox-2.13 -I/var/tmp/portage/sys-apps/sandbox-2.13/work/sandbox-2.13/libsbutil/include -DETCDIR="\"/etc\"" -DLIBSANDBOX_PATH="\"/usr/lib32\"" -DSANDBOX_BASHRC_PATH="\"/usr/share/sandbox\"" -D_REENTRANT -march=native -O2 -pipe -Wall -Winvalid-pch -fdata-sections -ffunction-sections -fno-builtin-calloc -fno-builtin-malloc -fno-builtin-realloc -c -o get_sandbox_rc.lo /var/tmp/portage/sys-apps/sandbox-2.13/work/sandbox-2.13/libsbutil/get_sandbox_rc.c
  607. libtool: compile: x86_64-pc-linux-gnu-gcc -m32 -DHAVE_CONFIG_H -I. -I/var/tmp/portage/sys-apps/sandbox-2.13/work/sandbox-2.13/libsbutil -I.. -I/var/tmp/portage/sys-apps/sandbox-2.13/work/sandbox-2.13 -I/var/tmp/portage/sys-apps/sandbox-2.13/work/sandbox-2.13/libsbutil/include -DETCDIR=\"/etc\" -DLIBSANDBOX_PATH=\"/usr/lib32\" -DSANDBOX_BASHRC_PATH=\"/usr/share/sandbox\" -D_REENTRANT -march=native -O2 -pipe -Wall -Winvalid-pch -fdata-sections -ffunction-sections -fno-builtin-calloc -fno-builtin-malloc -fno-builtin-realloc -c /var/tmp/portage/sys-apps/sandbox-2.13/work/sandbox-2.13/libsbutil/get_sandbox_rc.c -fPIC -DPIC -o .libs/get_sandbox_rc.o
  608. libtool: compile: x86_64-pc-linux-gnu-gcc -m32 -DHAVE_CONFIG_H -I. -I/var/tmp/portage/sys-apps/sandbox-2.13/work/sandbox-2.13/libsbutil -I.. -I/var/tmp/portage/sys-apps/sandbox-2.13/work/sandbox-2.13 -I/var/tmp/portage/sys-apps/sandbox-2.13/work/sandbox-2.13/libsbutil/include -DETCDIR=\"/etc\" -DLIBSANDBOX_PATH=\"/usr/lib32\" -DSANDBOX_BASHRC_PATH=\"/usr/share/sandbox\" -D_REENTRANT -march=native -O2 -pipe -Wall -Winvalid-pch -fdata-sections -ffunction-sections -fno-builtin-calloc -fno-builtin-malloc -fno-builtin-realloc -c /var/tmp/portage/sys-apps/sandbox-2.13/work/sandbox-2.13/libsbutil/get_sandbox_lib.c -fPIC -DPIC -o .libs/get_sandbox_lib.o
  609. /bin/sh ../libtool --tag=CC --mode=compile x86_64-pc-linux-gnu-gcc -m32 -DHAVE_CONFIG_H -I. -I/var/tmp/portage/sys-apps/sandbox-2.13/work/sandbox-2.13/libsbutil -I.. -I/var/tmp/portage/sys-apps/sandbox-2.13/work/sandbox-2.13 -I/var/tmp/portage/sys-apps/sandbox-2.13/work/sandbox-2.13/libsbutil/include -DETCDIR="\"/etc\"" -DLIBSANDBOX_PATH="\"/usr/lib32\"" -DSANDBOX_BASHRC_PATH="\"/usr/share/sandbox\"" -D_REENTRANT -march=native -O2 -pipe -Wall -Winvalid-pch -fdata-sections -ffunction-sections -fno-builtin-calloc -fno-builtin-malloc -fno-builtin-realloc -c -o get_sandbox_log.lo /var/tmp/portage/sys-apps/sandbox-2.13/work/sandbox-2.13/libsbutil/get_sandbox_log.c
  610. /bin/sh ../libtool --tag=CC --mode=compile x86_64-pc-linux-gnu-gcc -m32 -DHAVE_CONFIG_H -I. -I/var/tmp/portage/sys-apps/sandbox-2.13/work/sandbox-2.13/libsbutil -I.. -I/var/tmp/portage/sys-apps/sandbox-2.13/work/sandbox-2.13 -I/var/tmp/portage/sys-apps/sandbox-2.13/work/sandbox-2.13/libsbutil/include -DETCDIR="\"/etc\"" -DLIBSANDBOX_PATH="\"/usr/lib32\"" -DSANDBOX_BASHRC_PATH="\"/usr/share/sandbox\"" -D_REENTRANT -march=native -O2 -pipe -Wall -Winvalid-pch -fdata-sections -ffunction-sections -fno-builtin-calloc -fno-builtin-malloc -fno-builtin-realloc -c -o get_tmp_dir.lo /var/tmp/portage/sys-apps/sandbox-2.13/work/sandbox-2.13/libsbutil/get_tmp_dir.c
  611. libtool: compile: x86_64-pc-linux-gnu-gcc -m32 -DHAVE_CONFIG_H -I. -I/var/tmp/portage/sys-apps/sandbox-2.13/work/sandbox-2.13/libsbutil -I.. -I/var/tmp/portage/sys-apps/sandbox-2.13/work/sandbox-2.13 -I/var/tmp/portage/sys-apps/sandbox-2.13/work/sandbox-2.13/libsbutil/include -DETCDIR=\"/etc\" -DLIBSANDBOX_PATH=\"/usr/lib32\" -DSANDBOX_BASHRC_PATH=\"/usr/share/sandbox\" -D_REENTRANT -march=native -O2 -pipe -Wall -Winvalid-pch -fdata-sections -ffunction-sections -fno-builtin-calloc -fno-builtin-malloc -fno-builtin-realloc -c /var/tmp/portage/sys-apps/sandbox-2.13/work/sandbox-2.13/libsbutil/get_sandbox_log.c -fPIC -DPIC -o .libs/get_sandbox_log.o
  612. libtool: compile: x86_64-pc-linux-gnu-gcc -m32 -DHAVE_CONFIG_H -I. -I/var/tmp/portage/sys-apps/sandbox-2.13/work/sandbox-2.13/libsbutil -I.. -I/var/tmp/portage/sys-apps/sandbox-2.13/work/sandbox-2.13 -I/var/tmp/portage/sys-apps/sandbox-2.13/work/sandbox-2.13/libsbutil/include -DETCDIR=\"/etc\" -DLIBSANDBOX_PATH=\"/usr/lib32\" -DSANDBOX_BASHRC_PATH=\"/usr/share/sandbox\" -D_REENTRANT -march=native -O2 -pipe -Wall -Winvalid-pch -fdata-sections -ffunction-sections -fno-builtin-calloc -fno-builtin-malloc -fno-builtin-realloc -c /var/tmp/portage/sys-apps/sandbox-2.13/work/sandbox-2.13/libsbutil/get_tmp_dir.c -fPIC -DPIC -o .libs/get_tmp_dir.o
  613. /bin/sh ../libtool --tag=CC --mode=compile x86_64-pc-linux-gnu-gcc -m32 -DHAVE_CONFIG_H -I. -I/var/tmp/portage/sys-apps/sandbox-2.13/work/sandbox-2.13/libsbutil -I.. -I/var/tmp/portage/sys-apps/sandbox-2.13/work/sandbox-2.13 -I/var/tmp/portage/sys-apps/sandbox-2.13/work/sandbox-2.13/libsbutil/include -DETCDIR="\"/etc\"" -DLIBSANDBOX_PATH="\"/usr/lib32\"" -DSANDBOX_BASHRC_PATH="\"/usr/share/sandbox\"" -D_REENTRANT -march=native -O2 -pipe -Wall -Winvalid-pch -fdata-sections -ffunction-sections -fno-builtin-calloc -fno-builtin-malloc -fno-builtin-realloc -c -o environment.lo /var/tmp/portage/sys-apps/sandbox-2.13/work/sandbox-2.13/libsbutil/environment.c
  614. /bin/sh ../libtool --tag=CC --mode=compile x86_64-pc-linux-gnu-gcc -m32 -DHAVE_CONFIG_H -I. -I/var/tmp/portage/sys-apps/sandbox-2.13/work/sandbox-2.13/libsbutil -I.. -I/var/tmp/portage/sys-apps/sandbox-2.13/work/sandbox-2.13 -I/var/tmp/portage/sys-apps/sandbox-2.13/work/sandbox-2.13/libsbutil/include -DETCDIR="\"/etc\"" -DLIBSANDBOX_PATH="\"/usr/lib32\"" -DSANDBOX_BASHRC_PATH="\"/usr/share/sandbox\"" -D_REENTRANT -march=native -O2 -pipe -Wall -Winvalid-pch -fdata-sections -ffunction-sections -fno-builtin-calloc -fno-builtin-malloc -fno-builtin-realloc -c -o sb_backtrace.lo /var/tmp/portage/sys-apps/sandbox-2.13/work/sandbox-2.13/libsbutil/sb_backtrace.c
  615. libtool: compile: x86_64-pc-linux-gnu-gcc -m32 -DHAVE_CONFIG_H -I. -I/var/tmp/portage/sys-apps/sandbox-2.13/work/sandbox-2.13/libsbutil -I.. -I/var/tmp/portage/sys-apps/sandbox-2.13/work/sandbox-2.13 -I/var/tmp/portage/sys-apps/sandbox-2.13/work/sandbox-2.13/libsbutil/include -DETCDIR=\"/etc\" -DLIBSANDBOX_PATH=\"/usr/lib32\" -DSANDBOX_BASHRC_PATH=\"/usr/share/sandbox\" -D_REENTRANT -march=native -O2 -pipe -Wall -Winvalid-pch -fdata-sections -ffunction-sections -fno-builtin-calloc -fno-builtin-malloc -fno-builtin-realloc -c /var/tmp/portage/sys-apps/sandbox-2.13/work/sandbox-2.13/libsbutil/environment.c -fPIC -DPIC -o .libs/environment.o
  616. libtool: compile: x86_64-pc-linux-gnu-gcc -m32 -DHAVE_CONFIG_H -I. -I/var/tmp/portage/sys-apps/sandbox-2.13/work/sandbox-2.13/libsbutil -I.. -I/var/tmp/portage/sys-apps/sandbox-2.13/work/sandbox-2.13 -I/var/tmp/portage/sys-apps/sandbox-2.13/work/sandbox-2.13/libsbutil/include -DETCDIR=\"/etc\" -DLIBSANDBOX_PATH=\"/usr/lib32\" -DSANDBOX_BASHRC_PATH=\"/usr/share/sandbox\" -D_REENTRANT -march=native -O2 -pipe -Wall -Winvalid-pch -fdata-sections -ffunction-sections -fno-builtin-calloc -fno-builtin-malloc -fno-builtin-realloc -c /var/tmp/portage/sys-apps/sandbox-2.13/work/sandbox-2.13/libsbutil/sb_backtrace.c -fPIC -DPIC -o .libs/sb_backtrace.o
  617. /bin/sh ../libtool --tag=CC --mode=compile x86_64-pc-linux-gnu-gcc -m32 -DHAVE_CONFIG_H -I. -I/var/tmp/portage/sys-apps/sandbox-2.13/work/sandbox-2.13/libsbutil -I.. -I/var/tmp/portage/sys-apps/sandbox-2.13/work/sandbox-2.13 -I/var/tmp/portage/sys-apps/sandbox-2.13/work/sandbox-2.13/libsbutil/include -DETCDIR="\"/etc\"" -DLIBSANDBOX_PATH="\"/usr/lib32\"" -DSANDBOX_BASHRC_PATH="\"/usr/share/sandbox\"" -D_REENTRANT -march=native -O2 -pipe -Wall -Winvalid-pch -fdata-sections -ffunction-sections -fno-builtin-calloc -fno-builtin-malloc -fno-builtin-realloc -c -o sb_efuncs.lo /var/tmp/portage/sys-apps/sandbox-2.13/work/sandbox-2.13/libsbutil/sb_efuncs.c
  618. /bin/sh ../libtool --tag=CC --mode=compile x86_64-pc-linux-gnu-gcc -m32 -DHAVE_CONFIG_H -I. -I/var/tmp/portage/sys-apps/sandbox-2.13/work/sandbox-2.13/libsbutil -I.. -I/var/tmp/portage/sys-apps/sandbox-2.13/work/sandbox-2.13 -I/var/tmp/portage/sys-apps/sandbox-2.13/work/sandbox-2.13/libsbutil/include -DETCDIR="\"/etc\"" -DLIBSANDBOX_PATH="\"/usr/lib32\"" -DSANDBOX_BASHRC_PATH="\"/usr/share/sandbox\"" -D_REENTRANT -march=native -O2 -pipe -Wall -Winvalid-pch -fdata-sections -ffunction-sections -fno-builtin-calloc -fno-builtin-malloc -fno-builtin-realloc -c -o sb_gdb.lo /var/tmp/portage/sys-apps/sandbox-2.13/work/sandbox-2.13/libsbutil/sb_gdb.c
  619. libtool: compile: x86_64-pc-linux-gnu-gcc -m32 -DHAVE_CONFIG_H -I. -I/var/tmp/portage/sys-apps/sandbox-2.13/work/sandbox-2.13/libsbutil -I.. -I/var/tmp/portage/sys-apps/sandbox-2.13/work/sandbox-2.13 -I/var/tmp/portage/sys-apps/sandbox-2.13/work/sandbox-2.13/libsbutil/include -DETCDIR=\"/etc\" -DLIBSANDBOX_PATH=\"/usr/lib32\" -DSANDBOX_BASHRC_PATH=\"/usr/share/sandbox\" -D_REENTRANT -march=native -O2 -pipe -Wall -Winvalid-pch -fdata-sections -ffunction-sections -fno-builtin-calloc -fno-builtin-malloc -fno-builtin-realloc -c /var/tmp/portage/sys-apps/sandbox-2.13/work/sandbox-2.13/libsbutil/sb_efuncs.c -fPIC -DPIC -o .libs/sb_efuncs.o
  620. libtool: compile: x86_64-pc-linux-gnu-gcc -m32 -DHAVE_CONFIG_H -I. -I/var/tmp/portage/sys-apps/sandbox-2.13/work/sandbox-2.13/libsbutil -I.. -I/var/tmp/portage/sys-apps/sandbox-2.13/work/sandbox-2.13 -I/var/tmp/portage/sys-apps/sandbox-2.13/work/sandbox-2.13/libsbutil/include -DETCDIR=\"/etc\" -DLIBSANDBOX_PATH=\"/usr/lib32\" -DSANDBOX_BASHRC_PATH=\"/usr/share/sandbox\" -D_REENTRANT -march=native -O2 -pipe -Wall -Winvalid-pch -fdata-sections -ffunction-sections -fno-builtin-calloc -fno-builtin-malloc -fno-builtin-realloc -c /var/tmp/portage/sys-apps/sandbox-2.13/work/sandbox-2.13/libsbutil/sb_gdb.c -fPIC -DPIC -o .libs/sb_gdb.o
  621. /bin/sh ../libtool --tag=CC --mode=compile x86_64-pc-linux-gnu-gcc -m32 -DHAVE_CONFIG_H -I. -I/var/tmp/portage/sys-apps/sandbox-2.13/work/sandbox-2.13/libsbutil -I.. -I/var/tmp/portage/sys-apps/sandbox-2.13/work/sandbox-2.13 -I/var/tmp/portage/sys-apps/sandbox-2.13/work/sandbox-2.13/libsbutil/include -DETCDIR="\"/etc\"" -DLIBSANDBOX_PATH="\"/usr/lib32\"" -DSANDBOX_BASHRC_PATH="\"/usr/share/sandbox\"" -D_REENTRANT -march=native -O2 -pipe -Wall -Winvalid-pch -fdata-sections -ffunction-sections -fno-builtin-calloc -fno-builtin-malloc -fno-builtin-realloc -c -o sb_open.lo /var/tmp/portage/sys-apps/sandbox-2.13/work/sandbox-2.13/libsbutil/sb_open.c
  622. /bin/sh ../libtool --tag=CC --mode=compile x86_64-pc-linux-gnu-gcc -m32 -DHAVE_CONFIG_H -I. -I/var/tmp/portage/sys-apps/sandbox-2.13/work/sandbox-2.13/libsbutil -I.. -I/var/tmp/portage/sys-apps/sandbox-2.13/work/sandbox-2.13 -I/var/tmp/portage/sys-apps/sandbox-2.13/work/sandbox-2.13/libsbutil/include -DETCDIR="\"/etc\"" -DLIBSANDBOX_PATH="\"/usr/lib32\"" -DSANDBOX_BASHRC_PATH="\"/usr/share/sandbox\"" -D_REENTRANT -march=native -O2 -pipe -Wall -Winvalid-pch -fdata-sections -ffunction-sections -fno-builtin-calloc -fno-builtin-malloc -fno-builtin-realloc -c -o sb_read.lo /var/tmp/portage/sys-apps/sandbox-2.13/work/sandbox-2.13/libsbutil/sb_read.c
  623. libtool: compile: x86_64-pc-linux-gnu-gcc -m32 -DHAVE_CONFIG_H -I. -I/var/tmp/portage/sys-apps/sandbox-2.13/work/sandbox-2.13/libsbutil -I.. -I/var/tmp/portage/sys-apps/sandbox-2.13/work/sandbox-2.13 -I/var/tmp/portage/sys-apps/sandbox-2.13/work/sandbox-2.13/libsbutil/include -DETCDIR=\"/etc\" -DLIBSANDBOX_PATH=\"/usr/lib32\" -DSANDBOX_BASHRC_PATH=\"/usr/share/sandbox\" -D_REENTRANT -march=native -O2 -pipe -Wall -Winvalid-pch -fdata-sections -ffunction-sections -fno-builtin-calloc -fno-builtin-malloc -fno-builtin-realloc -c /var/tmp/portage/sys-apps/sandbox-2.13/work/sandbox-2.13/libsbutil/sb_open.c -fPIC -DPIC -o .libs/sb_open.o
  624. libtool: compile: x86_64-pc-linux-gnu-gcc -m32 -DHAVE_CONFIG_H -I. -I/var/tmp/portage/sys-apps/sandbox-2.13/work/sandbox-2.13/libsbutil -I.. -I/var/tmp/portage/sys-apps/sandbox-2.13/work/sandbox-2.13 -I/var/tmp/portage/sys-apps/sandbox-2.13/work/sandbox-2.13/libsbutil/include -DETCDIR=\"/etc\" -DLIBSANDBOX_PATH=\"/usr/lib32\" -DSANDBOX_BASHRC_PATH=\"/usr/share/sandbox\" -D_REENTRANT -march=native -O2 -pipe -Wall -Winvalid-pch -fdata-sections -ffunction-sections -fno-builtin-calloc -fno-builtin-malloc -fno-builtin-realloc -c /var/tmp/portage/sys-apps/sandbox-2.13/work/sandbox-2.13/libsbutil/sb_read.c -fPIC -DPIC -o .libs/sb_read.o
  625. /bin/sh ../libtool --tag=CC --mode=compile x86_64-pc-linux-gnu-gcc -m32 -DHAVE_CONFIG_H -I. -I/var/tmp/portage/sys-apps/sandbox-2.13/work/sandbox-2.13/libsbutil -I.. -I/var/tmp/portage/sys-apps/sandbox-2.13/work/sandbox-2.13 -I/var/tmp/portage/sys-apps/sandbox-2.13/work/sandbox-2.13/libsbutil/include -DETCDIR="\"/etc\"" -DLIBSANDBOX_PATH="\"/usr/lib32\"" -DSANDBOX_BASHRC_PATH="\"/usr/share/sandbox\"" -D_REENTRANT -march=native -O2 -pipe -Wall -Winvalid-pch -fdata-sections -ffunction-sections -fno-builtin-calloc -fno-builtin-malloc -fno-builtin-realloc -c -o sb_write.lo /var/tmp/portage/sys-apps/sandbox-2.13/work/sandbox-2.13/libsbutil/sb_write.c
  626. /bin/sh ../libtool --tag=CC --mode=compile x86_64-pc-linux-gnu-gcc -m32 -DHAVE_CONFIG_H -I. -I/var/tmp/portage/sys-apps/sandbox-2.13/work/sandbox-2.13/libsbutil -I.. -I/var/tmp/portage/sys-apps/sandbox-2.13/work/sandbox-2.13 -I/var/tmp/portage/sys-apps/sandbox-2.13/work/sandbox-2.13/libsbutil/include -DETCDIR="\"/etc\"" -DLIBSANDBOX_PATH="\"/usr/lib32\"" -DSANDBOX_BASHRC_PATH="\"/usr/share/sandbox\"" -D_REENTRANT -march=native -O2 -pipe -Wall -Winvalid-pch -fdata-sections -ffunction-sections -fno-builtin-calloc -fno-builtin-malloc -fno-builtin-realloc -c -o sb_write_fd.lo /var/tmp/portage/sys-apps/sandbox-2.13/work/sandbox-2.13/libsbutil/sb_write_fd.c
  627. libtool: compile: x86_64-pc-linux-gnu-gcc -m32 -DHAVE_CONFIG_H -I. -I/var/tmp/portage/sys-apps/sandbox-2.13/work/sandbox-2.13/libsbutil -I.. -I/var/tmp/portage/sys-apps/sandbox-2.13/work/sandbox-2.13 -I/var/tmp/portage/sys-apps/sandbox-2.13/work/sandbox-2.13/libsbutil/include -DETCDIR=\"/etc\" -DLIBSANDBOX_PATH=\"/usr/lib32\" -DSANDBOX_BASHRC_PATH=\"/usr/share/sandbox\" -D_REENTRANT -march=native -O2 -pipe -Wall -Winvalid-pch -fdata-sections -ffunction-sections -fno-builtin-calloc -fno-builtin-malloc -fno-builtin-realloc -c /var/tmp/portage/sys-apps/sandbox-2.13/work/sandbox-2.13/libsbutil/sb_write.c -fPIC -DPIC -o .libs/sb_write.o
  628. libtool: compile: x86_64-pc-linux-gnu-gcc -m32 -DHAVE_CONFIG_H -I. -I/var/tmp/portage/sys-apps/sandbox-2.13/work/sandbox-2.13/libsbutil -I.. -I/var/tmp/portage/sys-apps/sandbox-2.13/work/sandbox-2.13 -I/var/tmp/portage/sys-apps/sandbox-2.13/work/sandbox-2.13/libsbutil/include -DETCDIR=\"/etc\" -DLIBSANDBOX_PATH=\"/usr/lib32\" -DSANDBOX_BASHRC_PATH=\"/usr/share/sandbox\" -D_REENTRANT -march=native -O2 -pipe -Wall -Winvalid-pch -fdata-sections -ffunction-sections -fno-builtin-calloc -fno-builtin-malloc -fno-builtin-realloc -c /var/tmp/portage/sys-apps/sandbox-2.13/work/sandbox-2.13/libsbutil/sb_write_fd.c -fPIC -DPIC -o .libs/sb_write_fd.o
  629. /bin/sh ../libtool --tag=CC --mode=compile x86_64-pc-linux-gnu-gcc -m32 -DHAVE_CONFIG_H -I. -I/var/tmp/portage/sys-apps/sandbox-2.13/work/sandbox-2.13/libsbutil -I.. -I/var/tmp/portage/sys-apps/sandbox-2.13/work/sandbox-2.13 -I/var/tmp/portage/sys-apps/sandbox-2.13/work/sandbox-2.13/libsbutil/include -DETCDIR="\"/etc\"" -DLIBSANDBOX_PATH="\"/usr/lib32\"" -DSANDBOX_BASHRC_PATH="\"/usr/share/sandbox\"" -D_REENTRANT -march=native -O2 -pipe -Wall -Winvalid-pch -fdata-sections -ffunction-sections -fno-builtin-calloc -fno-builtin-malloc -fno-builtin-realloc -c -o sb_close.lo /var/tmp/portage/sys-apps/sandbox-2.13/work/sandbox-2.13/libsbutil/sb_close.c
  630. /bin/sh ../libtool --tag=CC --mode=compile x86_64-pc-linux-gnu-gcc -m32 -DHAVE_CONFIG_H -I. -I/var/tmp/portage/sys-apps/sandbox-2.13/work/sandbox-2.13/libsbutil -I.. -I/var/tmp/portage/sys-apps/sandbox-2.13/work/sandbox-2.13 -I/var/tmp/portage/sys-apps/sandbox-2.13/work/sandbox-2.13/libsbutil/include -DETCDIR="\"/etc\"" -DLIBSANDBOX_PATH="\"/usr/lib32\"" -DSANDBOX_BASHRC_PATH="\"/usr/share/sandbox\"" -D_REENTRANT -march=native -O2 -pipe -Wall -Winvalid-pch -fdata-sections -ffunction-sections -fno-builtin-calloc -fno-builtin-malloc -fno-builtin-realloc -c -o sb_printf.lo /var/tmp/portage/sys-apps/sandbox-2.13/work/sandbox-2.13/libsbutil/sb_printf.c
  631. libtool: compile: x86_64-pc-linux-gnu-gcc -m32 -DHAVE_CONFIG_H -I. -I/var/tmp/portage/sys-apps/sandbox-2.13/work/sandbox-2.13/libsbutil -I.. -I/var/tmp/portage/sys-apps/sandbox-2.13/work/sandbox-2.13 -I/var/tmp/portage/sys-apps/sandbox-2.13/work/sandbox-2.13/libsbutil/include -DETCDIR=\"/etc\" -DLIBSANDBOX_PATH=\"/usr/lib32\" -DSANDBOX_BASHRC_PATH=\"/usr/share/sandbox\" -D_REENTRANT -march=native -O2 -pipe -Wall -Winvalid-pch -fdata-sections -ffunction-sections -fno-builtin-calloc -fno-builtin-malloc -fno-builtin-realloc -c /var/tmp/portage/sys-apps/sandbox-2.13/work/sandbox-2.13/libsbutil/sb_close.c -fPIC -DPIC -o .libs/sb_close.o
  632. libtool: compile: x86_64-pc-linux-gnu-gcc -m32 -DHAVE_CONFIG_H -I. -I/var/tmp/portage/sys-apps/sandbox-2.13/work/sandbox-2.13/libsbutil -I.. -I/var/tmp/portage/sys-apps/sandbox-2.13/work/sandbox-2.13 -I/var/tmp/portage/sys-apps/sandbox-2.13/work/sandbox-2.13/libsbutil/include -DETCDIR=\"/etc\" -DLIBSANDBOX_PATH=\"/usr/lib32\" -DSANDBOX_BASHRC_PATH=\"/usr/share/sandbox\" -D_REENTRANT -march=native -O2 -pipe -Wall -Winvalid-pch -fdata-sections -ffunction-sections -fno-builtin-calloc -fno-builtin-malloc -fno-builtin-realloc -c /var/tmp/portage/sys-apps/sandbox-2.13/work/sandbox-2.13/libsbutil/sb_printf.c -fPIC -DPIC -o .libs/sb_printf.o
  633. /bin/sh ../libtool --tag=CC --mode=compile x86_64-pc-linux-gnu-gcc -m32 -DHAVE_CONFIG_H -I. -I/var/tmp/portage/sys-apps/sandbox-2.13/work/sandbox-2.13/libsbutil -I.. -I/var/tmp/portage/sys-apps/sandbox-2.13/work/sandbox-2.13 -I/var/tmp/portage/sys-apps/sandbox-2.13/work/sandbox-2.13/libsbutil/include -DETCDIR="\"/etc\"" -DLIBSANDBOX_PATH="\"/usr/lib32\"" -DSANDBOX_BASHRC_PATH="\"/usr/share/sandbox\"" -D_REENTRANT -march=native -O2 -pipe -Wall -Winvalid-pch -fdata-sections -ffunction-sections -fno-builtin-calloc -fno-builtin-malloc -fno-builtin-realloc -c -o sb_proc.lo /var/tmp/portage/sys-apps/sandbox-2.13/work/sandbox-2.13/libsbutil/sb_proc.c
  634. /bin/sh ../libtool --tag=CC --mode=compile x86_64-pc-linux-gnu-gcc -m32 -DHAVE_CONFIG_H -I. -I/var/tmp/portage/sys-apps/sandbox-2.13/work/sandbox-2.13/libsbutil -I.. -I/var/tmp/portage/sys-apps/sandbox-2.13/work/sandbox-2.13 -I/var/tmp/portage/sys-apps/sandbox-2.13/work/sandbox-2.13/libsbutil/include -DETCDIR="\"/etc\"" -DLIBSANDBOX_PATH="\"/usr/lib32\"" -DSANDBOX_BASHRC_PATH="\"/usr/share/sandbox\"" -D_REENTRANT -march=native -O2 -pipe -Wall -Winvalid-pch -fdata-sections -ffunction-sections -fno-builtin-calloc -fno-builtin-malloc -fno-builtin-realloc -c -o sb_memory.lo /var/tmp/portage/sys-apps/sandbox-2.13/work/sandbox-2.13/libsbutil/sb_memory.c
  635. libtool: compile: x86_64-pc-linux-gnu-gcc -m32 -DHAVE_CONFIG_H -I. -I/var/tmp/portage/sys-apps/sandbox-2.13/work/sandbox-2.13/libsbutil -I.. -I/var/tmp/portage/sys-apps/sandbox-2.13/work/sandbox-2.13 -I/var/tmp/portage/sys-apps/sandbox-2.13/work/sandbox-2.13/libsbutil/include -DETCDIR=\"/etc\" -DLIBSANDBOX_PATH=\"/usr/lib32\" -DSANDBOX_BASHRC_PATH=\"/usr/share/sandbox\" -D_REENTRANT -march=native -O2 -pipe -Wall -Winvalid-pch -fdata-sections -ffunction-sections -fno-builtin-calloc -fno-builtin-malloc -fno-builtin-realloc -c /var/tmp/portage/sys-apps/sandbox-2.13/work/sandbox-2.13/libsbutil/sb_proc.c -fPIC -DPIC -o .libs/sb_proc.o
  636. libtool: compile: x86_64-pc-linux-gnu-gcc -m32 -DHAVE_CONFIG_H -I. -I/var/tmp/portage/sys-apps/sandbox-2.13/work/sandbox-2.13/libsbutil -I.. -I/var/tmp/portage/sys-apps/sandbox-2.13/work/sandbox-2.13 -I/var/tmp/portage/sys-apps/sandbox-2.13/work/sandbox-2.13/libsbutil/include -DETCDIR=\"/etc\" -DLIBSANDBOX_PATH=\"/usr/lib32\" -DSANDBOX_BASHRC_PATH=\"/usr/share/sandbox\" -D_REENTRANT -march=native -O2 -pipe -Wall -Winvalid-pch -fdata-sections -ffunction-sections -fno-builtin-calloc -fno-builtin-malloc -fno-builtin-realloc -c /var/tmp/portage/sys-apps/sandbox-2.13/work/sandbox-2.13/libsbutil/sb_memory.c -fPIC -DPIC -o .libs/sb_memory.o
  637. /bin/sh ../libtool --tag=CC --mode=compile x86_64-pc-linux-gnu-gcc -m32 -DHAVE_CONFIG_H -I. -I/var/tmp/portage/sys-apps/sandbox-2.13/work/sandbox-2.13/libsbutil -I.. -I/var/tmp/portage/sys-apps/sandbox-2.13/work/sandbox-2.13 -I/var/tmp/portage/sys-apps/sandbox-2.13/work/sandbox-2.13/libsbutil/include -DETCDIR="\"/etc\"" -DLIBSANDBOX_PATH="\"/usr/lib32\"" -DSANDBOX_BASHRC_PATH="\"/usr/share/sandbox\"" -D_REENTRANT -march=native -O2 -pipe -Wall -Winvalid-pch -fdata-sections -ffunction-sections -fno-builtin-calloc -fno-builtin-malloc -fno-builtin-realloc -c -o src/debug.lo /var/tmp/portage/sys-apps/sandbox-2.13/work/sandbox-2.13/libsbutil/src/debug.c
  638. /bin/sh ../libtool --tag=CC --mode=compile x86_64-pc-linux-gnu-gcc -m32 -DHAVE_CONFIG_H -I. -I/var/tmp/portage/sys-apps/sandbox-2.13/work/sandbox-2.13/libsbutil -I.. -I/var/tmp/portage/sys-apps/sandbox-2.13/work/sandbox-2.13 -I/var/tmp/portage/sys-apps/sandbox-2.13/work/sandbox-2.13/libsbutil/include -DETCDIR="\"/etc\"" -DLIBSANDBOX_PATH="\"/usr/lib32\"" -DSANDBOX_BASHRC_PATH="\"/usr/share/sandbox\"" -D_REENTRANT -march=native -O2 -pipe -Wall -Winvalid-pch -fdata-sections -ffunction-sections -fno-builtin-calloc -fno-builtin-malloc -fno-builtin-realloc -c -o src/string.lo /var/tmp/portage/sys-apps/sandbox-2.13/work/sandbox-2.13/libsbutil/src/string.c
  639. libtool: compile: x86_64-pc-linux-gnu-gcc -m32 -DHAVE_CONFIG_H -I. -I/var/tmp/portage/sys-apps/sandbox-2.13/work/sandbox-2.13/libsbutil -I.. -I/var/tmp/portage/sys-apps/sandbox-2.13/work/sandbox-2.13 -I/var/tmp/portage/sys-apps/sandbox-2.13/work/sandbox-2.13/libsbutil/include -DETCDIR=\"/etc\" -DLIBSANDBOX_PATH=\"/usr/lib32\" -DSANDBOX_BASHRC_PATH=\"/usr/share/sandbox\" -D_REENTRANT -march=native -O2 -pipe -Wall -Winvalid-pch -fdata-sections -ffunction-sections -fno-builtin-calloc -fno-builtin-malloc -fno-builtin-realloc -c /var/tmp/portage/sys-apps/sandbox-2.13/work/sandbox-2.13/libsbutil/src/debug.c -fPIC -DPIC -o src/.libs/debug.o
  640. libtool: compile: x86_64-pc-linux-gnu-gcc -m32 -DHAVE_CONFIG_H -I. -I/var/tmp/portage/sys-apps/sandbox-2.13/work/sandbox-2.13/libsbutil -I.. -I/var/tmp/portage/sys-apps/sandbox-2.13/work/sandbox-2.13 -I/var/tmp/portage/sys-apps/sandbox-2.13/work/sandbox-2.13/libsbutil/include -DETCDIR=\"/etc\" -DLIBSANDBOX_PATH=\"/usr/lib32\" -DSANDBOX_BASHRC_PATH=\"/usr/share/sandbox\" -D_REENTRANT -march=native -O2 -pipe -Wall -Winvalid-pch -fdata-sections -ffunction-sections -fno-builtin-calloc -fno-builtin-malloc -fno-builtin-realloc -c /var/tmp/portage/sys-apps/sandbox-2.13/work/sandbox-2.13/libsbutil/src/string.c -fPIC -DPIC -o src/.libs/string.o
  641. /bin/sh ../libtool --tag=CC --mode=compile x86_64-pc-linux-gnu-gcc -m32 -DHAVE_CONFIG_H -I. -I/var/tmp/portage/sys-apps/sandbox-2.13/work/sandbox-2.13/libsbutil -I.. -I/var/tmp/portage/sys-apps/sandbox-2.13/work/sandbox-2.13 -I/var/tmp/portage/sys-apps/sandbox-2.13/work/sandbox-2.13/libsbutil/include -DETCDIR="\"/etc\"" -DLIBSANDBOX_PATH="\"/usr/lib32\"" -DSANDBOX_BASHRC_PATH="\"/usr/share/sandbox\"" -D_REENTRANT -march=native -O2 -pipe -Wall -Winvalid-pch -fdata-sections -ffunction-sections -fno-builtin-calloc -fno-builtin-malloc -fno-builtin-realloc -c -o src/file.lo /var/tmp/portage/sys-apps/sandbox-2.13/work/sandbox-2.13/libsbutil/src/file.c
  642. /bin/sh ../libtool --tag=CC --mode=compile x86_64-pc-linux-gnu-gcc -m32 -DHAVE_CONFIG_H -I. -I/var/tmp/portage/sys-apps/sandbox-2.13/work/sandbox-2.13/libsbutil -I.. -I/var/tmp/portage/sys-apps/sandbox-2.13/work/sandbox-2.13 -I/var/tmp/portage/sys-apps/sandbox-2.13/work/sandbox-2.13/libsbutil/include -DETCDIR="\"/etc\"" -DLIBSANDBOX_PATH="\"/usr/lib32\"" -DSANDBOX_BASHRC_PATH="\"/usr/share/sandbox\"" -D_REENTRANT -march=native -O2 -pipe -Wall -Winvalid-pch -fdata-sections -ffunction-sections -fno-builtin-calloc -fno-builtin-malloc -fno-builtin-realloc -c -o src/config.lo /var/tmp/portage/sys-apps/sandbox-2.13/work/sandbox-2.13/libsbutil/src/config.c
  643. libtool: compile: x86_64-pc-linux-gnu-gcc -m32 -DHAVE_CONFIG_H -I. -I/var/tmp/portage/sys-apps/sandbox-2.13/work/sandbox-2.13/libsbutil -I.. -I/var/tmp/portage/sys-apps/sandbox-2.13/work/sandbox-2.13 -I/var/tmp/portage/sys-apps/sandbox-2.13/work/sandbox-2.13/libsbutil/include -DETCDIR=\"/etc\" -DLIBSANDBOX_PATH=\"/usr/lib32\" -DSANDBOX_BASHRC_PATH=\"/usr/share/sandbox\" -D_REENTRANT -march=native -O2 -pipe -Wall -Winvalid-pch -fdata-sections -ffunction-sections -fno-builtin-calloc -fno-builtin-malloc -fno-builtin-realloc -c /var/tmp/portage/sys-apps/sandbox-2.13/work/sandbox-2.13/libsbutil/src/file.c -fPIC -DPIC -o src/.libs/file.o
  644. libtool: compile: x86_64-pc-linux-gnu-gcc -m32 -DHAVE_CONFIG_H -I. -I/var/tmp/portage/sys-apps/sandbox-2.13/work/sandbox-2.13/libsbutil -I.. -I/var/tmp/portage/sys-apps/sandbox-2.13/work/sandbox-2.13 -I/var/tmp/portage/sys-apps/sandbox-2.13/work/sandbox-2.13/libsbutil/include -DETCDIR=\"/etc\" -DLIBSANDBOX_PATH=\"/usr/lib32\" -DSANDBOX_BASHRC_PATH=\"/usr/share/sandbox\" -D_REENTRANT -march=native -O2 -pipe -Wall -Winvalid-pch -fdata-sections -ffunction-sections -fno-builtin-calloc -fno-builtin-malloc -fno-builtin-realloc -c /var/tmp/portage/sys-apps/sandbox-2.13/work/sandbox-2.13/libsbutil/src/config.c -fPIC -DPIC -o src/.libs/config.o
  645. /bin/sh ../libtool --tag=CC --mode=compile x86_64-pc-linux-gnu-gcc -m32 -DHAVE_CONFIG_H -I. -I/var/tmp/portage/sys-apps/sandbox-2.13/work/sandbox-2.13/libsbutil -I.. -I/var/tmp/portage/sys-apps/sandbox-2.13/work/sandbox-2.13 -I/var/tmp/portage/sys-apps/sandbox-2.13/work/sandbox-2.13/libsbutil/include -DETCDIR="\"/etc\"" -DLIBSANDBOX_PATH="\"/usr/lib32\"" -DSANDBOX_BASHRC_PATH="\"/usr/share/sandbox\"" -D_REENTRANT -march=native -O2 -pipe -Wall -Winvalid-pch -fdata-sections -ffunction-sections -fno-builtin-calloc -fno-builtin-malloc -fno-builtin-realloc -c -o src/dynbuf.lo /var/tmp/portage/sys-apps/sandbox-2.13/work/sandbox-2.13/libsbutil/src/dynbuf.c
  646. /bin/sh ../libtool --tag=CC --mode=compile x86_64-pc-linux-gnu-gcc -m32 -DHAVE_CONFIG_H -I. -I/var/tmp/portage/sys-apps/sandbox-2.13/work/sandbox-2.13/libsbutil -I.. -I/var/tmp/portage/sys-apps/sandbox-2.13/work/sandbox-2.13 -I/var/tmp/portage/sys-apps/sandbox-2.13/work/sandbox-2.13/libsbutil/include -DETCDIR="\"/etc\"" -DLIBSANDBOX_PATH="\"/usr/lib32\"" -DSANDBOX_BASHRC_PATH="\"/usr/share/sandbox\"" -D_REENTRANT -march=native -O2 -pipe -Wall -Winvalid-pch -fdata-sections -ffunction-sections -fno-builtin-calloc -fno-builtin-malloc -fno-builtin-realloc -c -o gnulib/areadlink-with-size.lo /var/tmp/portage/sys-apps/sandbox-2.13/work/sandbox-2.13/libsbutil/gnulib/areadlink-with-size.c
  647. libtool: compile: x86_64-pc-linux-gnu-gcc -m32 -DHAVE_CONFIG_H -I. -I/var/tmp/portage/sys-apps/sandbox-2.13/work/sandbox-2.13/libsbutil -I.. -I/var/tmp/portage/sys-apps/sandbox-2.13/work/sandbox-2.13 -I/var/tmp/portage/sys-apps/sandbox-2.13/work/sandbox-2.13/libsbutil/include -DETCDIR=\"/etc\" -DLIBSANDBOX_PATH=\"/usr/lib32\" -DSANDBOX_BASHRC_PATH=\"/usr/share/sandbox\" -D_REENTRANT -march=native -O2 -pipe -Wall -Winvalid-pch -fdata-sections -ffunction-sections -fno-builtin-calloc -fno-builtin-malloc -fno-builtin-realloc -c /var/tmp/portage/sys-apps/sandbox-2.13/work/sandbox-2.13/libsbutil/src/dynbuf.c -fPIC -DPIC -o src/.libs/dynbuf.o
  648. libtool: compile: x86_64-pc-linux-gnu-gcc -m32 -DHAVE_CONFIG_H -I. -I/var/tmp/portage/sys-apps/sandbox-2.13/work/sandbox-2.13/libsbutil -I.. -I/var/tmp/portage/sys-apps/sandbox-2.13/work/sandbox-2.13 -I/var/tmp/portage/sys-apps/sandbox-2.13/work/sandbox-2.13/libsbutil/include -DETCDIR=\"/etc\" -DLIBSANDBOX_PATH=\"/usr/lib32\" -DSANDBOX_BASHRC_PATH=\"/usr/share/sandbox\" -D_REENTRANT -march=native -O2 -pipe -Wall -Winvalid-pch -fdata-sections -ffunction-sections -fno-builtin-calloc -fno-builtin-malloc -fno-builtin-realloc -c /var/tmp/portage/sys-apps/sandbox-2.13/work/sandbox-2.13/libsbutil/gnulib/areadlink-with-size.c -fPIC -DPIC -o gnulib/.libs/areadlink-with-size.o
  649. /bin/sh ../libtool --tag=CC --mode=compile x86_64-pc-linux-gnu-gcc -m32 -DHAVE_CONFIG_H -I. -I/var/tmp/portage/sys-apps/sandbox-2.13/work/sandbox-2.13/libsbutil -I.. -I/var/tmp/portage/sys-apps/sandbox-2.13/work/sandbox-2.13 -I/var/tmp/portage/sys-apps/sandbox-2.13/work/sandbox-2.13/libsbutil/include -DETCDIR="\"/etc\"" -DLIBSANDBOX_PATH="\"/usr/lib32\"" -DSANDBOX_BASHRC_PATH="\"/usr/share/sandbox\"" -D_REENTRANT -march=native -O2 -pipe -Wall -Winvalid-pch -fdata-sections -ffunction-sections -fno-builtin-calloc -fno-builtin-malloc -fno-builtin-realloc -c -o gnulib/bitrotate.lo /var/tmp/portage/sys-apps/sandbox-2.13/work/sandbox-2.13/libsbutil/gnulib/bitrotate.c
  650. /bin/sh ../libtool --tag=CC --mode=compile x86_64-pc-linux-gnu-gcc -m32 -DHAVE_CONFIG_H -I. -I/var/tmp/portage/sys-apps/sandbox-2.13/work/sandbox-2.13/libsbutil -I.. -I/var/tmp/portage/sys-apps/sandbox-2.13/work/sandbox-2.13 -I/var/tmp/portage/sys-apps/sandbox-2.13/work/sandbox-2.13/libsbutil/include -DETCDIR="\"/etc\"" -DLIBSANDBOX_PATH="\"/usr/lib32\"" -DSANDBOX_BASHRC_PATH="\"/usr/share/sandbox\"" -D_REENTRANT -march=native -O2 -pipe -Wall -Winvalid-pch -fdata-sections -ffunction-sections -fno-builtin-calloc -fno-builtin-malloc -fno-builtin-realloc -c -o gnulib/canonicalize.lo /var/tmp/portage/sys-apps/sandbox-2.13/work/sandbox-2.13/libsbutil/gnulib/canonicalize.c
  651. libtool: compile: x86_64-pc-linux-gnu-gcc -m32 -DHAVE_CONFIG_H -I. -I/var/tmp/portage/sys-apps/sandbox-2.13/work/sandbox-2.13/libsbutil -I.. -I/var/tmp/portage/sys-apps/sandbox-2.13/work/sandbox-2.13 -I/var/tmp/portage/sys-apps/sandbox-2.13/work/sandbox-2.13/libsbutil/include -DETCDIR=\"/etc\" -DLIBSANDBOX_PATH=\"/usr/lib32\" -DSANDBOX_BASHRC_PATH=\"/usr/share/sandbox\" -D_REENTRANT -march=native -O2 -pipe -Wall -Winvalid-pch -fdata-sections -ffunction-sections -fno-builtin-calloc -fno-builtin-malloc -fno-builtin-realloc -c /var/tmp/portage/sys-apps/sandbox-2.13/work/sandbox-2.13/libsbutil/gnulib/bitrotate.c -fPIC -DPIC -o gnulib/.libs/bitrotate.o
  652. libtool: compile: x86_64-pc-linux-gnu-gcc -m32 -DHAVE_CONFIG_H -I. -I/var/tmp/portage/sys-apps/sandbox-2.13/work/sandbox-2.13/libsbutil -I.. -I/var/tmp/portage/sys-apps/sandbox-2.13/work/sandbox-2.13 -I/var/tmp/portage/sys-apps/sandbox-2.13/work/sandbox-2.13/libsbutil/include -DETCDIR=\"/etc\" -DLIBSANDBOX_PATH=\"/usr/lib32\" -DSANDBOX_BASHRC_PATH=\"/usr/share/sandbox\" -D_REENTRANT -march=native -O2 -pipe -Wall -Winvalid-pch -fdata-sections -ffunction-sections -fno-builtin-calloc -fno-builtin-malloc -fno-builtin-realloc -c /var/tmp/portage/sys-apps/sandbox-2.13/work/sandbox-2.13/libsbutil/gnulib/canonicalize.c -fPIC -DPIC -o gnulib/.libs/canonicalize.o
  653. /bin/sh ../libtool --tag=CC --mode=compile x86_64-pc-linux-gnu-gcc -m32 -DHAVE_CONFIG_H -I. -I/var/tmp/portage/sys-apps/sandbox-2.13/work/sandbox-2.13/libsbutil -I.. -I/var/tmp/portage/sys-apps/sandbox-2.13/work/sandbox-2.13 -I/var/tmp/portage/sys-apps/sandbox-2.13/work/sandbox-2.13/libsbutil/include -DETCDIR="\"/etc\"" -DLIBSANDBOX_PATH="\"/usr/lib32\"" -DSANDBOX_BASHRC_PATH="\"/usr/share/sandbox\"" -D_REENTRANT -march=native -O2 -pipe -Wall -Winvalid-pch -fdata-sections -ffunction-sections -fno-builtin-calloc -fno-builtin-malloc -fno-builtin-realloc -c -o gnulib/file-set.lo /var/tmp/portage/sys-apps/sandbox-2.13/work/sandbox-2.13/libsbutil/gnulib/file-set.c
  654. libtool: compile: x86_64-pc-linux-gnu-gcc -m32 -DHAVE_CONFIG_H -I. -I/var/tmp/portage/sys-apps/sandbox-2.13/work/sandbox-2.13/libsbutil -I.. -I/var/tmp/portage/sys-apps/sandbox-2.13/work/sandbox-2.13 -I/var/tmp/portage/sys-apps/sandbox-2.13/work/sandbox-2.13/libsbutil/include -DETCDIR=\"/etc\" -DLIBSANDBOX_PATH=\"/usr/lib32\" -DSANDBOX_BASHRC_PATH=\"/usr/share/sandbox\" -D_REENTRANT -march=native -O2 -pipe -Wall -Winvalid-pch -fdata-sections -ffunction-sections -fno-builtin-calloc -fno-builtin-malloc -fno-builtin-realloc -c /var/tmp/portage/sys-apps/sandbox-2.13/work/sandbox-2.13/libsbutil/gnulib/file-set.c -fPIC -DPIC -o gnulib/.libs/file-set.o
  655. /bin/sh ../libtool --tag=CC --mode=compile x86_64-pc-linux-gnu-gcc -m32 -DHAVE_CONFIG_H -I. -I/var/tmp/portage/sys-apps/sandbox-2.13/work/sandbox-2.13/libsbutil -I.. -I/var/tmp/portage/sys-apps/sandbox-2.13/work/sandbox-2.13 -I/var/tmp/portage/sys-apps/sandbox-2.13/work/sandbox-2.13/libsbutil/include -DETCDIR="\"/etc\"" -DLIBSANDBOX_PATH="\"/usr/lib32\"" -DSANDBOX_BASHRC_PATH="\"/usr/share/sandbox\"" -D_REENTRANT -march=native -O2 -pipe -Wall -Winvalid-pch -fdata-sections -ffunction-sections -fno-builtin-calloc -fno-builtin-malloc -fno-builtin-realloc -c -o gnulib/hash.lo /var/tmp/portage/sys-apps/sandbox-2.13/work/sandbox-2.13/libsbutil/gnulib/hash.c
  656. /bin/sh ../libtool --tag=CC --mode=compile x86_64-pc-linux-gnu-gcc -m32 -DHAVE_CONFIG_H -I. -I/var/tmp/portage/sys-apps/sandbox-2.13/work/sandbox-2.13/libsbutil -I.. -I/var/tmp/portage/sys-apps/sandbox-2.13/work/sandbox-2.13 -I/var/tmp/portage/sys-apps/sandbox-2.13/work/sandbox-2.13/libsbutil/include -DETCDIR="\"/etc\"" -DLIBSANDBOX_PATH="\"/usr/lib32\"" -DSANDBOX_BASHRC_PATH="\"/usr/share/sandbox\"" -D_REENTRANT -march=native -O2 -pipe -Wall -Winvalid-pch -fdata-sections -ffunction-sections -fno-builtin-calloc -fno-builtin-malloc -fno-builtin-realloc -c -o gnulib/hash-pjw.lo /var/tmp/portage/sys-apps/sandbox-2.13/work/sandbox-2.13/libsbutil/gnulib/hash-pjw.c
  657. libtool: compile: x86_64-pc-linux-gnu-gcc -m32 -DHAVE_CONFIG_H -I. -I/var/tmp/portage/sys-apps/sandbox-2.13/work/sandbox-2.13/libsbutil -I.. -I/var/tmp/portage/sys-apps/sandbox-2.13/work/sandbox-2.13 -I/var/tmp/portage/sys-apps/sandbox-2.13/work/sandbox-2.13/libsbutil/include -DETCDIR=\"/etc\" -DLIBSANDBOX_PATH=\"/usr/lib32\" -DSANDBOX_BASHRC_PATH=\"/usr/share/sandbox\" -D_REENTRANT -march=native -O2 -pipe -Wall -Winvalid-pch -fdata-sections -ffunction-sections -fno-builtin-calloc -fno-builtin-malloc -fno-builtin-realloc -c /var/tmp/portage/sys-apps/sandbox-2.13/work/sandbox-2.13/libsbutil/gnulib/hash.c -fPIC -DPIC -o gnulib/.libs/hash.o
  658. libtool: compile: x86_64-pc-linux-gnu-gcc -m32 -DHAVE_CONFIG_H -I. -I/var/tmp/portage/sys-apps/sandbox-2.13/work/sandbox-2.13/libsbutil -I.. -I/var/tmp/portage/sys-apps/sandbox-2.13/work/sandbox-2.13 -I/var/tmp/portage/sys-apps/sandbox-2.13/work/sandbox-2.13/libsbutil/include -DETCDIR=\"/etc\" -DLIBSANDBOX_PATH=\"/usr/lib32\" -DSANDBOX_BASHRC_PATH=\"/usr/share/sandbox\" -D_REENTRANT -march=native -O2 -pipe -Wall -Winvalid-pch -fdata-sections -ffunction-sections -fno-builtin-calloc -fno-builtin-malloc -fno-builtin-realloc -c /var/tmp/portage/sys-apps/sandbox-2.13/work/sandbox-2.13/libsbutil/gnulib/hash-pjw.c -fPIC -DPIC -o gnulib/.libs/hash-pjw.o
  659. /bin/sh ../libtool --tag=CC --mode=compile x86_64-pc-linux-gnu-gcc -m32 -DHAVE_CONFIG_H -I. -I/var/tmp/portage/sys-apps/sandbox-2.13/work/sandbox-2.13/libsbutil -I.. -I/var/tmp/portage/sys-apps/sandbox-2.13/work/sandbox-2.13 -I/var/tmp/portage/sys-apps/sandbox-2.13/work/sandbox-2.13/libsbutil/include -DETCDIR="\"/etc\"" -DLIBSANDBOX_PATH="\"/usr/lib32\"" -DSANDBOX_BASHRC_PATH="\"/usr/share/sandbox\"" -D_REENTRANT -march=native -O2 -pipe -Wall -Winvalid-pch -fdata-sections -ffunction-sections -fno-builtin-calloc -fno-builtin-malloc -fno-builtin-realloc -c -o gnulib/hash-triple.lo /var/tmp/portage/sys-apps/sandbox-2.13/work/sandbox-2.13/libsbutil/gnulib/hash-triple.c
  660. libtool: compile: x86_64-pc-linux-gnu-gcc -m32 -DHAVE_CONFIG_H -I. -I/var/tmp/portage/sys-apps/sandbox-2.13/work/sandbox-2.13/libsbutil -I.. -I/var/tmp/portage/sys-apps/sandbox-2.13/work/sandbox-2.13 -I/var/tmp/portage/sys-apps/sandbox-2.13/work/sandbox-2.13/libsbutil/include -DETCDIR=\"/etc\" -DLIBSANDBOX_PATH=\"/usr/lib32\" -DSANDBOX_BASHRC_PATH=\"/usr/share/sandbox\" -D_REENTRANT -march=native -O2 -pipe -Wall -Winvalid-pch -fdata-sections -ffunction-sections -fno-builtin-calloc -fno-builtin-malloc -fno-builtin-realloc -c /var/tmp/portage/sys-apps/sandbox-2.13/work/sandbox-2.13/libsbutil/gnulib/hash-triple.c -fPIC -DPIC -o gnulib/.libs/hash-triple.o
  661. /bin/sh ../libtool --tag=CC --mode=link x86_64-pc-linux-gnu-gcc -m32 -march=native -O2 -pipe -Wall -Winvalid-pch -fdata-sections -ffunction-sections -fno-builtin-calloc -fno-builtin-malloc -fno-builtin-realloc -no-undefined -Wl,-O1 -Wl,--as-needed -Wl,--as-needed -Wl,--gc-sections -Wl,--no-undefined -o libsbutil.la get_sandbox_conf.lo get_sandbox_confd.lo get_sandbox_lib.lo get_sandbox_rc.lo get_sandbox_log.lo get_tmp_dir.lo environment.lo sb_backtrace.lo sb_efuncs.lo sb_gdb.lo sb_open.lo sb_read.lo sb_write.lo sb_write_fd.lo sb_close.lo sb_printf.lo sb_proc.lo sb_memory.lo src/debug.lo src/string.lo src/file.lo src/config.lo src/dynbuf.lo gnulib/areadlink-with-size.lo gnulib/bitrotate.lo gnulib/canonicalize.lo gnulib/file-set.lo gnulib/hash.lo gnulib/hash-pjw.lo gnulib/hash-triple.lo
  662. libtool: link: ar cru .libs/libsbutil.a .libs/get_sandbox_conf.o .libs/get_sandbox_confd.o .libs/get_sandbox_lib.o .libs/get_sandbox_rc.o .libs/get_sandbox_log.o .libs/get_tmp_dir.o .libs/environment.o .libs/sb_backtrace.o .libs/sb_efuncs.o .libs/sb_gdb.o .libs/sb_open.o .libs/sb_read.o .libs/sb_write.o .libs/sb_write_fd.o .libs/sb_close.o .libs/sb_printf.o .libs/sb_proc.o .libs/sb_memory.o src/.libs/debug.o src/.libs/string.o src/.libs/file.o src/.libs/config.o src/.libs/dynbuf.o gnulib/.libs/areadlink-with-size.o gnulib/.libs/bitrotate.o gnulib/.libs/canonicalize.o gnulib/.libs/file-set.o gnulib/.libs/hash.o gnulib/.libs/hash-pjw.o gnulib/.libs/hash-triple.o
  663. libtool: link: ranlib .libs/libsbutil.a
  664. libtool: link: ( cd ".libs" && rm -f "libsbutil.la" && ln -s "../libsbutil.la" "libsbutil.la" )
  665. Making all in libsandbox
  666. readelf -s /lib32/libc.so.6 | LC_ALL=C gawk -v SYMBOLS_LIST="chmod fchmodat chown fchownat open __open_2 openat __openat_2 creat fopen lchown link linkat mkdir mkdirat opendir mknod mknodat _xmknod __xmknod __xmknodat mkfifo mkfifoat access faccessat remove rename renameat rmdir symlink symlinkat truncate unlink unlinkat getcwd open64 __open64_2 openat64 __openat64_2 creat64 fopen64 truncate64 mkdtemp mkostemp mkostemp64 mkostemps mkostemps64 mkstemp mkstemp64 mkstemps mkstemps64 execv execve execveat execvp execvpe fexecve system popen utime utimes utimensat futimesat lutimes fork" -v srcdir="/var/tmp/portage/sys-apps/sandbox-2.13/work/sandbox-2.13/libsandbox" -f /var/tmp/portage/sys-apps/sandbox-2.13/work/sandbox-2.13/scripts/gen_symbol_version_map.awk > libsandbox.map
  667. readelf -s /lib32/libc.so.6 | LC_ALL=C gawk -v SYMBOLS_LIST="chmod fchmodat chown fchownat open __open_2 openat __openat_2 creat fopen lchown link linkat mkdir mkdirat opendir mknod mknodat _xmknod __xmknod __xmknodat mkfifo mkfifoat access faccessat remove rename renameat rmdir symlink symlinkat truncate unlink unlinkat getcwd open64 __open64_2 openat64 __openat64_2 creat64 fopen64 truncate64 mkdtemp mkostemp mkostemp64 mkostemps mkostemps64 mkstemp mkstemp64 mkstemps mkstemps64 execv execve execveat execvp execvpe fexecve system popen utime utimes utimensat futimesat lutimes fork" -v srcdir="/var/tmp/portage/sys-apps/sandbox-2.13/work/sandbox-2.13/libsandbox" -f /var/tmp/portage/sys-apps/sandbox-2.13/work/sandbox-2.13/scripts/gen_symbol_header.awk > symbols.h
  668. /bin/sh ../libtool --tag=CC --mode=compile x86_64-pc-linux-gnu-gcc -m32 -DHAVE_CONFIG_H -I. -I/var/tmp/portage/sys-apps/sandbox-2.13/work/sandbox-2.13/libsandbox -I.. -I/var/tmp/portage/sys-apps/sandbox-2.13/work/sandbox-2.13 -I/var/tmp/portage/sys-apps/sandbox-2.13/work/sandbox-2.13/libsbutil -I/var/tmp/portage/sys-apps/sandbox-2.13/work/sandbox-2.13/libsbutil/include -DETCDIR="\"/etc\"" -DLIBSANDBOX_PATH="\"/usr/lib32\"" -DSANDBOX_BASHRC_PATH="\"/usr/share/sandbox\"" -D_REENTRANT -fexceptions -march=native -O2 -pipe -Wall -Winvalid-pch -fdata-sections -ffunction-sections -fno-builtin-calloc -fno-builtin-malloc -fno-builtin-realloc -c -o libsandbox_la-lock.lo `test -f 'lock.c' || echo '/var/tmp/portage/sys-apps/sandbox-2.13/work/sandbox-2.13/libsandbox/'`lock.c
  669. libtool: compile: x86_64-pc-linux-gnu-gcc -m32 -DHAVE_CONFIG_H -I. -I/var/tmp/portage/sys-apps/sandbox-2.13/work/sandbox-2.13/libsandbox -I.. -I/var/tmp/portage/sys-apps/sandbox-2.13/work/sandbox-2.13 -I/var/tmp/portage/sys-apps/sandbox-2.13/work/sandbox-2.13/libsbutil -I/var/tmp/portage/sys-apps/sandbox-2.13/work/sandbox-2.13/libsbutil/include -DETCDIR=\"/etc\" -DLIBSANDBOX_PATH=\"/usr/lib32\" -DSANDBOX_BASHRC_PATH=\"/usr/share/sandbox\" -D_REENTRANT -fexceptions -march=native -O2 -pipe -Wall -Winvalid-pch -fdata-sections -ffunction-sections -fno-builtin-calloc -fno-builtin-malloc -fno-builtin-realloc -c /var/tmp/portage/sys-apps/sandbox-2.13/work/sandbox-2.13/libsandbox/lock.c -fPIC -DPIC -o .libs/libsandbox_la-lock.o
  670. /bin/sh ../libtool --tag=CC --mode=compile x86_64-pc-linux-gnu-gcc -m32 -DHAVE_CONFIG_H -I. -I/var/tmp/portage/sys-apps/sandbox-2.13/work/sandbox-2.13/libsandbox -I.. -I/var/tmp/portage/sys-apps/sandbox-2.13/work/sandbox-2.13 -I/var/tmp/portage/sys-apps/sandbox-2.13/work/sandbox-2.13/libsbutil -I/var/tmp/portage/sys-apps/sandbox-2.13/work/sandbox-2.13/libsbutil/include -DETCDIR="\"/etc\"" -DLIBSANDBOX_PATH="\"/usr/lib32\"" -DSANDBOX_BASHRC_PATH="\"/usr/share/sandbox\"" -D_REENTRANT -fexceptions -march=native -O2 -pipe -Wall -Winvalid-pch -fdata-sections -ffunction-sections -fno-builtin-calloc -fno-builtin-malloc -fno-builtin-realloc -c -o libsandbox_la-memory.lo `test -f 'memory.c' || echo '/var/tmp/portage/sys-apps/sandbox-2.13/work/sandbox-2.13/libsandbox/'`memory.c
  671. for pers in x86_64:-m64 x86:-m32 ; do \
  672. t=_${pers%:*}; \
  673. f=${pers#*:}; \
  674. header="trace_syscalls${t}.h"; \
  675. if [ "$header" = "trace_syscalls_x86_64.h" ]; then \
  676. LC_ALL=C gawk -v SYMBOLS_LIST="chmod fchmodat chown fchownat open __open_2 openat __openat_2 creat fopen lchown link linkat mkdir mkdirat opendir mknod mknodat _xmknod __xmknod __xmknodat mkfifo mkfifoat access faccessat remove rename renameat rmdir symlink symlinkat truncate unlink unlinkat getcwd open64 __open64_2 openat64 __openat64_2 creat64 fopen64 truncate64 mkdtemp mkostemp mkostemp64 mkostemps mkostemps64 mkstemp mkstemp64 mkstemps mkstemps64 execv execve execveat execvp execvpe fexecve system popen utime utimes utimensat futimesat lutimes fork" -v srcdir="/var/tmp/portage/sys-apps/sandbox-2.13/work/sandbox-2.13/libsandbox" -f /var/tmp/portage/sys-apps/sandbox-2.13/work/sandbox-2.13/scripts/gen_trace_header.awk -v MODE=gen | x86_64-pc-linux-gnu-gcc -m32 -DHAVE_CONFIG_H -I. -I/var/tmp/portage/sys-apps/sandbox-2.13/work/sandbox-2.13/libsandbox -I.. -I/var/tmp/portage/sys-apps/sandbox-2.13/work/sandbox-2.13 -I/var/tmp/portage/sys-apps/sandbox-2.13/work/sandbox-2.13/libsbutil -I/var/tmp/portage/sys-apps/sandbox-2.13/work/sandbox-2.13/libsbutil/include -DETCDIR="\"/etc\"" -DLIBSANDBOX_PATH="\"/usr/lib32\"" -DSANDBOX_BASHRC_PATH="\"/usr/share/sandbox\"" -D_REENTRANT -march=native -O2 -pipe -Wall -Winvalid-pch -fdata-sections -ffunction-sections -fno-builtin-calloc -fno-builtin-malloc -fno-builtin-realloc -E -P -include /var/tmp/portage/sys-apps/sandbox-2.13/work/sandbox-2.13/headers.h - $f | LC_ALL=C gawk -v SYMBOLS_LIST="chmod fchmodat chown fchownat open __open_2 openat __openat_2 creat fopen lchown link linkat mkdir mkdirat opendir mknod mknodat _xmknod __xmknod __xmknodat mkfifo mkfifoat access faccessat remove rename renameat rmdir symlink symlinkat truncate unlink unlinkat getcwd open64 __open64_2 openat64 __openat64_2 creat64 fopen64 truncate64 mkdtemp mkostemp mkostemp64 mkostemps mkostemps64 mkstemp mkstemp64 mkstemps mkstemps64 execv execve execveat execvp execvpe fexecve system popen utime utimes utimensat futimesat lutimes fork" -v srcdir="/var/tmp/portage/sys-apps/sandbox-2.13/work/sandbox-2.13/libsandbox" -f /var/tmp/portage/sys-apps/sandbox-2.13/work/sandbox-2.13/scripts/gen_trace_header.awk -v syscall_prefix=$t > $header || exit $?; \
  677. break; \
  678. fi; \
  679. done
  680. libtool: compile: x86_64-pc-linux-gnu-gcc -m32 -DHAVE_CONFIG_H -I. -I/var/tmp/portage/sys-apps/sandbox-2.13/work/sandbox-2.13/libsandbox -I.. -I/var/tmp/portage/sys-apps/sandbox-2.13/work/sandbox-2.13 -I/var/tmp/portage/sys-apps/sandbox-2.13/work/sandbox-2.13/libsbutil -I/var/tmp/portage/sys-apps/sandbox-2.13/work/sandbox-2.13/libsbutil/include -DETCDIR=\"/etc\" -DLIBSANDBOX_PATH=\"/usr/lib32\" -DSANDBOX_BASHRC_PATH=\"/usr/share/sandbox\" -D_REENTRANT -fexceptions -march=native -O2 -pipe -Wall -Winvalid-pch -fdata-sections -ffunction-sections -fno-builtin-calloc -fno-builtin-malloc -fno-builtin-realloc -c /var/tmp/portage/sys-apps/sandbox-2.13/work/sandbox-2.13/libsandbox/memory.c -fPIC -DPIC -o .libs/libsandbox_la-memory.o
  681. for pers in x86_64:-m64 x86:-m32 ; do \
  682. t=_${pers%:*}; \
  683. f=${pers#*:}; \
  684. header="trace_syscalls${t}.h"; \
  685. if [ "$header" = "trace_syscalls_x86.h" ]; then \
  686. LC_ALL=C gawk -v SYMBOLS_LIST="chmod fchmodat chown fchownat open __open_2 openat __openat_2 creat fopen lchown link linkat mkdir mkdirat opendir mknod mknodat _xmknod __xmknod __xmknodat mkfifo mkfifoat access faccessat remove rename renameat rmdir symlink symlinkat truncate unlink unlinkat getcwd open64 __open64_2 openat64 __openat64_2 creat64 fopen64 truncate64 mkdtemp mkostemp mkostemp64 mkostemps mkostemps64 mkstemp mkstemp64 mkstemps mkstemps64 execv execve execveat execvp execvpe fexecve system popen utime utimes utimensat futimesat lutimes fork" -v srcdir="/var/tmp/portage/sys-apps/sandbox-2.13/work/sandbox-2.13/libsandbox" -f /var/tmp/portage/sys-apps/sandbox-2.13/work/sandbox-2.13/scripts/gen_trace_header.awk -v MODE=gen | x86_64-pc-linux-gnu-gcc -m32 -DHAVE_CONFIG_H -I. -I/var/tmp/portage/sys-apps/sandbox-2.13/work/sandbox-2.13/libsandbox -I.. -I/var/tmp/portage/sys-apps/sandbox-2.13/work/sandbox-2.13 -I/var/tmp/portage/sys-apps/sandbox-2.13/work/sandbox-2.13/libsbutil -I/var/tmp/portage/sys-apps/sandbox-2.13/work/sandbox-2.13/libsbutil/include -DETCDIR="\"/etc\"" -DLIBSANDBOX_PATH="\"/usr/lib32\"" -DSANDBOX_BASHRC_PATH="\"/usr/share/sandbox\"" -D_REENTRANT -march=native -O2 -pipe -Wall -Winvalid-pch -fdata-sections -ffunction-sections -fno-builtin-calloc -fno-builtin-malloc -fno-builtin-realloc -E -P -include /var/tmp/portage/sys-apps/sandbox-2.13/work/sandbox-2.13/headers.h - $f | LC_ALL=C gawk -v SYMBOLS_LIST="chmod fchmodat chown fchownat open __open_2 openat __openat_2 creat fopen lchown link linkat mkdir mkdirat opendir mknod mknodat _xmknod __xmknod __xmknodat mkfifo mkfifoat access faccessat remove rename renameat rmdir symlink symlinkat truncate unlink unlinkat getcwd open64 __open64_2 openat64 __openat64_2 creat64 fopen64 truncate64 mkdtemp mkostemp mkostemp64 mkostemps mkostemps64 mkstemp mkstemp64 mkstemps mkstemps64 execv execve execveat execvp execvpe fexecve system popen utime utimes utimensat futimesat lutimes fork" -v srcdir="/var/tmp/portage/sys-apps/sandbox-2.13/work/sandbox-2.13/libsandbox" -f /var/tmp/portage/sys-apps/sandbox-2.13/work/sandbox-2.13/scripts/gen_trace_header.awk -v syscall_prefix=$t > $header || exit $?; \
  687. break; \
  688. fi; \
  689. done
  690. /bin/sh ../libtool --tag=CC --mode=compile x86_64-pc-linux-gnu-gcc -m32 -DHAVE_CONFIG_H -I. -I/var/tmp/portage/sys-apps/sandbox-2.13/work/sandbox-2.13/libsandbox -I.. -I/var/tmp/portage/sys-apps/sandbox-2.13/work/sandbox-2.13 -I/var/tmp/portage/sys-apps/sandbox-2.13/work/sandbox-2.13/libsbutil -I/var/tmp/portage/sys-apps/sandbox-2.13/work/sandbox-2.13/libsbutil/include -DETCDIR="\"/etc\"" -DLIBSANDBOX_PATH="\"/usr/lib32\"" -DSANDBOX_BASHRC_PATH="\"/usr/share/sandbox\"" -D_REENTRANT -fexceptions -march=native -O2 -pipe -Wall -Winvalid-pch -fdata-sections -ffunction-sections -fno-builtin-calloc -fno-builtin-malloc -fno-builtin-realloc -c -o libsandbox_la-wrappers.lo `test -f 'wrappers.c' || echo '/var/tmp/portage/sys-apps/sandbox-2.13/work/sandbox-2.13/libsandbox/'`wrappers.c
  691. /var/tmp/portage/sys-apps/sandbox-2.13/work/sandbox-2.13/libsandbox/memory.c: In function ‘strdup’:
  692. /var/tmp/portage/sys-apps/sandbox-2.13/work/sandbox-2.13/libsandbox/memory.c:108:5: warning: nonnull argument ‘s’ compared to NULL [-Wnonnull-compare]
  693. if (s == NULL)
  694. ^
  695. /bin/sh ../libtool --tag=CC --mode=compile x86_64-pc-linux-gnu-gcc -m32 -DHAVE_CONFIG_H -I. -I/var/tmp/portage/sys-apps/sandbox-2.13/work/sandbox-2.13/libsandbox -I.. -I/var/tmp/portage/sys-apps/sandbox-2.13/work/sandbox-2.13 -I/var/tmp/portage/sys-apps/sandbox-2.13/work/sandbox-2.13/libsbutil -I/var/tmp/portage/sys-apps/sandbox-2.13/work/sandbox-2.13/libsbutil/include -DETCDIR="\"/etc\"" -DLIBSANDBOX_PATH="\"/usr/lib32\"" -DSANDBOX_BASHRC_PATH="\"/usr/share/sandbox\"" -D_REENTRANT -fexceptions -march=native -O2 -pipe -Wall -Winvalid-pch -fdata-sections -ffunction-sections -fno-builtin-calloc -fno-builtin-malloc -fno-builtin-realloc -c -o libsandbox_la-canonicalize.lo `test -f 'canonicalize.c' || echo '/var/tmp/portage/sys-apps/sandbox-2.13/work/sandbox-2.13/libsandbox/'`canonicalize.c
  696. libtool: compile: x86_64-pc-linux-gnu-gcc -m32 -DHAVE_CONFIG_H -I. -I/var/tmp/portage/sys-apps/sandbox-2.13/work/sandbox-2.13/libsandbox -I.. -I/var/tmp/portage/sys-apps/sandbox-2.13/work/sandbox-2.13 -I/var/tmp/portage/sys-apps/sandbox-2.13/work/sandbox-2.13/libsbutil -I/var/tmp/portage/sys-apps/sandbox-2.13/work/sandbox-2.13/libsbutil/include -DETCDIR=\"/etc\" -DLIBSANDBOX_PATH=\"/usr/lib32\" -DSANDBOX_BASHRC_PATH=\"/usr/share/sandbox\" -D_REENTRANT -fexceptions -march=native -O2 -pipe -Wall -Winvalid-pch -fdata-sections -ffunction-sections -fno-builtin-calloc -fno-builtin-malloc -fno-builtin-realloc -c /var/tmp/portage/sys-apps/sandbox-2.13/work/sandbox-2.13/libsandbox/wrappers.c -fPIC -DPIC -o .libs/libsandbox_la-wrappers.o
  697. libtool: compile: x86_64-pc-linux-gnu-gcc -m32 -DHAVE_CONFIG_H -I. -I/var/tmp/portage/sys-apps/sandbox-2.13/work/sandbox-2.13/libsandbox -I.. -I/var/tmp/portage/sys-apps/sandbox-2.13/work/sandbox-2.13 -I/var/tmp/portage/sys-apps/sandbox-2.13/work/sandbox-2.13/libsbutil -I/var/tmp/portage/sys-apps/sandbox-2.13/work/sandbox-2.13/libsbutil/include -DETCDIR=\"/etc\" -DLIBSANDBOX_PATH=\"/usr/lib32\" -DSANDBOX_BASHRC_PATH=\"/usr/share/sandbox\" -D_REENTRANT -fexceptions -march=native -O2 -pipe -Wall -Winvalid-pch -fdata-sections -ffunction-sections -fno-builtin-calloc -fno-builtin-malloc -fno-builtin-realloc -c /var/tmp/portage/sys-apps/sandbox-2.13/work/sandbox-2.13/libsandbox/canonicalize.c -fPIC -DPIC -o .libs/libsandbox_la-canonicalize.o
  698. In file included from /var/tmp/portage/sys-apps/sandbox-2.13/work/sandbox-2.13/libsandbox/wrappers.c:86:
  699. ./symbols.h:30:53: error: expected ‘)’ before numeric constant
  700. default_symbol_version(chmod_DEFAULT, chmod, GLIBC_2.0);
  701. ^~
  702. )
  703. In file included from /var/tmp/portage/sys-apps/sandbox-2.13/work/sandbox-2.13/libsandbox/wrappers.c:86:
  704. ./symbols.h:56:59: error: expected ‘)’ before numeric constant
  705. default_symbol_version(fchmodat_DEFAULT, fchmodat, GLIBC_2.4);
  706. ^~
  707. )
  708. In file included from /var/tmp/portage/sys-apps/sandbox-2.13/work/sandbox-2.13/libsandbox/wrappers.c:86:
  709. ./symbols.h:82:47: error: expected ‘)’ before numeric constant
  710. symbol_version(chown_GLIBC_2_0, chown, GLIBC_2.0);
  711. ^~
  712. )
  713. In file included from /var/tmp/portage/sys-apps/sandbox-2.13/work/sandbox-2.13/libsandbox/wrappers.c:86:
  714. ./symbols.h:108:53: error: expected ‘)’ before numeric constant
  715. default_symbol_version(chown_DEFAULT, chown, GLIBC_2.1);
  716. ^~
  717. )
  718. In file included from /var/tmp/portage/sys-apps/sandbox-2.13/work/sandbox-2.13/libsandbox/wrappers.c:86:
  719. ./symbols.h:134:59: error: expected ‘)’ before numeric constant
  720. default_symbol_version(fchownat_DEFAULT, fchownat, GLIBC_2.4);
  721. ^~
  722. )
  723. In file included from /var/tmp/portage/sys-apps/sandbox-2.13/work/sandbox-2.13/libsandbox/wrappers.c:86:
  724. ./symbols.h:160:51: error: expected ‘)’ before numeric constant
  725. default_symbol_version(open_DEFAULT, open, GLIBC_2.0);
  726. ^~
  727. )
  728. In file included from /var/tmp/portage/sys-apps/sandbox-2.13/work/sandbox-2.13/libsandbox/wrappers.c:86:
  729. ./symbols.h:186:59: error: expected ‘)’ before numeric constant
  730. default_symbol_version(__open_2_DEFAULT, __open_2, GLIBC_2.7);
  731. ^~
  732. )
  733. In file included from /var/tmp/portage/sys-apps/sandbox-2.13/work/sandbox-2.13/libsandbox/wrappers.c:86:
  734. ./symbols.h:213:55: error: expected ‘)’ before numeric constant
  735. default_symbol_version(openat_DEFAULT, openat, GLIBC_2.4);
  736. ^~
  737. )
  738. In file included from /var/tmp/portage/sys-apps/sandbox-2.13/work/sandbox-2.13/libsandbox/wrappers.c:86:
  739. ./symbols.h:239:63: error: expected ‘)’ before numeric constant
  740. default_symbol_version(__openat_2_DEFAULT, __openat_2, GLIBC_2.7);
  741. ^~
  742. )
  743. In file included from /var/tmp/portage/sys-apps/sandbox-2.13/work/sandbox-2.13/libsandbox/wrappers.c:86:
  744. ./symbols.h:265:53: error: expected ‘)’ before numeric constant
  745. default_symbol_version(creat_DEFAULT, creat, GLIBC_2.0);
  746. ^~
  747. )
  748. In file included from /var/tmp/portage/sys-apps/sandbox-2.13/work/sandbox-2.13/libsandbox/wrappers.c:86:
  749. ./symbols.h:292:53: error: expected ‘)’ before numeric constant
  750. default_symbol_version(fopen_DEFAULT, fopen, GLIBC_2.1);
  751. ^~
  752. )
  753. In file included from /var/tmp/portage/sys-apps/sandbox-2.13/work/sandbox-2.13/libsandbox/wrappers.c:86:
  754. ./symbols.h:318:47: error: expected ‘)’ before numeric constant
  755. symbol_version(fopen_GLIBC_2_0, fopen, GLIBC_2.0);
  756. ^~
  757. )
  758. In file included from /var/tmp/portage/sys-apps/sandbox-2.13/work/sandbox-2.13/libsandbox/wrappers.c:86:
  759. ./symbols.h:344:55: error: expected ‘)’ before numeric constant
  760. default_symbol_version(lchown_DEFAULT, lchown, GLIBC_2.0);
  761. ^~
  762. )
  763. In file included from /var/tmp/portage/sys-apps/sandbox-2.13/work/sandbox-2.13/libsandbox/wrappers.c:86:
  764. ./symbols.h:370:51: error: expected ‘)’ before numeric constant
  765. default_symbol_version(link_DEFAULT, link, GLIBC_2.0);
  766. ^~
  767. )
  768. In file included from /var/tmp/portage/sys-apps/sandbox-2.13/work/sandbox-2.13/libsandbox/wrappers.c:86:
  769. ./symbols.h:396:55: error: expected ‘)’ before numeric constant
  770. default_symbol_version(linkat_DEFAULT, linkat, GLIBC_2.4);
  771. ^~
  772. )
  773. In file included from /var/tmp/portage/sys-apps/sandbox-2.13/work/sandbox-2.13/libsandbox/wrappers.c:86:
  774. ./symbols.h:422:53: error: expected ‘)’ before numeric constant
  775. default_symbol_version(mkdir_DEFAULT, mkdir, GLIBC_2.0);
  776. ^~
  777. )
  778. In file included from /var/tmp/portage/sys-apps/sandbox-2.13/work/sandbox-2.13/libsandbox/wrappers.c:86:
  779. ./symbols.h:449:57: error: expected ‘)’ before numeric constant
  780. default_symbol_version(mkdirat_DEFAULT, mkdirat, GLIBC_2.4);
  781. ^~
  782. )
  783. In file included from /var/tmp/portage/sys-apps/sandbox-2.13/work/sandbox-2.13/libsandbox/wrappers.c:86:
  784. ./symbols.h:476:57: error: expected ‘)’ before numeric constant
  785. default_symbol_version(opendir_DEFAULT, opendir, GLIBC_2.0);
  786. ^~
  787. )
  788. In file included from /var/tmp/portage/sys-apps/sandbox-2.13/work/sandbox-2.13/libsandbox/wrappers.c:86:
  789. ./symbols.h:505:59: error: expected ‘)’ before numeric constant
  790. default_symbol_version(__xmknod_DEFAULT, __xmknod, GLIBC_2.0);
  791. ^~
  792. )
  793. In file included from /var/tmp/portage/sys-apps/sandbox-2.13/work/sandbox-2.13/libsandbox/wrappers.c:86:
  794. ./symbols.h:531:63: error: expected ‘)’ before numeric constant
  795. default_symbol_version(__xmknodat_DEFAULT, __xmknodat, GLIBC_2.4);
  796. ^~
  797. )
  798. In file included from /var/tmp/portage/sys-apps/sandbox-2.13/work/sandbox-2.13/libsandbox/wrappers.c:86:
  799. ./symbols.h:557:55: error: expected ‘)’ before numeric constant
  800. default_symbol_version(mkfifo_DEFAULT, mkfifo, GLIBC_2.0);
  801. ^~
  802. )
  803. In file included from /var/tmp/portage/sys-apps/sandbox-2.13/work/sandbox-2.13/libsandbox/wrappers.c:86:
  804. ./symbols.h:583:59: error: expected ‘)’ before numeric constant
  805. default_symbol_version(mkfifoat_DEFAULT, mkfifoat, GLIBC_2.4);
  806. ^~
  807. )
  808. In file included from /var/tmp/portage/sys-apps/sandbox-2.13/work/sandbox-2.13/libsandbox/wrappers.c:86:
  809. ./symbols.h:609:55: error: expected ‘)’ before numeric constant
  810. default_symbol_version(access_DEFAULT, access, GLIBC_2.0);
  811. ^~
  812. )
  813. In file included from /var/tmp/portage/sys-apps/sandbox-2.13/work/sandbox-2.13/libsandbox/wrappers.c:86:
  814. ./symbols.h:635:61: error: expected ‘)’ before numeric constant
  815. default_symbol_version(faccessat_DEFAULT, faccessat, GLIBC_2.4);
  816. ^~
  817. )
  818. In file included from /var/tmp/portage/sys-apps/sandbox-2.13/work/sandbox-2.13/libsandbox/wrappers.c:86:
  819. ./symbols.h:661:55: error: expected ‘)’ before numeric constant
  820. default_symbol_version(remove_DEFAULT, remove, GLIBC_2.0);
  821. ^~
  822. )
  823. In file included from /var/tmp/portage/sys-apps/sandbox-2.13/work/sandbox-2.13/libsandbox/wrappers.c:86:
  824. ./symbols.h:687:55: error: expected ‘)’ before numeric constant
  825. default_symbol_version(rename_DEFAULT, rename, GLIBC_2.0);
  826. ^~
  827. )
  828. In file included from /var/tmp/portage/sys-apps/sandbox-2.13/work/sandbox-2.13/libsandbox/wrappers.c:86:
  829. ./symbols.h:713:59: error: expected ‘)’ before numeric constant
  830. default_symbol_version(renameat_DEFAULT, renameat, GLIBC_2.4);
  831. ^~
  832. )
  833. In file included from /var/tmp/portage/sys-apps/sandbox-2.13/work/sandbox-2.13/libsandbox/wrappers.c:86:
  834. ./symbols.h:739:53: error: expected ‘)’ before numeric constant
  835. default_symbol_version(rmdir_DEFAULT, rmdir, GLIBC_2.0);
  836. ^~
  837. )
  838. In file included from /var/tmp/portage/sys-apps/sandbox-2.13/work/sandbox-2.13/libsandbox/wrappers.c:86:
  839. ./symbols.h:765:57: error: expected ‘)’ before numeric constant
  840. default_symbol_version(symlink_DEFAULT, symlink, GLIBC_2.0);
  841. ^~
  842. )
  843. In file included from /var/tmp/portage/sys-apps/sandbox-2.13/work/sandbox-2.13/libsandbox/wrappers.c:86:
  844. ./symbols.h:791:61: error: expected ‘)’ before numeric constant
  845. default_symbol_version(symlinkat_DEFAULT, symlinkat, GLIBC_2.4);
  846. ^~
  847. )
  848. In file included from /var/tmp/portage/sys-apps/sandbox-2.13/work/sandbox-2.13/libsandbox/wrappers.c:86:
  849. ./symbols.h:817:59: error: expected ‘)’ before numeric constant
  850. default_symbol_version(truncate_DEFAULT, truncate, GLIBC_2.0);
  851. ^~
  852. )
  853. In file included from /var/tmp/portage/sys-apps/sandbox-2.13/work/sandbox-2.13/libsandbox/wrappers.c:86:
  854. ./symbols.h:843:55: error: expected ‘)’ before numeric constant
  855. default_symbol_version(unlink_DEFAULT, unlink, GLIBC_2.0);
  856. ^~
  857. )
  858. In file included from /var/tmp/portage/sys-apps/sandbox-2.13/work/sandbox-2.13/libsandbox/wrappers.c:86:
  859. ./symbols.h:870:59: error: expected ‘)’ before numeric constant
  860. default_symbol_version(unlinkat_DEFAULT, unlinkat, GLIBC_2.4);
  861. ^~
  862. )
  863. In file included from /var/tmp/portage/sys-apps/sandbox-2.13/work/sandbox-2.13/libsandbox/wrappers.c:86:
  864. ./symbols.h:896:55: error: expected ‘)’ before numeric constant
  865. default_symbol_version(getcwd_DEFAULT, getcwd, GLIBC_2.0);
  866. ^~
  867. )
  868. In file included from /var/tmp/portage/sys-apps/sandbox-2.13/work/sandbox-2.13/libsandbox/wrappers.c:86:
  869. ./symbols.h:922:55: error: expected ‘)’ before numeric constant
  870. default_symbol_version(open64_DEFAULT, open64, GLIBC_2.1);
  871. ^~
  872. )
  873. In file included from /var/tmp/portage/sys-apps/sandbox-2.13/work/sandbox-2.13/libsandbox/wrappers.c:86:
  874. ./symbols.h:948:63: error: expected ‘)’ before numeric constant
  875. default_symbol_version(__open64_2_DEFAULT, __open64_2, GLIBC_2.7);
  876. ^~
  877. )
  878. In file included from /var/tmp/portage/sys-apps/sandbox-2.13/work/sandbox-2.13/libsandbox/wrappers.c:86:
  879. ./symbols.h:975:59: error: expected ‘)’ before numeric constant
  880. default_symbol_version(openat64_DEFAULT, openat64, GLIBC_2.4);
  881. ^~
  882. )
  883. In file included from /var/tmp/portage/sys-apps/sandbox-2.13/work/sandbox-2.13/libsandbox/wrappers.c:86:
  884. ./symbols.h:1001:67: error: expected ‘)’ before numeric constant
  885. default_symbol_version(__openat64_2_DEFAULT, __openat64_2, GLIBC_2.7);
  886. ^~
  887. )
  888. In file included from /var/tmp/portage/sys-apps/sandbox-2.13/work/sandbox-2.13/libsandbox/wrappers.c:86:
  889. ./symbols.h:1027:57: error: expected ‘)’ before numeric constant
  890. default_symbol_version(creat64_DEFAULT, creat64, GLIBC_2.1);
  891. ^~
  892. )
  893. In file included from /var/tmp/portage/sys-apps/sandbox-2.13/work/sandbox-2.13/libsandbox/wrappers.c:86:
  894. ./symbols.h:1054:57: error: expected ‘)’ before numeric constant
  895. default_symbol_version(fopen64_DEFAULT, fopen64, GLIBC_2.1);
  896. ^~
  897. )
  898. In file included from /var/tmp/portage/sys-apps/sandbox-2.13/work/sandbox-2.13/libsandbox/wrappers.c:86:
  899. ./symbols.h:1080:63: error: expected ‘)’ before numeric constant
  900. default_symbol_version(truncate64_DEFAULT, truncate64, GLIBC_2.1);
  901. ^~
  902. )
  903. In file included from /var/tmp/portage/sys-apps/sandbox-2.13/work/sandbox-2.13/libsandbox/wrappers.c:86:
  904. ./symbols.h:1106:57: error: expected ‘)’ before numeric constant
  905. default_symbol_version(mkdtemp_DEFAULT, mkdtemp, GLIBC_2.2);
  906. ^~
  907. )
  908. In file included from /var/tmp/portage/sys-apps/sandbox-2.13/work/sandbox-2.13/libsandbox/wrappers.c:86:
  909. ./symbols.h:1132:59: error: expected ‘)’ before numeric constant
  910. default_symbol_version(mkostemp_DEFAULT, mkostemp, GLIBC_2.7);
  911. ^~
  912. )
  913. In file included from /var/tmp/portage/sys-apps/sandbox-2.13/work/sandbox-2.13/libsandbox/wrappers.c:86:
  914. ./symbols.h:1158:63: error: expected ‘)’ before numeric constant
  915. default_symbol_version(mkostemp64_DEFAULT, mkostemp64, GLIBC_2.7);
  916. ^~
  917. )
  918. In file included from /var/tmp/portage/sys-apps/sandbox-2.13/work/sandbox-2.13/libsandbox/wrappers.c:86:
  919. ./symbols.h:1184:61: error: expected ‘)’ before numeric constant
  920. default_symbol_version(mkostemps_DEFAULT, mkostemps, GLIBC_2.11);
  921. ^~~
  922. )
  923. In file included from /var/tmp/portage/sys-apps/sandbox-2.13/work/sandbox-2.13/libsandbox/wrappers.c:86:
  924. ./symbols.h:1210:65: error: expected ‘)’ before numeric constant
  925. default_symbol_version(mkostemps64_DEFAULT, mkostemps64, GLIBC_2.11);
  926. ^~~
  927. )
  928. In file included from /var/tmp/portage/sys-apps/sandbox-2.13/work/sandbox-2.13/libsandbox/wrappers.c:86:
  929. ./symbols.h:1236:57: error: expected ‘)’ before numeric constant
  930. default_symbol_version(mkstemp_DEFAULT, mkstemp, GLIBC_2.0);
  931. ^~
  932. )
  933. In file included from /var/tmp/portage/sys-apps/sandbox-2.13/work/sandbox-2.13/libsandbox/wrappers.c:86:
  934. ./symbols.h:1262:61: error: expected ‘)’ before numeric constant
  935. default_symbol_version(mkstemp64_DEFAULT, mkstemp64, GLIBC_2.2);
  936. ^~
  937. )
  938. In file included from /var/tmp/portage/sys-apps/sandbox-2.13/work/sandbox-2.13/libsandbox/wrappers.c:86:
  939. ./symbols.h:1288:59: error: expected ‘)’ before numeric constant
  940. default_symbol_version(mkstemps_DEFAULT, mkstemps, GLIBC_2.11);
  941. ^~~
  942. )
  943. In file included from /var/tmp/portage/sys-apps/sandbox-2.13/work/sandbox-2.13/libsandbox/wrappers.c:86:
  944. ./symbols.h:1314:63: error: expected ‘)’ before numeric constant
  945. default_symbol_version(mkstemps64_DEFAULT, mkstemps64, GLIBC_2.11);
  946. ^~~
  947. )
  948. In file included from /var/tmp/portage/sys-apps/sandbox-2.13/work/sandbox-2.13/libsandbox/wrappers.c:86:
  949. ./symbols.h:1340:53: error: expected ‘)’ before numeric constant
  950. default_symbol_version(execv_DEFAULT, execv, GLIBC_2.0);
  951. ^~
  952. )
  953. In file included from /var/tmp/portage/sys-apps/sandbox-2.13/work/sandbox-2.13/libsandbox/wrappers.c:86:
  954. ./symbols.h:1366:55: error: expected ‘)’ before numeric constant
  955. default_symbol_version(execve_DEFAULT, execve, GLIBC_2.0);
  956. ^~
  957. )
  958. In file included from /var/tmp/portage/sys-apps/sandbox-2.13/work/sandbox-2.13/libsandbox/wrappers.c:86:
  959. ./symbols.h:1393:55: error: expected ‘)’ before numeric constant
  960. default_symbol_version(execvp_DEFAULT, execvp, GLIBC_2.0);
  961. ^~
  962. )
  963. In file included from /var/tmp/portage/sys-apps/sandbox-2.13/work/sandbox-2.13/libsandbox/wrappers.c:86:
  964. ./symbols.h:1419:57: error: expected ‘)’ before numeric constant
  965. default_symbol_version(execvpe_DEFAULT, execvpe, GLIBC_2.11);
  966. ^~~
  967. )
  968. In file included from /var/tmp/portage/sys-apps/sandbox-2.13/work/sandbox-2.13/libsandbox/wrappers.c:86:
  969. ./symbols.h:1445:57: error: expected ‘)’ before numeric constant
  970. default_symbol_version(fexecve_DEFAULT, fexecve, GLIBC_2.0);
  971. ^~
  972. )
  973. In file included from /var/tmp/portage/sys-apps/sandbox-2.13/work/sandbox-2.13/libsandbox/wrappers.c:86:
  974. ./symbols.h:1471:55: error: expected ‘)’ before numeric constant
  975. default_symbol_version(system_DEFAULT, system, GLIBC_2.0);
  976. ^~
  977. )
  978. In file included from /var/tmp/portage/sys-apps/sandbox-2.13/work/sandbox-2.13/libsandbox/wrappers.c:86:
  979. ./symbols.h:1497:47: error: expected ‘)’ before numeric constant
  980. symbol_version(popen_GLIBC_2_0, popen, GLIBC_2.0);
  981. ^~
  982. )
  983. In file included from /var/tmp/portage/sys-apps/sandbox-2.13/work/sandbox-2.13/libsandbox/wrappers.c:86:
  984. ./symbols.h:1523:53: error: expected ‘)’ before numeric constant
  985. default_symbol_version(popen_DEFAULT, popen, GLIBC_2.1);
  986. ^~
  987. )
  988. In file included from /var/tmp/portage/sys-apps/sandbox-2.13/work/sandbox-2.13/libsandbox/wrappers.c:86:
  989. ./symbols.h:1549:53: error: expected ‘)’ before numeric constant
  990. default_symbol_version(utime_DEFAULT, utime, GLIBC_2.0);
  991. ^~
  992. )
  993. In file included from /var/tmp/portage/sys-apps/sandbox-2.13/work/sandbox-2.13/libsandbox/wrappers.c:86:
  994. ./symbols.h:1575:55: error: expected ‘)’ before numeric constant
  995. default_symbol_version(utimes_DEFAULT, utimes, GLIBC_2.0);
  996. ^~
  997. )
  998. In file included from /var/tmp/portage/sys-apps/sandbox-2.13/work/sandbox-2.13/libsandbox/wrappers.c:86:
  999. ./symbols.h:1601:61: error: expected ‘)’ before numeric constant
  1000. default_symbol_version(utimensat_DEFAULT, utimensat, GLIBC_2.6);
  1001. ^~
  1002. )
  1003. In file included from /var/tmp/portage/sys-apps/sandbox-2.13/work/sandbox-2.13/libsandbox/wrappers.c:86:
  1004. ./symbols.h:1627:61: error: expected ‘)’ before numeric constant
  1005. default_symbol_version(futimesat_DEFAULT, futimesat, GLIBC_2.4);
  1006. ^~
  1007. )
  1008. In file included from /var/tmp/portage/sys-apps/sandbox-2.13/work/sandbox-2.13/libsandbox/wrappers.c:86:
  1009. ./symbols.h:1653:57: error: expected ‘)’ before numeric constant
  1010. default_symbol_version(lutimes_DEFAULT, lutimes, GLIBC_2.3);
  1011. ^~
  1012. )
  1013. In file included from /var/tmp/portage/sys-apps/sandbox-2.13/work/sandbox-2.13/libsandbox/wrappers.c:86:
  1014. ./symbols.h:1679:51: error: expected ‘)’ before numeric constant
  1015. default_symbol_version(fork_DEFAULT, fork, GLIBC_2.0);
  1016. ^~
  1017. )
  1018. make[2]: *** [Makefile:531: libsandbox_la-wrappers.lo] Error 1
  1019. make[2]: *** Waiting for unfinished jobs....
  1020. /var/tmp/portage/sys-apps/sandbox-2.13/work/sandbox-2.13/libsandbox/canonicalize.c: In function ‘erealpath’:
  1021. /var/tmp/portage/sys-apps/sandbox-2.13/work/sandbox-2.13/libsandbox/canonicalize.c:113:6: warning: passing argument 2 to restrict-qualified parameter aliases with argument 1 [-Wrestrict]
  1022. ssize_t cnt = readlink(rpath, rpath, path_max);
  1023. ^~~~~~~
  1024. make[1]: *** [Makefile:484: all-recursive] Error 1
  1025. make: *** [Makefile:396: all] Error 2
  1026. * ERROR: sys-apps/sandbox-2.13::gentoo failed (compile phase):
  1027. * emake failed
  1028. *
  1029. * If you need support, post the output of `emerge --info '=sys-apps/sandbox-2.13::gentoo'`,
  1030. * the complete build log and the output of `emerge -pqv '=sys-apps/sandbox-2.13::gentoo'`.
  1031. * The complete build log is located at '/var/tmp/portage/sys-apps/sandbox-2.13/temp/build.log'.
  1032. * The ebuild environment file is located at '/var/tmp/portage/sys-apps/sandbox-2.13/temp/environment'.
  1033. * Working directory: '/var/tmp/portage/sys-apps/sandbox-2.13/work/sandbox-2.13-abi_x86_32.x86'
  1034. * S: '/var/tmp/portage/sys-apps/sandbox-2.13/work/sandbox-2.13'
  1035. * If configure failed with a 'cannot run C compiled programs' error, try this:
  1036. * FEATURES='-sandbox -usersandbox' emerge sandbox
RAW Paste Data