daily pastebin goal
61%
SHARE
TWEET

Untitled

a guest Feb 23rd, 2019 65 Never
Not a member of Pastebin yet? Sign Up, it unlocks many cool features!
  1. [ 73%] Building CXX object brick/CMakeFiles/brick.dir/request_util.cc.o
  2. [ 74%] Building CXX object brick/CMakeFiles/brick.dir/avatar_client.cc.o
  3. [ 75%] Building CXX object brick/CMakeFiles/brick.dir/download_client.cc.o
  4. [ 75%] Building CXX object brick/CMakeFiles/brick.dir/client_handler_linux.cc.o
  5. In file included from /usr/include/gtk-2.0/gtk/gtk.h:89,
  6.                  from /tmp/yay/brick/src/brick-0.2.11.34/brick/client_handler_linux.cc:5:
  7. /usr/include/gtk-2.0/gtk/gtkfilechooserbutton.h:59:8: ошибка: unnecessary parentheses in declaration of «__gtk_reserved1» [-Werror=parentheses]
  8.    void (*__gtk_reserved1);
  9.         ^
  10. /usr/include/gtk-2.0/gtk/gtkfilechooserbutton.h:60:8: ошибка: unnecessary parentheses in declaration of «__gtk_reserved2» [-Werror=parentheses]
  11.    void (*__gtk_reserved2);
  12.         ^
  13. /usr/include/gtk-2.0/gtk/gtkfilechooserbutton.h:61:8: ошибка: unnecessary parentheses in declaration of «__gtk_reserved3» [-Werror=parentheses]
  14.    void (*__gtk_reserved3);
  15.         ^
  16. /usr/include/gtk-2.0/gtk/gtkfilechooserbutton.h:62:8: ошибка: unnecessary parentheses in declaration of «__gtk_reserved4» [-Werror=parentheses]
  17.    void (*__gtk_reserved4);
  18.         ^
  19. /usr/include/gtk-2.0/gtk/gtkfilechooserbutton.h:63:8: ошибка: unnecessary parentheses in declaration of «__gtk_reserved5» [-Werror=parentheses]
  20.    void (*__gtk_reserved5);
  21.         ^
  22. /usr/include/gtk-2.0/gtk/gtkfilechooserbutton.h:64:8: ошибка: unnecessary parentheses in declaration of «__gtk_reserved6» [-Werror=parentheses]
  23.    void (*__gtk_reserved6);
  24.         ^
  25. /usr/include/gtk-2.0/gtk/gtkfilechooserbutton.h:65:8: ошибка: unnecessary parentheses in declaration of «__gtk_reserved7» [-Werror=parentheses]
  26.    void (*__gtk_reserved7);
  27.         ^
  28. In file included from /usr/include/gtk-2.0/gtk/gtk.h:173,
  29.                  from /tmp/yay/brick/src/brick-0.2.11.34/brick/client_handler_linux.cc:5:
  30. /usr/include/gtk-2.0/gtk/gtkstatusicon.h:76:8: ошибка: unnecessary parentheses in declaration of «__gtk_reserved1» [-Werror=parentheses]
  31.    void (*__gtk_reserved1);
  32.         ^
  33. /usr/include/gtk-2.0/gtk/gtkstatusicon.h:77:8: ошибка: unnecessary parentheses in declaration of «__gtk_reserved2» [-Werror=parentheses]
  34.    void (*__gtk_reserved2);
  35.         ^
  36. cc1plus: все предупреждения считаются ошибками
  37. make[2]: *** [brick/CMakeFiles/brick.dir/build.make:209: brick/CMakeFiles/brick.dir/client_handler_linux.cc.o] Ошибка 1
  38. make[1]: *** [CMakeFiles/Makefile2:146: brick/CMakeFiles/brick.dir/all] Ошибка 2
  39. make: *** [Makefile:130: all] Ошибка 2
  40. ==> ОШИБКА: Произошел сбой в build().
  41.     Прерывание...
  42. Error making: brick
RAW Paste Data
We use cookies for various purposes including analytics. By continuing to use Pastebin, you agree to our use of cookies as described in the Cookies Policy. OK, I Understand
 
Top