Advertisement
Guest User

logs

a guest
Dec 25th, 2021
20
Never
Not a member of Pastebin yet? Sign Up, it unlocks many cool features!
  1. Testing started at 21:48 ...
  2. Running locally...
  3. log4j:WARN No appenders could be found for logger (io.netty.util.internal.logging.InternalLoggerFactory).
  4. log4j:WARN Please initialize the log4j system properly.
  5. Starting ChromeDriver 90.0.4430.24 (4c6d850f087da467d926e8eddb76550aed655991-refs/branch-heads/4430@{#429}) on port 22135
  6. Only local connections are allowed.
  7. Please see https://chromedriver.chromium.org/security-considerations for suggestions on keeping ChromeDriver safe.
  8. ChromeDriver was started successfully.
  9.  
  10. Step failed
  11. io.cucumber.core.exception.CucumberException: Failed to instantiate class org.openmrs.contrib.qaframework.automation.ClinicalVisitSteps
  12. at io.cucumber.core.runtime.ObjectFactoryServiceLoader$DefaultJavaObjectFactory.cacheNewInstance(ObjectFactoryServiceLoader.java:140)
  13. at io.cucumber.core.runtime.ObjectFactoryServiceLoader$DefaultJavaObjectFactory.getInstance(ObjectFactoryServiceLoader.java:124)
  14. at io.cucumber.java.AbstractGlueDefinition.invokeMethod(AbstractGlueDefinition.java:47)
  15. at io.cucumber.java.JavaHookDefinition.execute(JavaHookDefinition.java:59)
  16. at io.cucumber.core.runner.CoreHookDefinition.execute(CoreHookDefinition.java:46)
  17. at io.cucumber.core.runner.HookDefinitionMatch.runStep(HookDefinitionMatch.java:21)
  18. at io.cucumber.core.runner.ExecutionMode$1.execute(ExecutionMode.java:10)
  19. at io.cucumber.core.runner.TestStep.executeStep(TestStep.java:92)
  20. at io.cucumber.core.runner.TestStep.run(TestStep.java:64)
  21. at io.cucumber.core.runner.TestCase.run(TestCase.java:98)
  22. at io.cucumber.core.runner.Runner.runPickle(Runner.java:71)
  23. at io.cucumber.core.runtime.Runtime.lambda$execute$5(Runtime.java:110)
  24. at io.cucumber.core.runtime.CucumberExecutionContext.runTestCase(CucumberExecutionContext.java:117)
  25. at io.cucumber.core.runtime.Runtime.lambda$execute$6(Runtime.java:110)
  26. at java.util.concurrent.Executors$RunnableAdapter.call(Executors.java:511)
  27. at java.util.concurrent.FutureTask.run(FutureTask.java:266)
  28. at io.cucumber.core.runtime.Runtime$SameThreadExecutorService.execute(Runtime.java:233)
  29. at java.util.concurrent.AbstractExecutorService.submit(AbstractExecutorService.java:112)
  30. at io.cucumber.core.runtime.Runtime.lambda$run$2(Runtime.java:86)
  31. at java.util.stream.ReferencePipeline$3$1.accept(ReferencePipeline.java:193)
  32. at java.util.stream.SliceOps$1$1.accept(SliceOps.java:204)
  33. at java.util.ArrayList$ArrayListSpliterator.tryAdvance(ArrayList.java:1361)
  34. at java.util.stream.ReferencePipeline.forEachWithCancel(ReferencePipeline.java:126)
  35. at java.util.stream.AbstractPipeline.copyIntoWithCancel(AbstractPipeline.java:499)
  36. at java.util.stream.AbstractPipeline.copyInto(AbstractPipeline.java:486)
  37. at java.util.stream.AbstractPipeline.wrapAndCopyInto(AbstractPipeline.java:472)
  38. at java.util.stream.ReduceOps$ReduceOp.evaluateSequential(ReduceOps.java:708)
  39. at java.util.stream.AbstractPipeline.evaluate(AbstractPipeline.java:234)
  40. at java.util.stream.ReferencePipeline.collect(ReferencePipeline.java:566)
  41. at io.cucumber.core.runtime.Runtime.run(Runtime.java:87)
  42. at io.cucumber.core.cli.Main.run(Main.java:79)
  43. at io.cucumber.core.cli.Main.main(Main.java:33)
  44. Caused by: java.lang.reflect.InvocationTargetException
  45. at sun.reflect.NativeConstructorAccessorImpl.newInstance0(Native Method)
  46. at sun.reflect.NativeConstructorAccessorImpl.newInstance(NativeConstructorAccessorImpl.java:62)
  47. at sun.reflect.DelegatingConstructorAccessorImpl.newInstance(DelegatingConstructorAccessorImpl.java:45)
  48. at java.lang.reflect.Constructor.newInstance(Constructor.java:423)
  49. at io.cucumber.core.runtime.ObjectFactoryServiceLoader$DefaultJavaObjectFactory.cacheNewInstance(ObjectFactoryServiceLoader.java:132)
  50. ... 31 more
  51. Caused by: java.lang.AssertionError: session not created: This version of ChromeDriver only supports Chrome version 90
  52. Current browser version is 96.0.4664.110 with binary path /usr/bin/google-chrome
  53. Build info: version: '4.0.0-alpha-6', revision: '5f43a29cfc'
  54. System info: host: 'ndacyayisenga-ThinkPad-S5-S540', ip: '127.0.1.1', os.name: 'Linux', os.arch: 'amd64', os.version: '5.11.0-43-generic', java.version: '1.8.0_312'
  55. Driver info: driver.version: ChromeDriver
  56. remote stacktrace: #0 0x55a06d3c9e89 <unknown>
  57.  
  58. at org.junit.Assert.fail(Assert.java:89)
  59. at org.openmrs.contrib.qaframework.automation.Steps.<init>(Steps.java:47)
  60. at org.openmrs.contrib.qaframework.automation.ClinicalVisitSteps.<init>(ClinicalVisitSteps.java:37)
  61. ... 36 more
  62.  
  63.  
  64. Step skipped
  65.  
  66. Step skipped
  67.  
  68. Step skipped
  69.  
  70. Step skipped
  71.  
  72. Step skipped
  73.  
  74. Step skipped
  75.  
  76. Step skipped
  77.  
  78. Step skipped
  79.  
  80. Step skipped
  81.  
  82. Step skipped
  83.  
  84. Step skipped
  85.  
  86. Step skipped
  87.  
  88. Step skipped
  89.  
  90. Step skipped
  91.  
  92. Step skipped
  93.  
  94. Step skipped
  95.  
  96. Step skipped
  97.  
  98. Step skipped
  99.  
  100. Step skipped
  101.  
  102. Step skipped
  103.  
  104. Step skipped
  105.  
  106. Step skipped
  107.  
  108. Step skipped
  109.  
  110. Step skipped
  111.  
  112. Step skipped
  113.  
  114. Step skipped
  115.  
  116. Step skipped
  117.  
  118. Step skipped
  119.  
  120. Step skipped
  121.  
  122. Step skipped
  123.  
  124. Step skipped
  125.  
  126. Step skipped
  127.  
  128. Step skipped
  129.  
  130. Step skipped
  131.  
  132. Step skipped
  133.  
  134. Step skipped
  135.  
  136. Step skipped
  137.  
  138. Step skipped
  139.  
  140. Step skipped
  141. Running locally...
  142. Starting ChromeDriver 90.0.4430.24 (4c6d850f087da467d926e8eddb76550aed655991-refs/branch-heads/4430@{#429}) on port 11984
  143. Only local connections are allowed.
  144. Please see https://chromedriver.chromium.org/security-considerations for suggestions on keeping ChromeDriver safe.
  145. ChromeDriver was started successfully.
  146.  
  147. Step failed
  148. io.cucumber.core.exception.CucumberException: Failed to instantiate class org.openmrs.contrib.qaframework.automation.ClinicalVisitSteps
  149. at io.cucumber.core.runtime.ObjectFactoryServiceLoader$DefaultJavaObjectFactory.cacheNewInstance(ObjectFactoryServiceLoader.java:140)
  150. at io.cucumber.core.runtime.ObjectFactoryServiceLoader$DefaultJavaObjectFactory.getInstance(ObjectFactoryServiceLoader.java:124)
  151. at io.cucumber.java.AbstractGlueDefinition.invokeMethod(AbstractGlueDefinition.java:47)
  152. at io.cucumber.java.JavaHookDefinition.execute(JavaHookDefinition.java:59)
  153. at io.cucumber.core.runner.CoreHookDefinition.execute(CoreHookDefinition.java:46)
  154. at io.cucumber.core.runner.HookDefinitionMatch.runStep(HookDefinitionMatch.java:21)
  155. at io.cucumber.core.runner.ExecutionMode$1.execute(ExecutionMode.java:10)
  156. at io.cucumber.core.runner.TestStep.executeStep(TestStep.java:92)
  157. at io.cucumber.core.runner.TestStep.run(TestStep.java:64)
  158. at io.cucumber.core.runner.TestCase.run(TestCase.java:110)
  159. at io.cucumber.core.runner.Runner.runPickle(Runner.java:71)
  160. at io.cucumber.core.runtime.Runtime.lambda$execute$5(Runtime.java:110)
  161. at io.cucumber.core.runtime.CucumberExecutionContext.runTestCase(CucumberExecutionContext.java:117)
  162. at io.cucumber.core.runtime.Runtime.lambda$execute$6(Runtime.java:110)
  163. at java.util.concurrent.Executors$RunnableAdapter.call(Executors.java:511)
  164. at java.util.concurrent.FutureTask.run(FutureTask.java:266)
  165. at io.cucumber.core.runtime.Runtime$SameThreadExecutorService.execute(Runtime.java:233)
  166. at java.util.concurrent.AbstractExecutorService.submit(AbstractExecutorService.java:112)
  167. at io.cucumber.core.runtime.Runtime.lambda$run$2(Runtime.java:86)
  168. at java.util.stream.ReferencePipeline$3$1.accept(ReferencePipeline.java:193)
  169. at java.util.stream.SliceOps$1$1.accept(SliceOps.java:204)
  170. at java.util.ArrayList$ArrayListSpliterator.tryAdvance(ArrayList.java:1361)
  171. at java.util.stream.ReferencePipeline.forEachWithCancel(ReferencePipeline.java:126)
  172. at java.util.stream.AbstractPipeline.copyIntoWithCancel(AbstractPipeline.java:499)
  173. at java.util.stream.AbstractPipeline.copyInto(AbstractPipeline.java:486)
  174. at java.util.stream.AbstractPipeline.wrapAndCopyInto(AbstractPipeline.java:472)
  175. at java.util.stream.ReduceOps$ReduceOp.evaluateSequential(ReduceOps.java:708)
  176. at java.util.stream.AbstractPipeline.evaluate(AbstractPipeline.java:234)
  177. at java.util.stream.ReferencePipeline.collect(ReferencePipeline.java:566)
  178. at io.cucumber.core.runtime.Runtime.run(Runtime.java:87)
  179. at io.cucumber.core.cli.Main.run(Main.java:79)
  180. at io.cucumber.core.cli.Main.main(Main.java:33)
  181. Caused by: java.lang.reflect.InvocationTargetException
  182. at sun.reflect.NativeConstructorAccessorImpl.newInstance0(Native Method)
  183. at sun.reflect.NativeConstructorAccessorImpl.newInstance(NativeConstructorAccessorImpl.java:62)
  184. at sun.reflect.DelegatingConstructorAccessorImpl.newInstance(DelegatingConstructorAccessorImpl.java:45)
  185. at java.lang.reflect.Constructor.newInstance(Constructor.java:423)
  186. at io.cucumber.core.runtime.ObjectFactoryServiceLoader$DefaultJavaObjectFactory.cacheNewInstance(ObjectFactoryServiceLoader.java:132)
  187. ... 31 more
  188. Caused by: java.lang.AssertionError: session not created: This version of ChromeDriver only supports Chrome version 90
  189. Current browser version is 96.0.4664.110 with binary path /usr/bin/google-chrome
  190. Build info: version: '4.0.0-alpha-6', revision: '5f43a29cfc'
  191. System info: host: 'ndacyayisenga-ThinkPad-S5-S540', ip: '127.0.1.1', os.name: 'Linux', os.arch: 'amd64', os.version: '5.11.0-43-generic', java.version: '1.8.0_312'
  192. Driver info: driver.version: ChromeDriver
  193. remote stacktrace: #0 0x5590e780ce89 <unknown>
  194.  
  195. at org.junit.Assert.fail(Assert.java:89)
  196. at org.openmrs.contrib.qaframework.automation.Steps.<init>(Steps.java:47)
  197. at org.openmrs.contrib.qaframework.automation.ClinicalVisitSteps.<init>(ClinicalVisitSteps.java:37)
  198. ... 36 more
  199.  
  200. Running locally...
  201. Starting ChromeDriver 90.0.4430.24 (4c6d850f087da467d926e8eddb76550aed655991-refs/branch-heads/4430@{#429}) on port 15290
  202. Only local connections are allowed.
  203. Please see https://chromedriver.chromium.org/security-considerations for suggestions on keeping ChromeDriver safe.
  204. ChromeDriver was started successfully.
  205.  
  206. Step failed
  207. io.cucumber.core.exception.CucumberException: Failed to instantiate class org.openmrs.contrib.qaframework.automation.LoginSteps
  208. at io.cucumber.core.runtime.ObjectFactoryServiceLoader$DefaultJavaObjectFactory.cacheNewInstance(ObjectFactoryServiceLoader.java:140)
  209. at io.cucumber.core.runtime.ObjectFactoryServiceLoader$DefaultJavaObjectFactory.getInstance(ObjectFactoryServiceLoader.java:124)
  210. at io.cucumber.java.AbstractGlueDefinition.invokeMethod(AbstractGlueDefinition.java:47)
  211. at io.cucumber.java.JavaHookDefinition.execute(JavaHookDefinition.java:59)
  212. at io.cucumber.core.runner.CoreHookDefinition.execute(CoreHookDefinition.java:46)
  213. at io.cucumber.core.runner.HookDefinitionMatch.runStep(HookDefinitionMatch.java:21)
  214. at io.cucumber.core.runner.ExecutionMode$1.execute(ExecutionMode.java:10)
  215. at io.cucumber.core.runner.TestStep.executeStep(TestStep.java:92)
  216. at io.cucumber.core.runner.TestStep.run(TestStep.java:64)
  217. at io.cucumber.core.runner.TestCase.run(TestCase.java:110)
  218. at io.cucumber.core.runner.Runner.runPickle(Runner.java:71)
  219. at io.cucumber.core.runtime.Runtime.lambda$execute$5(Runtime.java:110)
  220. at io.cucumber.core.runtime.CucumberExecutionContext.runTestCase(CucumberExecutionContext.java:117)
  221. at io.cucumber.core.runtime.Runtime.lambda$execute$6(Runtime.java:110)
  222. at java.util.concurrent.Executors$RunnableAdapter.call(Executors.java:511)
  223. at java.util.concurrent.FutureTask.run(FutureTask.java:266)
  224. at io.cucumber.core.runtime.Runtime$SameThreadExecutorService.execute(Runtime.java:233)
  225. at java.util.concurrent.AbstractExecutorService.submit(AbstractExecutorService.java:112)
  226. at io.cucumber.core.runtime.Runtime.lambda$run$2(Runtime.java:86)
  227. at java.util.stream.ReferencePipeline$3$1.accept(ReferencePipeline.java:193)
  228. at java.util.stream.SliceOps$1$1.accept(SliceOps.java:204)
  229. at java.util.ArrayList$ArrayListSpliterator.tryAdvance(ArrayList.java:1361)
  230. at java.util.stream.ReferencePipeline.forEachWithCancel(ReferencePipeline.java:126)
  231. at java.util.stream.AbstractPipeline.copyIntoWithCancel(AbstractPipeline.java:499)
  232. at java.util.stream.AbstractPipeline.copyInto(AbstractPipeline.java:486)
  233. at java.util.stream.AbstractPipeline.wrapAndCopyInto(AbstractPipeline.java:472)
  234. at java.util.stream.ReduceOps$ReduceOp.evaluateSequential(ReduceOps.java:708)
  235. at java.util.stream.AbstractPipeline.evaluate(AbstractPipeline.java:234)
  236. at java.util.stream.ReferencePipeline.collect(ReferencePipeline.java:566)
  237. at io.cucumber.core.runtime.Runtime.run(Runtime.java:87)
  238. at io.cucumber.core.cli.Main.run(Main.java:79)
  239. at io.cucumber.core.cli.Main.main(Main.java:33)
  240. Caused by: java.lang.reflect.InvocationTargetException
  241. at sun.reflect.NativeConstructorAccessorImpl.newInstance0(Native Method)
  242. at sun.reflect.NativeConstructorAccessorImpl.newInstance(NativeConstructorAccessorImpl.java:62)
  243. at sun.reflect.DelegatingConstructorAccessorImpl.newInstance(DelegatingConstructorAccessorImpl.java:45)
  244. at java.lang.reflect.Constructor.newInstance(Constructor.java:423)
  245. at io.cucumber.core.runtime.ObjectFactoryServiceLoader$DefaultJavaObjectFactory.cacheNewInstance(ObjectFactoryServiceLoader.java:132)
  246. ... 31 more
  247. Caused by: java.lang.AssertionError: session not created: This version of ChromeDriver only supports Chrome version 90
  248. Current browser version is 96.0.4664.110 with binary path /usr/bin/google-chrome
  249. Build info: version: '4.0.0-alpha-6', revision: '5f43a29cfc'
  250. System info: host: 'ndacyayisenga-ThinkPad-S5-S540', ip: '127.0.1.1', os.name: 'Linux', os.arch: 'amd64', os.version: '5.11.0-43-generic', java.version: '1.8.0_312'
  251. Driver info: driver.version: ChromeDriver
  252. remote stacktrace: #0 0x5652f06a0e89 <unknown>
  253.  
  254. at org.junit.Assert.fail(Assert.java:89)
  255. at org.openmrs.contrib.qaframework.automation.Steps.<init>(Steps.java:47)
  256. at org.openmrs.contrib.qaframework.automation.LoginSteps.<init>(LoginSteps.java:24)
  257. ... 36 more
  258.  
  259.  
  260. Failed scenarios:
  261. file:///home/ndacyayisenga/new/openmrs-contrib-qaframework/qaframework-bdd-tests/src/test/resources/features/refapp-2.x/14-clinicalVisit/clinicalVisit.feature:10# Clinical Visit
  262.  
  263. 1 Scenarios (1 failed)
  264. 39 Steps (39 skipped)
  265. 0m4.734s
  266.  
  267.  
  268. io.cucumber.core.exception.CucumberException: Failed to instantiate class org.openmrs.contrib.qaframework.automation.ClinicalVisitSteps
  269. at io.cucumber.core.runtime.ObjectFactoryServiceLoader$DefaultJavaObjectFactory.cacheNewInstance(ObjectFactoryServiceLoader.java:140)
  270. at io.cucumber.core.runtime.ObjectFactoryServiceLoader$DefaultJavaObjectFactory.getInstance(ObjectFactoryServiceLoader.java:124)
  271. at io.cucumber.java.AbstractGlueDefinition.invokeMethod(AbstractGlueDefinition.java:47)
  272. at io.cucumber.java.JavaHookDefinition.execute(JavaHookDefinition.java:59)
  273. at io.cucumber.core.runner.CoreHookDefinition.execute(CoreHookDefinition.java:46)
  274. at io.cucumber.core.runner.HookDefinitionMatch.runStep(HookDefinitionMatch.java:21)
  275. at io.cucumber.core.runner.ExecutionMode$1.execute(ExecutionMode.java:10)
  276. at io.cucumber.core.runner.TestStep.executeStep(TestStep.java:92)
  277. at io.cucumber.core.runner.TestStep.run(TestStep.java:64)
  278. at io.cucumber.core.runner.TestCase.run(TestCase.java:98)
  279. at io.cucumber.core.runner.Runner.runPickle(Runner.java:71)
  280. at io.cucumber.core.runtime.Runtime.lambda$execute$5(Runtime.java:110)
  281. at io.cucumber.core.runtime.CucumberExecutionContext.runTestCase(CucumberExecutionContext.java:117)
  282. at io.cucumber.core.runtime.Runtime.lambda$execute$6(Runtime.java:110)
  283. at java.util.concurrent.Executors$RunnableAdapter.call(Executors.java:511)
  284. at java.util.concurrent.FutureTask.run(FutureTask.java:266)
  285. at io.cucumber.core.runtime.Runtime$SameThreadExecutorService.execute(Runtime.java:233)
  286. at java.util.concurrent.AbstractExecutorService.submit(AbstractExecutorService.java:112)
  287. at io.cucumber.core.runtime.Runtime.lambda$run$2(Runtime.java:86)
  288. at java.util.stream.ReferencePipeline$3$1.accept(ReferencePipeline.java:193)
  289. at java.util.stream.SliceOps$1$1.accept(SliceOps.java:204)
  290. at java.util.ArrayList$ArrayListSpliterator.tryAdvance(ArrayList.java:1361)
  291. at java.util.stream.ReferencePipeline.forEachWithCancel(ReferencePipeline.java:126)
  292. at java.util.stream.AbstractPipeline.copyIntoWithCancel(AbstractPipeline.java:499)
  293. at java.util.stream.AbstractPipeline.copyInto(AbstractPipeline.java:486)
  294. at java.util.stream.AbstractPipeline.wrapAndCopyInto(AbstractPipeline.java:472)
  295. at java.util.stream.ReduceOps$ReduceOp.evaluateSequential(ReduceOps.java:708)
  296. at java.util.stream.AbstractPipeline.evaluate(AbstractPipeline.java:234)
  297. at java.util.stream.ReferencePipeline.collect(ReferencePipeline.java:566)
  298. at io.cucumber.core.runtime.Runtime.run(Runtime.java:87)
  299. at io.cucumber.core.cli.Main.run(Main.java:79)
  300. at io.cucumber.core.cli.Main.main(Main.java:33)
  301. Caused by: java.lang.reflect.InvocationTargetException
  302. at sun.reflect.NativeConstructorAccessorImpl.newInstance0(Native Method)
  303. at sun.reflect.NativeConstructorAccessorImpl.newInstance(NativeConstructorAccessorImpl.java:62)
  304. at sun.reflect.DelegatingConstructorAccessorImpl.newInstance(DelegatingConstructorAccessorImpl.java:45)
  305. at java.lang.reflect.Constructor.newInstance(Constructor.java:423)
  306. at io.cucumber.core.runtime.ObjectFactoryServiceLoader$DefaultJavaObjectFactory.cacheNewInstance(ObjectFactoryServiceLoader.java:132)
  307. ... 31 more
  308. Caused by: java.lang.AssertionError: session not created: This version of ChromeDriver only supports Chrome version 90
  309. Current browser version is 96.0.4664.110 with binary path /usr/bin/google-chrome
  310. Build info: version: '4.0.0-alpha-6', revision: '5f43a29cfc'
  311. System info: host: 'ndacyayisenga-ThinkPad-S5-S540', ip: '127.0.1.1', os.name: 'Linux', os.arch: 'amd64', os.version: '5.11.0-43-generic', java.version: '1.8.0_312'
  312. Driver info: driver.version: ChromeDriver
  313. remote stacktrace: #0 0x55a06d3c9e89 <unknown>
  314.  
  315. at org.junit.Assert.fail(Assert.java:89)
  316. at org.openmrs.contrib.qaframework.automation.Steps.<init>(Steps.java:47)
  317. at org.openmrs.contrib.qaframework.automation.ClinicalVisitSteps.<init>(ClinicalVisitSteps.java:37)
  318. ... 36 more
  319.  
  320. io.cucumber.core.exception.CucumberException: Failed to instantiate class org.openmrs.contrib.qaframework.automation.ClinicalVisitSteps
  321. at io.cucumber.core.runtime.ObjectFactoryServiceLoader$DefaultJavaObjectFactory.cacheNewInstance(ObjectFactoryServiceLoader.java:140)
  322. at io.cucumber.core.runtime.ObjectFactoryServiceLoader$DefaultJavaObjectFactory.getInstance(ObjectFactoryServiceLoader.java:124)
  323. at io.cucumber.java.AbstractGlueDefinition.invokeMethod(AbstractGlueDefinition.java:47)
  324. at io.cucumber.java.JavaHookDefinition.execute(JavaHookDefinition.java:59)
  325. at io.cucumber.core.runner.CoreHookDefinition.execute(CoreHookDefinition.java:46)
  326. at io.cucumber.core.runner.HookDefinitionMatch.runStep(HookDefinitionMatch.java:21)
  327. at io.cucumber.core.runner.ExecutionMode$1.execute(ExecutionMode.java:10)
  328. at io.cucumber.core.runner.TestStep.executeStep(TestStep.java:92)
  329. at io.cucumber.core.runner.TestStep.run(TestStep.java:64)
  330. at io.cucumber.core.runner.TestCase.run(TestCase.java:110)
  331. at io.cucumber.core.runner.Runner.runPickle(Runner.java:71)
  332. at io.cucumber.core.runtime.Runtime.lambda$execute$5(Runtime.java:110)
  333. at io.cucumber.core.runtime.CucumberExecutionContext.runTestCase(CucumberExecutionContext.java:117)
  334. at io.cucumber.core.runtime.Runtime.lambda$execute$6(Runtime.java:110)
  335. at java.util.concurrent.Executors$RunnableAdapter.call(Executors.java:511)
  336. at java.util.concurrent.FutureTask.run(FutureTask.java:266)
  337. at io.cucumber.core.runtime.Runtime$SameThreadExecutorService.execute(Runtime.java:233)
  338. at java.util.concurrent.AbstractExecutorService.submit(AbstractExecutorService.java:112)
  339. at io.cucumber.core.runtime.Runtime.lambda$run$2(Runtime.java:86)
  340. at java.util.stream.ReferencePipeline$3$1.accept(ReferencePipeline.java:193)
  341. at java.util.stream.SliceOps$1$1.accept(SliceOps.java:204)
  342. at java.util.ArrayList$ArrayListSpliterator.tryAdvance(ArrayList.java:1361)
  343. at java.util.stream.ReferencePipeline.forEachWithCancel(ReferencePipeline.java:126)
  344. at java.util.stream.AbstractPipeline.copyIntoWithCancel(AbstractPipeline.java:499)
  345. at java.util.stream.AbstractPipeline.copyInto(AbstractPipeline.java:486)
  346. at java.util.stream.AbstractPipeline.wrapAndCopyInto(AbstractPipeline.java:472)
  347. at java.util.stream.ReduceOps$ReduceOp.evaluateSequential(ReduceOps.java:708)
  348. at java.util.stream.AbstractPipeline.evaluate(AbstractPipeline.java:234)
  349. at java.util.stream.ReferencePipeline.collect(ReferencePipeline.java:566)
  350. at io.cucumber.core.runtime.Runtime.run(Runtime.java:87)
  351. at io.cucumber.core.cli.Main.run(Main.java:79)
  352. at io.cucumber.core.cli.Main.main(Main.java:33)
  353. Caused by: java.lang.reflect.InvocationTargetException
  354. at sun.reflect.NativeConstructorAccessorImpl.newInstance0(Native Method)
  355. at sun.reflect.NativeConstructorAccessorImpl.newInstance(NativeConstructorAccessorImpl.java:62)
  356. at sun.reflect.DelegatingConstructorAccessorImpl.newInstance(DelegatingConstructorAccessorImpl.java:45)
  357. at java.lang.reflect.Constructor.newInstance(Constructor.java:423)
  358. at io.cucumber.core.runtime.ObjectFactoryServiceLoader$DefaultJavaObjectFactory.cacheNewInstance(ObjectFactoryServiceLoader.java:132)
  359. ... 31 more
  360. Caused by: java.lang.AssertionError: session not created: This version of ChromeDriver only supports Chrome version 90
  361. Current browser version is 96.0.4664.110 with binary path /usr/bin/google-chrome
  362. Build info: version: '4.0.0-alpha-6', revision: '5f43a29cfc'
  363. System info: host: 'ndacyayisenga-ThinkPad-S5-S540', ip: '127.0.1.1', os.name: 'Linux', os.arch: 'amd64', os.version: '5.11.0-43-generic', java.version: '1.8.0_312'
  364. Driver info: driver.version: ChromeDriver
  365. remote stacktrace: #0 0x5590e780ce89 <unknown>
  366.  
  367. at org.junit.Assert.fail(Assert.java:89)
  368. at org.openmrs.contrib.qaframework.automation.Steps.<init>(Steps.java:47)
  369. at org.openmrs.contrib.qaframework.automation.ClinicalVisitSteps.<init>(ClinicalVisitSteps.java:37)
  370. ... 36 more
  371.  
  372. io.cucumber.core.exception.CucumberException: Failed to instantiate class org.openmrs.contrib.qaframework.automation.LoginSteps
  373. at io.cucumber.core.runtime.ObjectFactoryServiceLoader$DefaultJavaObjectFactory.cacheNewInstance(ObjectFactoryServiceLoader.java:140)
  374. at io.cucumber.core.runtime.ObjectFactoryServiceLoader$DefaultJavaObjectFactory.getInstance(ObjectFactoryServiceLoader.java:124)
  375. at io.cucumber.java.AbstractGlueDefinition.invokeMethod(AbstractGlueDefinition.java:47)
  376. at io.cucumber.java.JavaHookDefinition.execute(JavaHookDefinition.java:59)
  377. at io.cucumber.core.runner.CoreHookDefinition.execute(CoreHookDefinition.java:46)
  378. at io.cucumber.core.runner.HookDefinitionMatch.runStep(HookDefinitionMatch.java:21)
  379. at io.cucumber.core.runner.ExecutionMode$1.execute(ExecutionMode.java:10)
  380. at io.cucumber.core.runner.TestStep.executeStep(TestStep.java:92)
  381. at io.cucumber.core.runner.TestStep.run(TestStep.java:64)
  382. at io.cucumber.core.runner.TestCase.run(TestCase.java:110)
  383. at io.cucumber.core.runner.Runner.runPickle(Runner.java:71)
  384. at io.cucumber.core.runtime.Runtime.lambda$execute$5(Runtime.java:110)
  385. at io.cucumber.core.runtime.CucumberExecutionContext.runTestCase(CucumberExecutionContext.java:117)
  386. at io.cucumber.core.runtime.Runtime.lambda$execute$6(Runtime.java:110)
  387. at java.util.concurrent.Executors$RunnableAdapter.call(Executors.java:511)
  388. at java.util.concurrent.FutureTask.run(FutureTask.java:266)
  389. at io.cucumber.core.runtime.Runtime$SameThreadExecutorService.execute(Runtime.java:233)
  390. at java.util.concurrent.AbstractExecutorService.submit(AbstractExecutorService.java:112)
  391. at io.cucumber.core.runtime.Runtime.lambda$run$2(Runtime.java:86)
  392. at java.util.stream.ReferencePipeline$3$1.accept(ReferencePipeline.java:193)
  393. at java.util.stream.SliceOps$1$1.accept(SliceOps.java:204)
  394. at java.util.ArrayList$ArrayListSpliterator.tryAdvance(ArrayList.java:1361)
  395. at java.util.stream.ReferencePipeline.forEachWithCancel(ReferencePipeline.java:126)
  396. at java.util.stream.AbstractPipeline.copyIntoWithCancel(AbstractPipeline.java:499)
  397. at java.util.stream.AbstractPipeline.copyInto(AbstractPipeline.java:486)
  398. at java.util.stream.AbstractPipeline.wrapAndCopyInto(AbstractPipeline.java:472)
  399. at java.util.stream.ReduceOps$ReduceOp.evaluateSequential(ReduceOps.java:708)
  400. at java.util.stream.AbstractPipeline.evaluate(AbstractPipeline.java:234)
  401. at java.util.stream.ReferencePipeline.collect(ReferencePipeline.java:566)
  402. at io.cucumber.core.runtime.Runtime.run(Runtime.java:87)
  403. at io.cucumber.core.cli.Main.run(Main.java:79)
  404. at io.cucumber.core.cli.Main.main(Main.java:33)
  405. Caused by: java.lang.reflect.InvocationTargetException
  406. at sun.reflect.NativeConstructorAccessorImpl.newInstance0(Native Method)
  407. at sun.reflect.NativeConstructorAccessorImpl.newInstance(NativeConstructorAccessorImpl.java:62)
  408. at sun.reflect.DelegatingConstructorAccessorImpl.newInstance(DelegatingConstructorAccessorImpl.java:45)
  409. at java.lang.reflect.Constructor.newInstance(Constructor.java:423)
  410. at io.cucumber.core.runtime.ObjectFactoryServiceLoader$DefaultJavaObjectFactory.cacheNewInstance(ObjectFactoryServiceLoader.java:132)
  411. ... 31 more
  412. Caused by: java.lang.AssertionError: session not created: This version of ChromeDriver only supports Chrome version 90
  413. Current browser version is 96.0.4664.110 with binary path /usr/bin/google-chrome
  414. Build info: version: '4.0.0-alpha-6', revision: '5f43a29cfc'
  415. System info: host: 'ndacyayisenga-ThinkPad-S5-S540', ip: '127.0.1.1', os.name: 'Linux', os.arch: 'amd64', os.version: '5.11.0-43-generic', java.version: '1.8.0_312'
  416. Driver info: driver.version: ChromeDriver
  417. remote stacktrace: #0 0x5652f06a0e89 <unknown>
  418.  
  419. at org.junit.Assert.fail(Assert.java:89)
  420. at org.openmrs.contrib.qaframework.automation.Steps.<init>(Steps.java:47)
  421. at org.openmrs.contrib.qaframework.automation.LoginSteps.<init>(LoginSteps.java:24)
  422. ... 36 more
  423.  
  424.  
  425.  
  426. Process finished with exit code 1
  427.  
Advertisement
Advertisement
Advertisement
RAW Paste Data Copied
Advertisement