Guest User

Untitled

a guest
May 6th, 2020
14
Never
Not a member of Pastebin yet? Sign Up, it unlocks many cool features!
  1. DKMS make.log for zfs-0.8.3 for kernel 5.6.8-1-MANJARO (x86_64)
  2. Thu 07 May 2020 12:40:12 AM CEST
  3. make: getcwd: No such file or directory
  4. make: *** No targets specified and no makefile found. Stop.
  5. DKMS make.log for zfs-0.8.3 for kernel 5.6.8-1-MANJARO (x86_64)
  6. Thu 07 May 2020 12:47:44 AM CEST
  7. ./scripts/make_gitrev.sh
  8. make: [Makefile:1544: gitrev] Error 128 (ignored)
  9. make all-recursive
  10. make[1]: Entering directory '/var/lib/dkms/zfs/0.8.3/build'
  11. Making all in include
  12. make[2]: Entering directory '/var/lib/dkms/zfs/0.8.3/build/include'
  13. Making all in linux
  14. make[3]: Entering directory '/var/lib/dkms/zfs/0.8.3/build/include/linux'
  15. make[3]: Nothing to be done for 'all'.
  16. make[3]: Leaving directory '/var/lib/dkms/zfs/0.8.3/build/include/linux'
  17. Making all in spl
  18. make[3]: Entering directory '/var/lib/dkms/zfs/0.8.3/build/include/spl'
  19. Making all in rpc
  20. make[4]: Entering directory '/var/lib/dkms/zfs/0.8.3/build/include/spl/rpc'
  21. make[4]: Nothing to be done for 'all'.
  22. make[4]: Leaving directory '/var/lib/dkms/zfs/0.8.3/build/include/spl/rpc'
  23. Making all in sys
  24. make[4]: Entering directory '/var/lib/dkms/zfs/0.8.3/build/include/spl/sys'
  25. make[4]: Nothing to be done for 'all'.
  26. make[4]: Leaving directory '/var/lib/dkms/zfs/0.8.3/build/include/spl/sys'
  27. make[4]: Entering directory '/var/lib/dkms/zfs/0.8.3/build/include/spl'
  28. make[4]: Nothing to be done for 'all-am'.
  29. make[4]: Leaving directory '/var/lib/dkms/zfs/0.8.3/build/include/spl'
  30. make[3]: Leaving directory '/var/lib/dkms/zfs/0.8.3/build/include/spl'
  31. Making all in sys
  32. make[3]: Entering directory '/var/lib/dkms/zfs/0.8.3/build/include/sys'
  33. Making all in fm
  34. make[4]: Entering directory '/var/lib/dkms/zfs/0.8.3/build/include/sys/fm'
  35. Making all in fs
  36. make[5]: Entering directory '/var/lib/dkms/zfs/0.8.3/build/include/sys/fm/fs'
  37. make[5]: Nothing to be done for 'all'.
  38. make[5]: Leaving directory '/var/lib/dkms/zfs/0.8.3/build/include/sys/fm/fs'
  39. make[5]: Entering directory '/var/lib/dkms/zfs/0.8.3/build/include/sys/fm'
  40. make[5]: Nothing to be done for 'all-am'.
  41. make[5]: Leaving directory '/var/lib/dkms/zfs/0.8.3/build/include/sys/fm'
  42. make[4]: Leaving directory '/var/lib/dkms/zfs/0.8.3/build/include/sys/fm'
  43. Making all in fs
  44. make[4]: Entering directory '/var/lib/dkms/zfs/0.8.3/build/include/sys/fs'
  45. make[4]: Nothing to be done for 'all'.
  46. make[4]: Leaving directory '/var/lib/dkms/zfs/0.8.3/build/include/sys/fs'
  47. Making all in crypto
  48. make[4]: Entering directory '/var/lib/dkms/zfs/0.8.3/build/include/sys/crypto'
  49. make[4]: Nothing to be done for 'all'.
  50. make[4]: Leaving directory '/var/lib/dkms/zfs/0.8.3/build/include/sys/crypto'
  51. Making all in lua
  52. make[4]: Entering directory '/var/lib/dkms/zfs/0.8.3/build/include/sys/lua'
  53. make[4]: Nothing to be done for 'all'.
  54. make[4]: Leaving directory '/var/lib/dkms/zfs/0.8.3/build/include/sys/lua'
  55. Making all in sysevent
  56. make[4]: Entering directory '/var/lib/dkms/zfs/0.8.3/build/include/sys/sysevent'
  57. make[4]: Nothing to be done for 'all'.
  58. make[4]: Leaving directory '/var/lib/dkms/zfs/0.8.3/build/include/sys/sysevent'
  59. make[4]: Entering directory '/var/lib/dkms/zfs/0.8.3/build/include/sys'
  60. make[4]: Nothing to be done for 'all-am'.
  61. make[4]: Leaving directory '/var/lib/dkms/zfs/0.8.3/build/include/sys'
  62. make[3]: Leaving directory '/var/lib/dkms/zfs/0.8.3/build/include/sys'
  63. make[3]: Entering directory '/var/lib/dkms/zfs/0.8.3/build/include'
  64. make[3]: Nothing to be done for 'all-am'.
  65. make[3]: Leaving directory '/var/lib/dkms/zfs/0.8.3/build/include'
  66. make[2]: Leaving directory '/var/lib/dkms/zfs/0.8.3/build/include'
  67. Making all in rpm
  68. make[2]: Entering directory '/var/lib/dkms/zfs/0.8.3/build/rpm'
  69. Making all in generic
  70. make[3]: Entering directory '/var/lib/dkms/zfs/0.8.3/build/rpm/generic'
  71. make[3]: Nothing to be done for 'all'.
  72. make[3]: Leaving directory '/var/lib/dkms/zfs/0.8.3/build/rpm/generic'
  73. Making all in redhat
  74. make[3]: Entering directory '/var/lib/dkms/zfs/0.8.3/build/rpm/redhat'
  75. make[3]: Nothing to be done for 'all'.
  76. make[3]: Leaving directory '/var/lib/dkms/zfs/0.8.3/build/rpm/redhat'
  77. make[3]: Entering directory '/var/lib/dkms/zfs/0.8.3/build/rpm'
  78. make[3]: Nothing to be done for 'all-am'.
  79. make[3]: Leaving directory '/var/lib/dkms/zfs/0.8.3/build/rpm'
  80. make[2]: Leaving directory '/var/lib/dkms/zfs/0.8.3/build/rpm'
  81. Making all in module
  82. make[2]: Entering directory '/var/lib/dkms/zfs/0.8.3/build/module'
  83. list='icp lua'; for targetdir in $list; do \
  84. make -C $targetdir; \
  85. done
  86. make[3]: Entering directory '/var/lib/dkms/zfs/0.8.3/build/module/icp'
  87. mkdir -p api core spi io os algs algs/aes algs/edonr algs/modes algs/sha1 algs/sha2 algs/skein asm-x86_64 asm-x86_64/aes asm-x86_64/modes asm-x86_64/sha1 asm-x86_64/sha2 asm-i386 asm-generic
  88. make[3]: Leaving directory '/var/lib/dkms/zfs/0.8.3/build/module/icp'
  89. make[3]: Entering directory '/var/lib/dkms/zfs/0.8.3/build/module/lua'
  90. mkdir -p setjmp
  91. make[3]: Leaving directory '/var/lib/dkms/zfs/0.8.3/build/module/lua'
  92. make -C /usr/lib/modules/5.6.8-1-MANJARO/build M=`pwd` CONFIG_ZFS=m modules
  93. make[3]: Entering directory '/usr/lib/modules/5.6.8-1-MANJARO/build'
  94. CC [M] /var/lib/dkms/zfs/0.8.3/build/module/avl/avl.o
  95. CC [M] /var/lib/dkms/zfs/0.8.3/build/module/icp/illumos-crypto.o
  96. In file included from /var/lib/dkms/zfs/0.8.3/build/include/spl/sys/condvar.h:33,
  97. from /var/lib/dkms/zfs/0.8.3/build/include/sys/zfs_context.h:38,
  98. from /var/lib/dkms/zfs/0.8.3/build/include/sys/crypto/common.h:39,
  99. from /var/lib/dkms/zfs/0.8.3/build/module/icp/illumos-crypto.c:35:
  100. /var/lib/dkms/zfs/0.8.3/build/include/spl/sys/time.h:88:15: error: unknown type name ‘time_t’
  101. 88 | static inline time_t
  102. | ^~~~~~
  103. /var/lib/dkms/zfs/0.8.3/build/include/spl/sys/time.h: In function ‘gethrtime’:
  104. /var/lib/dkms/zfs/0.8.3/build/include/spl/sys/time.h:108:18: error: storage size of ‘ts’ isn’t known
  105. 108 | struct timespec ts;
  106. | ^~
  107. /var/lib/dkms/zfs/0.8.3/build/include/spl/sys/time.h:109:2: error: implicit declaration of function ‘getrawmonotonic’ [-Werror=implicit-function-declaration]
  108. 109 | getrawmonotonic(&ts);
  109. | ^~~~~~~~~~~~~~~
  110. /var/lib/dkms/zfs/0.8.3/build/include/spl/sys/time.h:108:18: warning: unused variable ‘ts’ [-Wunused-variable]
  111. 108 | struct timespec ts;
  112. | ^~
  113. LD [M] /var/lib/dkms/zfs/0.8.3/build/module/avl/zavl.o
  114. CC [M] /var/lib/dkms/zfs/0.8.3/build/module/lua/lapi.o
  115. cc1: some warnings being treated as errors
  116. make[5]: *** [scripts/Makefile.build:268: /var/lib/dkms/zfs/0.8.3/build/module/icp/illumos-crypto.o] Error 1
  117. make[4]: *** [scripts/Makefile.build:505: /var/lib/dkms/zfs/0.8.3/build/module/icp] Error 2
  118. make[4]: *** Waiting for unfinished jobs....
  119. CC [M] /var/lib/dkms/zfs/0.8.3/build/module/lua/lauxlib.o
  120. In file included from /var/lib/dkms/zfs/0.8.3/build/include/spl/sys/condvar.h:33,
  121. from /var/lib/dkms/zfs/0.8.3/build/include/sys/zfs_context.h:38,
  122. from /var/lib/dkms/zfs/0.8.3/build/include/sys/lua/lua.h:13,
  123. from /var/lib/dkms/zfs/0.8.3/build/module/lua/lapi.c:12:
  124. /var/lib/dkms/zfs/0.8.3/build/include/spl/sys/time.h:88:15: error: unknown type name ‘time_t’
  125. 88 | static inline time_t
  126. | ^~~~~~
  127. /var/lib/dkms/zfs/0.8.3/build/include/spl/sys/time.h: In function ‘gethrtime’:
  128. /var/lib/dkms/zfs/0.8.3/build/include/spl/sys/time.h:108:18: error: storage size of ‘ts’ isn’t known
  129. 108 | struct timespec ts;
  130. | ^~
  131. /var/lib/dkms/zfs/0.8.3/build/include/spl/sys/time.h:109:2: error: implicit declaration of function ‘getrawmonotonic’ [-Werror=implicit-function-declaration]
  132. 109 | getrawmonotonic(&ts);
  133. | ^~~~~~~~~~~~~~~
  134. /var/lib/dkms/zfs/0.8.3/build/include/spl/sys/time.h:108:18: warning: unused variable ‘ts’ [-Wunused-variable]
  135. 108 | struct timespec ts;
  136. | ^~
  137. In file included from /var/lib/dkms/zfs/0.8.3/build/include/spl/sys/condvar.h:33,
  138. from /var/lib/dkms/zfs/0.8.3/build/include/sys/zfs_context.h:38,
  139. from /var/lib/dkms/zfs/0.8.3/build/include/sys/lua/lua.h:13,
  140. from /var/lib/dkms/zfs/0.8.3/build/module/lua/lauxlib.c:16:
  141. /var/lib/dkms/zfs/0.8.3/build/include/spl/sys/time.h:88:15: error: unknown type name ‘time_t’
  142. 88 | static inline time_t
  143. | ^~~~~~
  144. /var/lib/dkms/zfs/0.8.3/build/include/spl/sys/time.h: In function ‘gethrtime’:
  145. /var/lib/dkms/zfs/0.8.3/build/include/spl/sys/time.h:108:18: error: storage size of ‘ts’ isn’t known
  146. 108 | struct timespec ts;
  147. | ^~
  148. /var/lib/dkms/zfs/0.8.3/build/include/spl/sys/time.h:109:2: error: implicit declaration of function ‘getrawmonotonic’ [-Werror=implicit-function-declaration]
  149. 109 | getrawmonotonic(&ts);
  150. | ^~~~~~~~~~~~~~~
  151. /var/lib/dkms/zfs/0.8.3/build/include/spl/sys/time.h:108:18: warning: unused variable ‘ts’ [-Wunused-variable]
  152. 108 | struct timespec ts;
  153. | ^~
  154. cc1: some warnings being treated as errors
  155. cc1: some warnings being treated as errors
  156. make[5]: *** [scripts/Makefile.build:268: /var/lib/dkms/zfs/0.8.3/build/module/lua/lapi.o] Error 1
  157. make[5]: *** Waiting for unfinished jobs....
  158. make[5]: *** [scripts/Makefile.build:268: /var/lib/dkms/zfs/0.8.3/build/module/lua/lauxlib.o] Error 1
  159. make[4]: *** [scripts/Makefile.build:505: /var/lib/dkms/zfs/0.8.3/build/module/lua] Error 2
  160. make[3]: *** [Makefile:1683: /var/lib/dkms/zfs/0.8.3/build/module] Error 2
  161. make[3]: Leaving directory '/usr/lib/modules/5.6.8-1-MANJARO/build'
  162. make[2]: *** [Makefile:30: modules] Error 2
  163. make[2]: Leaving directory '/var/lib/dkms/zfs/0.8.3/build/module'
  164. make[1]: *** [Makefile:839: all-recursive] Error 1
  165. make[1]: Leaving directory '/var/lib/dkms/zfs/0.8.3/build'
  166. make: *** [Makefile:708: all] Error 2
RAW Paste Data