daily pastebin goal
81%
SHARE
TWEET

Untitled

a guest Jul 13th, 2018 67 Never
Not a member of Pastebin yet? Sign Up, it unlocks many cool features!
  1. -- Found cppunit: -lcppunit -ldl                
  2. -- Found Qt-Version 4.5.2                        
  3. -- Found Rasqal 0.9.16: libs - /usr/lib/librasqal.so; includes - /usr/include/rasqal
  4. -- Found Raptor 1.4.19: libs - /usr/lib/libraptor.so; includes - /usr/include      
  5. -- Found Redland 1.0.9: libs - /usr/lib/librdf.so; includes - /usr/include          
  6. -- Found CLucene library: /usr/lib/libclucene.so                                    
  7. -- Found CLucene include dir: /usr/include                                          
  8. -- Found CLucene library dir: /usr/lib                                              
  9. -- Found CLucene: /usr/lib/libclucene.so                                            
  10. -- Found Java JNI >= 1.4: /opt/java/include, /opt/java/jre/lib/i386/client/libjvm.so
  11. ---------------------------------------------------------------------------------------
  12. -- Soprano Components that will be built:                                              
  13.    * Redland storage backend                                                          
  14.    * Sesame2 storage backend (java-based)                                              
  15.    * Raptor RDF parser                                                                
  16.      (including TriG parser)                                                          
  17.    * Raptor RDF serializer                                                            
  18.    * The CLucene-based full-text search index library                                  
  19.    * D-Bus server/client support                                                      
  20.  
  21. -- Soprano Components that will NOT be built:
  22.    * Virtuoso storage backend                
  23. ---------------------------------------------------------------------------------------
  24. -- Found Qt-Version 4.5.2 (using /home/shaun/kde-qt/bin/qmake)                        
  25. -- Soprano is needed to build Akonadi. We will use Soprano from kdesupport.            
  26. -- Found Automoc4: /home/shaun/kde/src/kdesupport/automoc/automoc4                    
  27. -- MySQL Server found.                                                                
  28. --                                                                                    
  29. -----------------------------------------------------------------------------          
  30. -- The following external packages were located on your system.                        
  31. -- This installation will have the extra features provided by these packages.          
  32. + Soprano                                                                              
  33. + Boost                                                                                
  34. Congratulations! All external packages have been found.                                
  35. -----------------------------------------------------------------------------          
  36.  
  37. ** Expat is disabled. No support for XML via Expat
  38. -- WARNING: you are using the obsolete 'PKGCONFIG' macro use FindPkgConfig
  39. -- Found CLucene library: /usr/lib/libclucene.so                          
  40. -- Found CLucene include dir: /usr/include                                
  41. -- Found CLucene library dir: /usr/lib                                    
  42. -- Found CLucene: /usr/lib/libclucene.so                                  
  43. ** CLucene is found. Support for CLucene backend is enabled              
  44. ** HyperEstraier is disabled. No support for HyperEstraier backend        
  45. ** SQLite is disabled. No support for SQLite backend                      
  46. ** Exiv2 is found. Support for indexing of EXIF/IPTC metadata is enabled  
  47. -- Found Qt-Version 4.5.2                                                
  48. ** Qt4 is found. Support for Qt4 GUI client is enabled                    
  49. -- WARNING: you are using the obsolete 'PKGCONFIG' macro use FindPkgConfig
  50. -- Found dbus-1 release >= 1.0                                            
  51. ** DBus-1 is found. Support for DBus interface in Strigi daemon is enabled
  52. ** Log4cxx is disabled. No support for advanced logging                  
  53. ** FAM is disabled. No support for efficient file change monitoring system
  54. -- Found cppunit: -lcppunit -ldl                                          
  55. ** CppUnit is found. Support for Strigi unit tests is enabled            
  56. -- dbus support enabled                                                  
  57. Java5 found TRUE                                                          
  58. -- /home/shaun/kde/lib - /home/shaun/kde                                  
  59. -- Found Qt-Version 4.5.2 (using /home/shaun/kde-qt/bin/qmake)            
  60. -- Found Qt-Version 4.5.2 (using /home/shaun/kde-qt/bin/qmake)            
  61. -- Found Threads: TRUE                                                    
  62. -- Found Automoc4: /home/shaun/kde/src/kdesupport/automoc/automoc4        
  63. -- Found GStreamer Plugins:                                              
  64.     /usr/lib/libgstaudio-0.10.so                                          
  65.     /usr/lib/libgstcdda-0.10.so                                          
  66.     /usr/lib/libgstnetbuffer-0.10.so                                      
  67.     /usr/lib/libgstpbutils-0.10.so                                        
  68.     /usr/lib/libgstriff-0.10.so                                          
  69.     /usr/lib/libgstrtp-0.10.so                                            
  70.     /usr/lib/libgstrtsp-0.10.so                                          
  71.     /usr/lib/libgstsdp-0.10.so                                            
  72.     /usr/lib/libgsttag-0.10.so                                            
  73.     /usr/lib/libgstvideo-0.10.so                                          
  74. -- Found GLIB2: /usr/lib/libglib-2.0.so                                  
  75. -- Found GObject libraries: gobject-2.0;glib-2.0                          
  76. -- Found GObject includes : /usr/include/glib-2.0                        
  77. -- Found ALSA: /usr/lib/libasound.so                                      
  78. --                                                                        
  79. -----------------------------------------------------------------------------
  80. -- The following external packages were located on your system.              
  81. -- This installation will have the extra features provided by these packages.
  82. + GStreamer                                                                  
  83. + GStreamer video plugin                                                    
  84. + GStreamer audio plugin                                                    
  85. + GLib2                                                                      
  86. + LibXml2                                                                    
  87. + OpenGL                                                                    
  88. + XCB                                                                        
  89. Congratulations! All external packages have been found.                      
  90. -----------------------------------------------------------------------------
  91.  
  92. -- Disabling KDE4 integration
  93. -- Found Automoc4: /home/shaun/kde/src/kdesupport/automoc/automoc4
  94. --  /usr/include/PolicyKit ===========                            
  95. -- Configuring done                                              
  96. -- Generating done                                                
  97. -- Build files have been written to: /home/shaun/kde/src/kdesupport
  98. [  0%] Built target automoc4                                      
  99. [  6%] Built target tag                                            
  100. [  6%] Built target akonadiprotocolinternals                      
  101. [  6%] [  6%] [  6%] Built target notificationmessagetest_automoc  
  102. [  6%] Built target akonadiprivate_automoc                        
  103. Built target akonadictl_automoc                                    
  104. Built target akonadi_control_automoc                              
  105. [ 14%] [ 14%] [ 14%] Built target soprano                          
  106. [ 14%] Built target handlerhelpertest_automoc                      
  107. Built target interpretertest_automoc                              
  108. Built target querybuildertest_automoc                              
  109. [ 14%] [ 14%] Built target imapstreamparsertest_automoc            
  110. [ 14%] Built target grepindex                                      
  111. Built target scopetest_automoc                                    
  112. [ 15%] Built target xmlstream                                      
  113. [ 18%] Built target streams                                        
  114. [ 18%] [ 18%] Built target xesam                                  
  115. Built target searchclient                                          
  116. [ 18%] Built target dbuscpp                                        
  117. [ 18%] Built target eventlistener                                  
  118. [ 19%] Built target newdaemon                                      
  119. [ 19%] [ 20%] Built target dbustest                                
  120. [ 20%] Built target metadataproperties                            
  121. Built target oletest                                              
  122. [ 20%] [ 20%] [ 21%] Built target testpt                          
  123. Built target archivecat                                            
  124. Built target grepindexer                                          
  125. [ 21%] Built target cmdlinestrigi                                  
  126. [ 22%] [ 23%] [ 23%] [ 24%] Built target filterwidget              
  127. Built target archiveengine                                        
  128. [ 26%] Built target pdf                                            
  129. Built target testrunner-streams                                    
  130. Built target strigiqtdbusclient                                    
  131. [ 26%] Built target filterwidgettest                              
  132. [ 27%] Built target qclient                                        
  133. [ 27%] Built target strigi_test_runner                            
  134. [ 27%] Built target dtest                                          
  135. [ 28%] Built target qimageblitz                                    
  136. [ 28%] Built target phononexperimental_automoc                    
  137. [ 28%] Built target phonon_automoc                                
  138. [ 28%] Built target phonon_gstreamer_automoc                      
  139. [ 30%] Built target cpptoxml                                      
  140. [ 30%] Built target polkit-qt-core_automoc
  141. [ 30%] Built target polkit-qt-gui_automoc
  142. [ 30%] [ 30%] Building CXX object taglib-extras/taglib-extras/CMakeFiles/tag-extras.dir/tplugins.cpp.o
  143. Building CXX object taglib-extras/taglib-extras/CMakeFiles/tag-extras.dir/tfile_helper.cpp.o
  144. Scanning dependencies of target tag_c
  145. [ 30%] [ 30%] [ 30%] Building CXX object soprano/index/CMakeFiles/sopranoindex.dir/cluceneindex.cpp.o
  146. Building CXX object taglib/bindings/c/CMakeFiles/tag_c.dir/tag_c.cpp.o
  147. Built target phonon_xine_automoc
  148. [ 30%] Building CXX object soprano/backends/redland/CMakeFiles/soprano_redlandcore.dir/redlandworld.cpp.o
  149. In file included from /home/shaun/kde/src/kdesupport/taglib/include/taglib_export.h:1,
  150.                  from /home/shaun/kde/src/kdesupport/taglib/include/../taglib/toolkit/tfile.h:29,
  151.                  from /home/shaun/kde/src/kdesupport/taglib/include/tfile.h:1,
  152.                  from /home/shaun/kde/src/kdesupport/taglib-extras/taglib-extras/tfile_helper.h:26,
  153.                  from /home/shaun/kde/src/kdesupport/taglib-extras/taglib-extras/tfile_helper.cpp:23:
  154. /home/shaun/kde/src/kdesupport/taglib/include/../taglib/taglib_export.h:39:27: error: taglib_config.h: No such file or directory
  155. make[2]: *** [taglib-extras/taglib-extras/CMakeFiles/tag-extras.dir/tfile_helper.cpp.o] Error 1
  156. make[2]: *** Waiting for unfinished jobs....
  157. [ 30%] Building CXX object soprano/index/CMakeFiles/sopranoindex.dir/clucenedocumentwrapper.cpp.o
  158. In file included from /home/shaun/kde/src/kdesupport/taglib/include/taglib_export.h:1,
  159.                  from /home/shaun/kde/src/kdesupport/taglib-extras/taglib-extras/tplugins.cpp:29:
  160. /home/shaun/kde/src/kdesupport/taglib/include/../taglib/taglib_export.h:39:27: error: taglib_config.h: No such file or directory
  161. make[2]: *** [taglib-extras/taglib-extras/CMakeFiles/tag-extras.dir/tplugins.cpp.o] Error 1
  162. make[1]: *** [taglib-extras/taglib-extras/CMakeFiles/tag-extras.dir/all] Error 2
  163. make[1]: *** Waiting for unfinished jobs....
  164. [ 31%] Building CXX object soprano/backends/redland/CMakeFiles/soprano_redlandcore.dir/redlandstatementiterator.cpp.o
  165. Linking CXX shared library libtag_c.so
  166. [ 31%] Building CXX object soprano/backends/redland/CMakeFiles/soprano_redlandcore.dir/redlandqueryresult.cpp.o
  167. [ 31%] Built target tag_c
  168. [ 32%] Building CXX object soprano/index/CMakeFiles/sopranoindex.dir/cluceneutils.cpp.o
  169. [ 32%] Building CXX object soprano/index/CMakeFiles/sopranoindex.dir/indexfiltermodel.cpp.o
  170. [ 32%] Building CXX object soprano/index/CMakeFiles/sopranoindex.dir/tstring.cpp.o
  171. [ 32%] Building CXX object soprano/backends/redland/CMakeFiles/soprano_redlandcore.dir/redlandmodel.cpp.o
  172. [ 32%] Building CXX object soprano/backends/redland/CMakeFiles/soprano_redlandcore.dir/redlandnodeiteratorbackend.cpp.o
  173. [ 32%] Building CXX object soprano/index/CMakeFiles/sopranoindex.dir/indexqueryhit.cpp.o
  174. [ 32%] Building CXX object soprano/index/CMakeFiles/sopranoindex.dir/indexqueryhititeratorbackend.cpp.o
  175. [ 32%] Building CXX object soprano/index/CMakeFiles/sopranoindex.dir/queryhitwrapperresultiteratorbackend.cpp.o
  176. [ 32%] Building CXX object soprano/backends/redland/CMakeFiles/soprano_redlandcore.dir/multimutex.cpp.o
  177. Linking CXX shared library libsopranoindex.so
  178. [ 32%] Built target sopranoindex
  179. Linking CXX static library libsoprano_redlandcore.a
  180. [ 32%] Built target soprano_redlandcore
  181. make: *** [all] Error 2
RAW Paste Data
We use cookies for various purposes including analytics. By continuing to use Pastebin, you agree to our use of cookies as described in the Cookies Policy. OK, I Understand
 
Top