SHARE
TWEET

Untitled

a guest Feb 25th, 2015 185 Never
Not a member of Pastebin yet? Sign Up, it unlocks many cool features!
  1. ERROR: Command Error: exit status: 1  Output:
  2. Applying patch 01-use-proper-tools-for-cross-build.patch
  3. patching file Makefile.pre.in
  4. Hunk #1 succeeded at 194 with fuzz 2 (offset 12 lines).
  5. Hunk #2 FAILED at 215.
  6. Hunk #3 FAILED at 402.
  7. Hunk #4 FAILED at 543.
  8. Hunk #5 FAILED at 927.
  9. Hunk #6 FAILED at 1050.
  10. 5 out of 6 hunks FAILED -- rejects in file Makefile.pre.in
  11. patching file setup.py
  12. Hunk #1 succeeded at 334 (offset 21 lines).
  13. Hunk #2 FAILED at 370.
  14. Hunk #3 succeeded at 559 (offset 83 lines).
  15. Hunk #4 succeeded at 766 (offset 85 lines).
  16. 1 out of 4 hunks FAILED -- rejects in file setup.py
  17. Patch 01-use-proper-tools-for-cross-build.patch does not apply (enforce with -f)
  18. ERROR: Function failed: patch_do_patch
  19. ERROR: Logfile of failure stored in: /home/paul/poky/build/tmp/work/corei7-64-poky-linux/python/2.7.9-r1/temp/log.do_patch.16005
  20. ERROR: Task 1 (/home/paul/poky/meta/recipes-devtools/python/python_2.7.9.bb, do_patch) failed with exit code '1'
  21. NOTE: Tasks Summary: Attempted 66 tasks of which 63 didn't need to be rerun and 1 failed.
RAW Paste Data
We use cookies for various purposes including analytics. By continuing to use Pastebin, you agree to our use of cookies as described in the Cookies Policy. OK, I Understand
 
Top