Guest User

Untitled

a guest
Feb 9th, 2014
1,082
Never
Not a member of Pastebin yet? Sign Up, it unlocks many cool features!
  1. root@kali:~/rtl8187_linux_26.1010.0622.2006# make
  2. rm -f ieee80211/Module.symvers 2>/dev/null
  3. rm -f ieee80211/Modules.symvers 2>/dev/null
  4. make -C ieee80211 all
  5. make[1]: Entering directory `/root/rtl8187_linux_26.1010.0622.2006/ieee80211'
  6. make -C /lib/modules/3.12-kali1-amd64/build M=/root/rtl8187_linux_26.1010.0622.2006/ieee80211 modules
  7. make[2]: Entering directory `/usr/src/linux-headers-3.12-kali1-amd64'
  8. CC [M] /root/rtl8187_linux_26.1010.0622.2006/ieee80211/ieee80211_softmac.o
  9. In file included from /root/rtl8187_linux_26.1010.0622.2006/ieee80211/ieee80211_softmac.c:17:0:
  10. /root/rtl8187_linux_26.1010.0622.2006/ieee80211/ieee80211.h:986:24: error: field ‘ps_task’ has incomplete type
  11. /root/rtl8187_linux_26.1010.0622.2006/ieee80211/ieee80211_softmac.c: In function ‘ieee80211_rx_frame_softmac_rtl7’:
  12. /root/rtl8187_linux_26.1010.0622.2006/ieee80211/ieee80211_softmac.c:1512:3: error: implicit declaration of function ‘tasklet_schedule’ [-Werror=implicit-function-declaration]
  13. /root/rtl8187_linux_26.1010.0622.2006/ieee80211/ieee80211_softmac.c: In function ‘ieee80211_softmac_init_rtl7’:
  14. /root/rtl8187_linux_26.1010.0622.2006/ieee80211/ieee80211_softmac.c:2229:2: error: implicit declaration of function ‘tasklet_init’ [-Werror=implicit-function-declaration]
  15. /root/rtl8187_linux_26.1010.0622.2006/ieee80211/ieee80211_softmac.c: In function ‘ieee80211_wpa_set_encryption_rtl7’:
  16. /root/rtl8187_linux_26.1010.0622.2006/ieee80211/ieee80211_softmac.c:2474:3: error: implicit declaration of function ‘request_module’ [-Werror=implicit-function-declaration]
  17. /root/rtl8187_linux_26.1010.0622.2006/ieee80211/ieee80211_softmac.c:2503:3: error: implicit declaration of function ‘try_module_get’ [-Werror=implicit-function-declaration]
  18. cc1: some warnings being treated as errors
  19. make[5]: *** [/root/rtl8187_linux_26.1010.0622.2006/ieee80211/ieee80211_softmac.o] Error 1
  20. make[4]: *** [_module_/root/rtl8187_linux_26.1010.0622.2006/ieee80211] Error 2
  21. make[3]: *** [sub-make] Error 2
  22. make[2]: *** [all] Error 2
  23. make[2]: Leaving directory `/usr/src/linux-headers-3.12-kali1-amd64'
  24. make[1]: *** [modules] Error 2
  25. make[1]: Leaving directory `/root/rtl8187_linux_26.1010.0622.2006/ieee80211'
  26. make: *** [all] Error 2
  27. root@kali:~/rtl8187_linux_26.1010.0622.2006# make install
  28. install -d /lib/modules/3.12-kali1-amd64/kernel/drivers/net/wireless/rtl_ieee80211
  29. install -d /lib/modules/3.12-kali1-amd64/kernel/drivers/net/wireless/rtl8187
  30. install -m 644 ./ieee80211/*.ko /lib/modules/3.12-kali1-amd64/kernel/drivers/net/wireless/rtl_ieee80211
  31. install: cannot stat `./ieee80211/*.ko': No such file or directory
  32. make: *** [install] Error 1
RAW Paste Data