SHARE
TWEET

Untitled

Sunka Mar 8th, 2019 3 Never
Not a member of Pastebin yet? Sign Up, it unlocks many cool features!
  1. # cat /root/centminlogs/centminmod_123.09beta01.b109_080319-220432_php_upgrade.log
  2.  
  3. Do you want to run YUM install checks ?  [y/n]
  4.  
  5. This will increase your upgrade duration time wise.
  6. Check the change log centminmod.com/changelog.html
  7. to see if any Nginx or PHP related new additions
  8. which require checking YUM prequisites are met.
  9. If no new additions made, you can skip the
  10. YUM install check to speed up upgrade time.
  11.  
  12.  [y/n]:      ____   _   _  ____       _   _                                _      
  13.     |  _ \ | | | ||  _ \  _  | | | | _ __    __ _  _ __  __ _   __| |  ___
  14.     | |_) || |_| || |_) |(_) | | | || '_ \  / _` || '__|/ _` | / _` | / _ \
  15.     |  __/ |  _  ||  __/  _  | |_| || |_) || (_| || |  | (_| || (_| ||  __/
  16.     |_|    |_| |_||_|    (_)  \___/ | .__/  \__, ||_|   \__,_| \__,_| \___|
  17.                                     |_|     |___/                          
  18.  
  19. PHP Upgrade/Downgrade - Would you like to continue? [y/n] y
  20.  
  21. ----------------------------------------------------------------
  22. Install which version of PHP? (version i.e. 5.6.40, 7.0.33, NGDEBUG)
  23. PHP 7.x/7.1.x/7.2.x/7.3.x is GA Stable but still may have broken PHP extensions.
  24. NGDEBUG is PHP 7.4.0 dev builds minus incompatible PHP extensions
  25. ----------------------------------------------------------------
  26. Enter PHP Version number you want to upgrade/downgrade to: 7.3.3
  27. ----------------------------------------------------------------
  28. existing php.ini will be backed up at /usr/local/lib/php.ini-oldversion_080319-220432
  29. Want to update to latest php.conf ? (overwrites will auto backup existing php.conf)
  30. existing php.conf will be backed up at /usr/local/nginx/conf/php.conf-oldversion_080319-220432
  31. ----------------------------------------------------------------
  32. Update & overwrite your existing php.conf [y/n]: n
  33. ----------------------------------------------------------------
  34.  
  35. -----------------------------------------------------------------------------------------
  36. Detected PHP 7.3 branch.
  37. You can compile Zend OPcache (Zend Optimizer Plus+) support
  38. as an alternative to using APC Cache or Xcache cache.
  39. But Zend OPcache only provides PHP opcode cache and
  40. DOESN'T do data caching, so if your web apps such as Wordpress,
  41. Drupal or vBulletin require data caching to APC or Xcache,
  42. it won't work with Zend OPcache.
  43.  
  44. -----------------------------------------------------------------------------------------
  45. Do you want to use Zend OPcache [y/n] ? y
  46.  
  47. *************************************************
  48. * Zend Optimizer Plus OPcache configured
  49. *************************************************
  50.  
  51. PHP 7+ detected which uses newer mysqlnd
  52. or PDO MySQL extensions and removed the
  53. legacy mysql extension. You can optionally
  54. re-add the removed legacy mysql extension
  55. to PHP 7+ by answering yes to next question
  56. Only answer yes if you know for sure you
  57. have very old web scripts which need mysql
  58. legacy extension re-added. Otherwise answer
  59. no which is recommended for best stability
  60.  
  61. Re-add legacy mysql extension to PHP 7+ [y/n] ? n
  62.  
  63. /svr-setup/php-7.3.3/ext /usr/local/src/centminmod
  64. /usr/local/src/centminmod
  65. *************************************************
  66. * Upgrading PHP
  67. *************************************************
  68. DE server detected
  69.  ____   _   _  ____       ____                          _                    _
  70. |  _ \ | | | ||  _ \  _  |  _ \   ___ __      __ _ __  | |  ___    __ _   __| |
  71. | |_) || |_| || |_) |(_) | | | | / _ \\ \ /\ / /| '_ \ | | / _ \  / _` | / _` |
  72. |  __/ |  _  ||  __/  _  | |_| || (_) |\ V  V / | | | || || (_) || (_| || (_| |
  73. |_|    |_| |_||_|    (_) |____/  \___/  \_/\_/  |_| |_||_| \___/  \__,_| \__,_|
  74.                                                                              
  75. HTTP/1.1 302 Found
  76. php 7.3.3 Archive found, skipping download...
  77. php-7.3.3.tar.xz valid file.
  78.  
  79. PHP VERSION ID: 70303
  80.  
  81. *************************************************
  82. * Updating php.ini...
  83. *************************************************
  84. old php.ini will be saved at /usr/local/lib/php.ini-oldversion_080319-220432
  85. if you have modified your old php.ini i.e. installed and loaded
  86. APC, Xcache, Memcache or Suhosin - please re-install them after php upgrade
  87. ...
  88.  
  89. make: *** No rule to make target `clean'.  Stop.
  90. Forcing buildconf
  91. Removing configure caches
  92. rebuilding aclocal.m4
  93. rebuilding configure
  94. rebuilding main/php_config.h.in
  95. find . -name \*.gcno -o -name \*.gcda | xargs rm -f
  96. find . -name \*.lo -o -name \*.o | xargs rm -f
  97. find . -name \*.la -o -name \*.a | xargs rm -f
  98. find . -name \*.so | xargs rm -f
  99. find . -name .libs -a -type d|xargs rm -rf
  100. rm -f libphp7.la sapi/cli/php sapi/cgi/php-cgi  sapi/fpm/php-fpm libphp7.la modules/* libs/*
  101.   ____   _   _  ____        ____                __  _                          
  102.  |  _ \ | | | ||  _ \  _   / ___| ___   _ __   / _|(_)  __ _  _   _  _ __  ___
  103.  | |_) || |_| || |_) |(_) | |    / _ \ | '_ \ | |_ | | / _` || | | || '__|/ _ \
  104.  |  __/ |  _  ||  __/  _  | |___| (_) || | | ||  _|| || (_| || |_| || |  |  __/
  105.  |_|    |_| |_||_|    (_)  \____|\___/ |_| |_||_|  |_| \__, | \__,_||_|   \___|
  106.                                                        |___/                  
  107. /svr-setup /svr-setup/php-7.3.3/fpm-build
  108. libsodium-1.0.17.tar.gz found, skipping download...
  109. Making clean in builds
  110. make[1]: Entering directory `/svr-setup/libsodium-1.0.17/builds'
  111. rm -rf .libs _libs
  112. rm -f *.lo
  113. make[1]: Leaving directory `/svr-setup/libsodium-1.0.17/builds'
  114. Making clean in contrib
  115. make[1]: Entering directory `/svr-setup/libsodium-1.0.17/contrib'
  116. rm -rf .libs _libs
  117. rm -f *.lo
  118. make[1]: Leaving directory `/svr-setup/libsodium-1.0.17/contrib'
  119. Making clean in dist-build
  120. make[1]: Entering directory `/svr-setup/libsodium-1.0.17/dist-build'
  121. rm -rf .libs _libs
  122. rm -f *.lo
  123. make[1]: Leaving directory `/svr-setup/libsodium-1.0.17/dist-build'
  124. Making clean in msvc-scripts
  125. make[1]: Entering directory `/svr-setup/libsodium-1.0.17/msvc-scripts'
  126. rm -rf .libs _libs
  127. rm -f *.lo
  128. make[1]: Leaving directory `/svr-setup/libsodium-1.0.17/msvc-scripts'
  129. Making clean in src
  130. make[1]: Entering directory `/svr-setup/libsodium-1.0.17/src'
  131. Making clean in libsodium
  132. make[2]: Entering directory `/svr-setup/libsodium-1.0.17/src/libsodium'
  133. Making clean in include
  134. make[3]: Entering directory `/svr-setup/libsodium-1.0.17/src/libsodium/include'
  135. rm -rf .libs _libs
  136. rm -f *.lo
  137. make[3]: Leaving directory `/svr-setup/libsodium-1.0.17/src/libsodium/include'
  138. make[3]: Entering directory `/svr-setup/libsodium-1.0.17/src/libsodium'
  139. test -z "" || rm -f
  140. test -z "libsodium.la" || rm -f libsodium.la
  141. rm -f ./so_locations
  142. rm -rf .libs _libs
  143. rm -rf crypto_aead/aes256gcm/aesni/.libs crypto_aead/aes256gcm/aesni/_libs
  144. rm -rf crypto_aead/chacha20poly1305/sodium/.libs crypto_aead/chacha20poly1305/sodium/_libs
  145. rm -rf crypto_aead/xchacha20poly1305/sodium/.libs crypto_aead/xchacha20poly1305/sodium/_libs
  146. rm -rf crypto_auth/.libs crypto_auth/_libs
  147. rm -rf crypto_auth/hmacsha256/.libs crypto_auth/hmacsha256/_libs
  148. rm -rf crypto_auth/hmacsha512/.libs crypto_auth/hmacsha512/_libs
  149. rm -rf crypto_auth/hmacsha512256/.libs crypto_auth/hmacsha512256/_libs
  150. rm -rf crypto_box/.libs crypto_box/_libs
  151. rm -rf crypto_box/curve25519xchacha20poly1305/.libs crypto_box/curve25519xchacha20poly1305/_libs
  152. rm -rf crypto_box/curve25519xsalsa20poly1305/.libs crypto_box/curve25519xsalsa20poly1305/_libs
  153. rm -rf crypto_core/ed25519/.libs crypto_core/ed25519/_libs
  154. rm -rf crypto_core/ed25519/ref10/.libs crypto_core/ed25519/ref10/_libs
  155. rm -rf crypto_core/hchacha20/.libs crypto_core/hchacha20/_libs
  156. rm -rf crypto_core/hsalsa20/.libs crypto_core/hsalsa20/_libs
  157. rm -rf crypto_core/hsalsa20/ref2/.libs crypto_core/hsalsa20/ref2/_libs
  158. rm -rf crypto_core/salsa/ref/.libs crypto_core/salsa/ref/_libs
  159. rm -rf crypto_generichash/.libs crypto_generichash/_libs
  160. rm -rf crypto_generichash/blake2b/.libs crypto_generichash/blake2b/_libs
  161. rm -rf crypto_generichash/blake2b/ref/.libs crypto_generichash/blake2b/ref/_libs
  162. rm -rf crypto_hash/.libs crypto_hash/_libs
  163. rm -rf crypto_hash/sha256/.libs crypto_hash/sha256/_libs
  164. rm -rf crypto_hash/sha256/cp/.libs crypto_hash/sha256/cp/_libs
  165. rm -rf crypto_hash/sha512/.libs crypto_hash/sha512/_libs
  166. rm -rf crypto_hash/sha512/cp/.libs crypto_hash/sha512/cp/_libs
  167. rm -rf crypto_kdf/.libs crypto_kdf/_libs
  168. rm -rf crypto_kdf/blake2b/.libs crypto_kdf/blake2b/_libs
  169. rm -rf crypto_kx/.libs crypto_kx/_libs
  170. rm -rf crypto_onetimeauth/.libs crypto_onetimeauth/_libs
  171. rm -rf crypto_onetimeauth/poly1305/.libs crypto_onetimeauth/poly1305/_libs
  172. rm -rf crypto_onetimeauth/poly1305/donna/.libs crypto_onetimeauth/poly1305/donna/_libs
  173. rm -rf crypto_onetimeauth/poly1305/sse2/.libs crypto_onetimeauth/poly1305/sse2/_libs
  174. rm -rf crypto_pwhash/.libs crypto_pwhash/_libs
  175. rm -rf crypto_pwhash/argon2/.libs crypto_pwhash/argon2/_libs
  176. rm -rf crypto_pwhash/scryptsalsa208sha256/.libs crypto_pwhash/scryptsalsa208sha256/_libs
  177. rm -rf crypto_pwhash/scryptsalsa208sha256/nosse/.libs crypto_pwhash/scryptsalsa208sha256/nosse/_libs
  178. rm -rf crypto_pwhash/scryptsalsa208sha256/sse/.libs crypto_pwhash/scryptsalsa208sha256/sse/_libs
  179. rm -rf crypto_scalarmult/.libs crypto_scalarmult/_libs
  180. rm -rf crypto_scalarmult/curve25519/.libs crypto_scalarmult/curve25519/_libs
  181. rm -rf crypto_scalarmult/curve25519/ref10/.libs crypto_scalarmult/curve25519/ref10/_libs
  182. rm -rf crypto_scalarmult/curve25519/sandy2x/.libs crypto_scalarmult/curve25519/sandy2x/_libs
  183. rm -rf crypto_scalarmult/ed25519/ref10/.libs crypto_scalarmult/ed25519/ref10/_libs
  184. rm -rf crypto_secretbox/.libs crypto_secretbox/_libs
  185. rm -rf crypto_secretbox/xchacha20poly1305/.libs crypto_secretbox/xchacha20poly1305/_libs
  186. rm -rf crypto_secretbox/xsalsa20poly1305/.libs crypto_secretbox/xsalsa20poly1305/_libs
  187. rm -rf crypto_secretstream/xchacha20poly1305/.libs crypto_secretstream/xchacha20poly1305/_libs
  188. rm -rf crypto_shorthash/.libs crypto_shorthash/_libs
  189. rm -rf crypto_shorthash/siphash24/.libs crypto_shorthash/siphash24/_libs
  190. rm -rf crypto_shorthash/siphash24/ref/.libs crypto_shorthash/siphash24/ref/_libs
  191. rm -rf crypto_sign/.libs crypto_sign/_libs
  192. rm -rf crypto_sign/ed25519/.libs crypto_sign/ed25519/_libs
  193. rm -rf crypto_sign/ed25519/ref10/.libs crypto_sign/ed25519/ref10/_libs
  194. rm -rf crypto_stream/.libs crypto_stream/_libs
  195. rm -rf crypto_stream/chacha20/.libs crypto_stream/chacha20/_libs
  196. rm -rf crypto_stream/chacha20/dolbeau/.libs crypto_stream/chacha20/dolbeau/_libs
  197. rm -rf crypto_stream/chacha20/ref/.libs crypto_stream/chacha20/ref/_libs
  198. rm -rf crypto_stream/salsa20/.libs crypto_stream/salsa20/_libs
  199. rm -rf crypto_stream/salsa20/ref/.libs crypto_stream/salsa20/ref/_libs
  200. rm -rf crypto_stream/salsa20/xmm6/.libs crypto_stream/salsa20/xmm6/_libs
  201. rm -rf crypto_stream/salsa20/xmm6int/.libs crypto_stream/salsa20/xmm6int/_libs
  202. rm -rf crypto_stream/salsa2012/.libs crypto_stream/salsa2012/_libs
  203. rm -rf crypto_stream/salsa2012/ref/.libs crypto_stream/salsa2012/ref/_libs
  204. rm -rf crypto_stream/salsa208/.libs crypto_stream/salsa208/_libs
  205. rm -rf crypto_stream/salsa208/ref/.libs crypto_stream/salsa208/ref/_libs
  206. rm -rf crypto_stream/xchacha20/.libs crypto_stream/xchacha20/_libs
  207. rm -rf crypto_stream/xsalsa20/.libs crypto_stream/xsalsa20/_libs
  208. rm -rf crypto_verify/sodium/.libs crypto_verify/sodium/_libs
  209. rm -rf randombytes/.libs randombytes/_libs
  210. rm -rf randombytes/nativeclient/.libs randombytes/nativeclient/_libs
  211. rm -rf randombytes/salsa20/.libs randombytes/salsa20/_libs
  212. rm -rf randombytes/sysrandom/.libs randombytes/sysrandom/_libs
  213. rm -rf sodium/.libs sodium/_libs
  214. test -z "libaesni.la libsse2.la libssse3.la libsse41.la libavx2.la libavx512f.la librdrand.la" || rm -f libaesni.la libsse2.la libssse3.la libsse41.la libavx2.la libavx512f.la librdrand.la
  215. rm -f ./so_locations
  216. rm -f *.o
  217. rm -f crypto_aead/aes256gcm/aesni/*.o
  218. rm -f crypto_aead/aes256gcm/aesni/*.lo
  219. rm -f crypto_aead/chacha20poly1305/sodium/*.o
  220. rm -f crypto_aead/chacha20poly1305/sodium/*.lo
  221. rm -f crypto_aead/xchacha20poly1305/sodium/*.o
  222. rm -f crypto_aead/xchacha20poly1305/sodium/*.lo
  223. rm -f crypto_auth/*.o
  224. rm -f crypto_auth/*.lo
  225. rm -f crypto_auth/hmacsha256/*.o
  226. rm -f crypto_auth/hmacsha256/*.lo
  227. rm -f crypto_auth/hmacsha512/*.o
  228. rm -f crypto_auth/hmacsha512/*.lo
  229. rm -f crypto_auth/hmacsha512256/*.o
  230. rm -f crypto_auth/hmacsha512256/*.lo
  231. rm -f crypto_box/*.o
  232. rm -f crypto_box/*.lo
  233. rm -f crypto_box/curve25519xchacha20poly1305/*.o
  234. rm -f crypto_box/curve25519xchacha20poly1305/*.lo
  235. rm -f crypto_box/curve25519xsalsa20poly1305/*.o
  236. rm -f crypto_box/curve25519xsalsa20poly1305/*.lo
  237. rm -f crypto_core/ed25519/*.o
  238. rm -f crypto_core/ed25519/*.lo
  239. rm -f crypto_core/ed25519/ref10/*.o
  240. rm -f crypto_core/ed25519/ref10/*.lo
  241. rm -f crypto_core/hchacha20/*.o
  242. rm -f crypto_core/hchacha20/*.lo
  243. rm -f crypto_core/hsalsa20/*.o
  244. rm -f crypto_core/hsalsa20/*.lo
  245. rm -f crypto_core/hsalsa20/ref2/*.o
  246. rm -f crypto_core/hsalsa20/ref2/*.lo
  247. rm -f crypto_core/salsa/ref/*.o
  248. rm -f crypto_core/salsa/ref/*.lo
  249. rm -f crypto_generichash/*.o
  250. rm -f crypto_generichash/*.lo
  251. rm -f crypto_generichash/blake2b/*.o
  252. rm -f crypto_generichash/blake2b/*.lo
  253. rm -f crypto_generichash/blake2b/ref/*.o
  254. rm -f crypto_generichash/blake2b/ref/*.lo
  255. rm -f crypto_hash/*.o
  256. rm -f crypto_hash/*.lo
  257. rm -f crypto_hash/sha256/*.o
  258. rm -f crypto_hash/sha256/*.lo
  259. rm -f crypto_hash/sha256/cp/*.o
  260. rm -f crypto_hash/sha256/cp/*.lo
  261. rm -f crypto_hash/sha512/*.o
  262. rm -f crypto_hash/sha512/*.lo
  263. rm -f crypto_hash/sha512/cp/*.o
  264. rm -f crypto_hash/sha512/cp/*.lo
  265. rm -f crypto_kdf/*.o
  266. rm -f crypto_kdf/*.lo
  267. rm -f crypto_kdf/blake2b/*.o
  268. rm -f crypto_kdf/blake2b/*.lo
  269. rm -f crypto_kx/*.o
  270. rm -f crypto_kx/*.lo
  271. rm -f crypto_onetimeauth/*.o
  272. rm -f crypto_onetimeauth/*.lo
  273. rm -f crypto_onetimeauth/poly1305/*.o
  274. rm -f crypto_onetimeauth/poly1305/*.lo
  275. rm -f crypto_onetimeauth/poly1305/donna/*.o
  276. rm -f crypto_onetimeauth/poly1305/donna/*.lo
  277. rm -f crypto_onetimeauth/poly1305/sse2/*.o
  278. rm -f crypto_onetimeauth/poly1305/sse2/*.lo
  279. rm -f crypto_pwhash/*.o
  280. rm -f crypto_pwhash/*.lo
  281. rm -f crypto_pwhash/argon2/*.o
  282. rm -f crypto_pwhash/argon2/*.lo
  283. rm -f crypto_pwhash/scryptsalsa208sha256/*.o
  284. rm -f crypto_pwhash/scryptsalsa208sha256/*.lo
  285. rm -f crypto_pwhash/scryptsalsa208sha256/nosse/*.o
  286. rm -f crypto_pwhash/scryptsalsa208sha256/nosse/*.lo
  287. rm -f crypto_pwhash/scryptsalsa208sha256/sse/*.o
  288. rm -f crypto_pwhash/scryptsalsa208sha256/sse/*.lo
  289. rm -f crypto_scalarmult/*.o
  290. rm -f crypto_scalarmult/*.lo
  291. rm -f crypto_scalarmult/curve25519/*.o
  292. rm -f crypto_scalarmult/curve25519/*.lo
  293. rm -f crypto_scalarmult/curve25519/ref10/*.o
  294. rm -f crypto_scalarmult/curve25519/ref10/*.lo
  295. rm -f crypto_scalarmult/curve25519/sandy2x/*.o
  296. rm -f crypto_scalarmult/curve25519/sandy2x/*.lo
  297. rm -f crypto_scalarmult/ed25519/ref10/*.o
  298. rm -f crypto_scalarmult/ed25519/ref10/*.lo
  299. rm -f crypto_secretbox/*.o
  300. rm -f crypto_secretbox/*.lo
  301. rm -f crypto_secretbox/xchacha20poly1305/*.o
  302. rm -f crypto_secretbox/xchacha20poly1305/*.lo
  303. rm -f crypto_secretbox/xsalsa20poly1305/*.o
  304. rm -f crypto_secretbox/xsalsa20poly1305/*.lo
  305. rm -f crypto_secretstream/xchacha20poly1305/*.o
  306. rm -f crypto_secretstream/xchacha20poly1305/*.lo
  307. rm -f crypto_shorthash/*.o
  308. rm -f crypto_shorthash/*.lo
  309. rm -f crypto_shorthash/siphash24/*.o
  310. rm -f crypto_shorthash/siphash24/*.lo
  311. rm -f crypto_shorthash/siphash24/ref/*.o
  312. rm -f crypto_shorthash/siphash24/ref/*.lo
  313. rm -f crypto_sign/*.o
  314. rm -f crypto_sign/*.lo
  315. rm -f crypto_sign/ed25519/*.o
  316. rm -f crypto_sign/ed25519/*.lo
  317. rm -f crypto_sign/ed25519/ref10/*.o
  318. rm -f crypto_sign/ed25519/ref10/*.lo
  319. rm -f crypto_stream/*.o
  320. rm -f crypto_stream/*.lo
  321. rm -f crypto_stream/chacha20/*.o
  322. rm -f crypto_stream/chacha20/*.lo
  323. rm -f crypto_stream/chacha20/dolbeau/*.o
  324. rm -f crypto_stream/chacha20/dolbeau/*.lo
  325. rm -f crypto_stream/chacha20/ref/*.o
  326. rm -f crypto_stream/chacha20/ref/*.lo
  327. rm -f crypto_stream/salsa20/*.o
  328. rm -f crypto_stream/salsa20/*.lo
  329. rm -f crypto_stream/salsa20/ref/*.o
  330. rm -f crypto_stream/salsa20/ref/*.lo
  331. rm -f crypto_stream/salsa20/xmm6/*.o
  332. rm -f crypto_stream/salsa20/xmm6/*.lo
  333. rm -f crypto_stream/salsa20/xmm6int/*.o
  334. rm -f crypto_stream/salsa20/xmm6int/*.lo
  335. rm -f crypto_stream/salsa2012/*.o
  336. rm -f crypto_stream/salsa2012/*.lo
  337. rm -f crypto_stream/salsa2012/ref/*.o
  338. rm -f crypto_stream/salsa2012/ref/*.lo
  339. rm -f crypto_stream/salsa208/*.o
  340. rm -f crypto_stream/salsa208/*.lo
  341. rm -f crypto_stream/salsa208/ref/*.o
  342. rm -f crypto_stream/salsa208/ref/*.lo
  343. rm -f crypto_stream/xchacha20/*.o
  344. rm -f crypto_stream/xchacha20/*.lo
  345. rm -f crypto_stream/xsalsa20/*.o
  346. rm -f crypto_stream/xsalsa20/*.lo
  347. rm -f crypto_verify/sodium/*.o
  348. rm -f crypto_verify/sodium/*.lo
  349. rm -f randombytes/*.o
  350. rm -f randombytes/*.lo
  351. rm -f randombytes/nativeclient/*.o
  352. rm -f randombytes/nativeclient/*.lo
  353. rm -f randombytes/salsa20/*.o
  354. rm -f randombytes/salsa20/*.lo
  355. rm -f randombytes/sysrandom/*.o
  356. rm -f randombytes/sysrandom/*.lo
  357. rm -f sodium/*.o
  358. rm -f sodium/*.lo
  359. rm -f *.lo
  360. make[3]: Leaving directory `/svr-setup/libsodium-1.0.17/src/libsodium'
  361. make[2]: Leaving directory `/svr-setup/libsodium-1.0.17/src/libsodium'
  362. make[2]: Entering directory `/svr-setup/libsodium-1.0.17/src'
  363. rm -rf .libs _libs
  364. rm -f *.lo
  365. make[2]: Leaving directory `/svr-setup/libsodium-1.0.17/src'
  366. make[1]: Leaving directory `/svr-setup/libsodium-1.0.17/src'
  367. Making clean in test
  368. make[1]: Entering directory `/svr-setup/libsodium-1.0.17/test'
  369. Making clean in default
  370. make[2]: Entering directory `/svr-setup/libsodium-1.0.17/test/default'
  371.  rm -f aead_aes256gcm aead_aes256gcm2 aead_chacha20poly1305 aead_chacha20poly13052 aead_xchacha20poly1305 auth auth2 auth3 auth5 auth6 auth7 box box2 box7 box8 box_easy box_easy2 box_seal box_seed chacha20 codecs core1 core2 core3 core4 core5 core6 ed25519_convert generichash generichash2 generichash3 hash hash3 kdf keygen kx metamorphic misuse onetimeauth onetimeauth2 onetimeauth7 pwhash_argon2i pwhash_argon2id randombytes scalarmult scalarmult2 scalarmult5 scalarmult6 scalarmult7 scalarmult8 secretbox secretbox2 secretbox7 secretbox8 secretbox_easy secretbox_easy2 secretstream shorthash sign sodium_core sodium_utils sodium_version stream stream2 stream3 stream4 verify1 sodium_utils2 sodium_utils3 core_ed25519 pwhash_scrypt pwhash_scrypt_ll scalarmult_ed25519 siphashx24 xchacha20
  372. test -z "" || rm -f
  373. rm -rf .libs _libs
  374. rm -f *.o
  375. test -z "aead_aes256gcm.log aead_aes256gcm2.log aead_chacha20poly1305.log aead_chacha20poly13052.log aead_xchacha20poly1305.log auth.log auth2.log auth3.log auth5.log auth6.log auth7.log box.log box2.log box7.log box8.log box_easy.log box_easy2.log box_seal.log box_seed.log chacha20.log codecs.log core1.log core2.log core3.log core4.log core5.log core6.log ed25519_convert.log generichash.log generichash2.log generichash3.log hash.log hash3.log kdf.log keygen.log kx.log metamorphic.log misuse.log onetimeauth.log onetimeauth2.log onetimeauth7.log pwhash_argon2i.log pwhash_argon2id.log randombytes.log scalarmult.log scalarmult2.log scalarmult5.log scalarmult6.log scalarmult7.log scalarmult8.log secretbox.log secretbox2.log secretbox7.log secretbox8.log secretbox_easy.log secretbox_easy2.log secretstream.log shorthash.log sign.log sodium_core.log sodium_utils.log sodium_version.log stream.log stream2.log stream3.log stream4.log verify1.log sodium_utils2.log sodium_utils3.log core_ed25519.log pwhash_scrypt.log pwhash_scrypt_ll.log scalarmult_ed25519.log siphashx24.log xchacha20.log" || rm -f aead_aes256gcm.log aead_aes256gcm2.log aead_chacha20poly1305.log aead_chacha20poly13052.log aead_xchacha20poly1305.log auth.log auth2.log auth3.log auth5.log auth6.log auth7.log box.log box2.log box7.log box8.log box_easy.log box_easy2.log box_seal.log box_seed.log chacha20.log codecs.log core1.log core2.log core3.log core4.log core5.log core6.log ed25519_convert.log generichash.log generichash2.log generichash3.log hash.log hash3.log kdf.log keygen.log kx.log metamorphic.log misuse.log onetimeauth.log onetimeauth2.log onetimeauth7.log pwhash_argon2i.log pwhash_argon2id.log randombytes.log scalarmult.log scalarmult2.log scalarmult5.log scalarmult6.log scalarmult7.log scalarmult8.log secretbox.log secretbox2.log secretbox7.log secretbox8.log secretbox_easy.log secretbox_easy2.log secretstream.log shorthash.log sign.log sodium_core.log sodium_utils.log sodium_version.log stream.log stream2.log stream3.log stream4.log verify1.log sodium_utils2.log sodium_utils3.log core_ed25519.log pwhash_scrypt.log pwhash_scrypt_ll.log scalarmult_ed25519.log siphashx24.log xchacha20.log
  376. test -z "aead_aes256gcm.trs aead_aes256gcm2.trs aead_chacha20poly1305.trs aead_chacha20poly13052.trs aead_xchacha20poly1305.trs auth.trs auth2.trs auth3.trs auth5.trs auth6.trs auth7.trs box.trs box2.trs box7.trs box8.trs box_easy.trs box_easy2.trs box_seal.trs box_seed.trs chacha20.trs codecs.trs core1.trs core2.trs core3.trs core4.trs core5.trs core6.trs ed25519_convert.trs generichash.trs generichash2.trs generichash3.trs hash.trs hash3.trs kdf.trs keygen.trs kx.trs metamorphic.trs misuse.trs onetimeauth.trs onetimeauth2.trs onetimeauth7.trs pwhash_argon2i.trs pwhash_argon2id.trs randombytes.trs scalarmult.trs scalarmult2.trs scalarmult5.trs scalarmult6.trs scalarmult7.trs scalarmult8.trs secretbox.trs secretbox2.trs secretbox7.trs secretbox8.trs secretbox_easy.trs secretbox_easy2.trs secretstream.trs shorthash.trs sign.trs sodium_core.trs sodium_utils.trs sodium_version.trs stream.trs stream2.trs stream3.trs stream4.trs verify1.trs sodium_utils2.trs sodium_utils3.trs core_ed25519.trs pwhash_scrypt.trs pwhash_scrypt_ll.trs scalarmult_ed25519.trs siphashx24.trs xchacha20.trs" || rm -f aead_aes256gcm.trs aead_aes256gcm2.trs aead_chacha20poly1305.trs aead_chacha20poly13052.trs aead_xchacha20poly1305.trs auth.trs auth2.trs auth3.trs auth5.trs auth6.trs auth7.trs box.trs box2.trs box7.trs box8.trs box_easy.trs box_easy2.trs box_seal.trs box_seed.trs chacha20.trs codecs.trs core1.trs core2.trs core3.trs core4.trs core5.trs core6.trs ed25519_convert.trs generichash.trs generichash2.trs generichash3.trs hash.trs hash3.trs kdf.trs keygen.trs kx.trs metamorphic.trs misuse.trs onetimeauth.trs onetimeauth2.trs onetimeauth7.trs pwhash_argon2i.trs pwhash_argon2id.trs randombytes.trs scalarmult.trs scalarmult2.trs scalarmult5.trs scalarmult6.trs scalarmult7.trs scalarmult8.trs secretbox.trs secretbox2.trs secretbox7.trs secretbox8.trs secretbox_easy.trs secretbox_easy2.trs secretstream.trs shorthash.trs sign.trs sodium_core.trs sodium_utils.trs sodium_version.trs stream.trs stream2.trs stream3.trs stream4.trs verify1.trs sodium_utils2.trs sodium_utils3.trs core_ed25519.trs pwhash_scrypt.trs pwhash_scrypt_ll.trs scalarmult_ed25519.trs siphashx24.trs xchacha20.trs
  377. test -z "test-suite.log" || rm -f test-suite.log
  378. rm -f *.lo
  379. make[2]: Leaving directory `/svr-setup/libsodium-1.0.17/test/default'
  380. make[2]: Entering directory `/svr-setup/libsodium-1.0.17/test'
  381. rm -rf .libs _libs
  382. rm -f *.lo
  383. make[2]: Leaving directory `/svr-setup/libsodium-1.0.17/test'
  384. make[1]: Leaving directory `/svr-setup/libsodium-1.0.17/test'
  385. make[1]: Entering directory `/svr-setup/libsodium-1.0.17'
  386. rm -rf .libs _libs
  387. rm -f *.lo
  388. make[1]: Leaving directory `/svr-setup/libsodium-1.0.17'
  389. checking build system type... x86_64-pc-linux-gnu
  390. checking host system type... x86_64-pc-linux-gnu
  391. checking for a BSD-compatible install... /bin/install -c
  392. checking whether build environment is sane... yes
  393. checking for a thread-safe mkdir -p... /bin/mkdir -p
  394. checking for gawk... gawk
  395. checking whether make sets $(MAKE)... yes
  396. checking whether make supports nested variables... yes
  397. checking whether UID '0' is supported by ustar format... yes
  398. checking whether GID '0' is supported by ustar format... yes
  399. checking how to create a ustar tar archive... gnutar
  400. checking whether make supports nested variables... (cached) yes
  401. checking whether to enable maintainer-specific portions of Makefiles... no
  402. checking whether make supports the include directive... yes (GNU style)
  403. checking for gcc... ccache gcc
  404. checking whether the C compiler works... yes
  405. checking for C compiler default output file name... a.out
  406. checking for suffix of executables...
  407. checking whether we are cross compiling... no
  408. checking for suffix of object files... o
  409. checking whether we are using the GNU C compiler... yes
  410. checking whether ccache gcc accepts -g... yes
  411. checking for ccache gcc option to accept ISO C89... none needed
  412. checking whether ccache gcc understands -c and -o together... yes
  413. checking dependency style of ccache gcc... gcc3
  414. checking for a sed that does not truncate output... /bin/sed
  415. checking how to run the C preprocessor... ccache gcc -E
  416. checking for grep that handles long lines and -e... /bin/grep
  417. checking for egrep... /bin/grep -E
  418. checking whether ccache gcc is Clang... no
  419. checking whether pthreads work with -pthread... yes
  420. checking for joinable pthread attribute... PTHREAD_CREATE_JOINABLE
  421. checking whether more special flags are required for pthreads... no
  422. checking for PTHREAD_PRIO_INHERIT... yes
  423. checking for ccache gcc option to accept ISO C99... -std=gnu99
  424. checking dependency style of ccache gcc -std=gnu99... gcc3
  425. checking for ANSI C header files... yes
  426. checking for sys/types.h... yes
  427. checking for sys/stat.h... yes
  428. checking for stdlib.h... yes
  429. checking for string.h... yes
  430. checking for memory.h... yes
  431. checking for strings.h... yes
  432. checking for inttypes.h... yes
  433. checking for stdint.h... yes
  434. checking for unistd.h... yes
  435. checking minix/config.h usability... no
  436. checking minix/config.h presence... no
  437. checking for minix/config.h... no
  438. checking whether it is safe to define __EXTENSIONS__... yes
  439. checking for variable-length arrays... yes
  440. checking for __native_client__ defined... no
  441. checking for _FORTIFY_SOURCE defined... no
  442. checking whether C compiler accepts -D_FORTIFY_SOURCE=2... yes
  443. checking whether C compiler accepts -fvisibility=hidden... yes
  444. checking whether C compiler accepts -fPIC... yes
  445. checking whether C compiler accepts -fPIE... yes
  446. checking whether the linker accepts -pie... yes
  447. checking whether C compiler accepts -fno-strict-aliasing... yes
  448. checking whether C compiler accepts -fno-strict-overflow... yes
  449. checking whether C compiler accepts -fstack-protector... yes
  450. checking whether the linker accepts -fstack-protector... yes
  451. checking whether C compiler accepts -g -O2 -pthread -fvisibility=hidden -fPIC -fPIE -fno-strict-aliasing -fno-strict-overflow -fstack-protector -Wall... yes
  452. checking whether C compiler accepts -g -O2 -pthread -fvisibility=hidden -fPIC -fPIE -fno-strict-aliasing -fno-strict-overflow -fstack-protector -Wextra... yes
  453. checking for clang... no
  454. checking whether C compiler accepts -g -O2 -pthread -fvisibility=hidden -fPIC -fPIE -fno-strict-aliasing -fno-strict-overflow -fstack-protector -Wextra -Wbad-function-cast... yes
  455. checking whether C compiler accepts -g -O2 -pthread -fvisibility=hidden -fPIC -fPIE -fno-strict-aliasing -fno-strict-overflow -fstack-protector -Wextra -Wbad-function-cast -Wcast-qual... yes
  456. checking whether C compiler accepts -g -O2 -pthread -fvisibility=hidden -fPIC -fPIE -fno-strict-aliasing -fno-strict-overflow -fstack-protector -Wextra -Wbad-function-cast -Wcast-qual -Wdiv-by-zero... yes
  457. checking whether C compiler accepts -g -O2 -pthread -fvisibility=hidden -fPIC -fPIE -fno-strict-aliasing -fno-strict-overflow -fstack-protector -Wextra -Wbad-function-cast -Wcast-qual -Wdiv-by-zero -Wduplicated-branches... no
  458. checking whether C compiler accepts -g -O2 -pthread -fvisibility=hidden -fPIC -fPIE -fno-strict-aliasing -fno-strict-overflow -fstack-protector -Wextra -Wbad-function-cast -Wcast-qual -Wdiv-by-zero -Wduplicated-cond... no
  459. checking whether C compiler accepts -g -O2 -pthread -fvisibility=hidden -fPIC -fPIE -fno-strict-aliasing -fno-strict-overflow -fstack-protector -Wextra -Wbad-function-cast -Wcast-qual -Wdiv-by-zero -Wfloat-equal... yes
  460. checking whether C compiler accepts -g -O2 -pthread -fvisibility=hidden -fPIC -fPIE -fno-strict-aliasing -fno-strict-overflow -fstack-protector -Wextra -Wbad-function-cast -Wcast-qual -Wdiv-by-zero -Wfloat-equal -Wformat=2... yes
  461. checking whether C compiler accepts -g -O2 -pthread -fvisibility=hidden -fPIC -fPIE -fno-strict-aliasing -fno-strict-overflow -fstack-protector -Wextra -Wbad-function-cast -Wcast-qual -Wdiv-by-zero -Wfloat-equal -Wformat=2 -Wlogical-op... yes
  462. checking whether C compiler accepts -g -O2 -pthread -fvisibility=hidden -fPIC -fPIE -fno-strict-aliasing -fno-strict-overflow -fstack-protector -Wextra -Wbad-function-cast -Wcast-qual -Wdiv-by-zero -Wfloat-equal -Wformat=2 -Wlogical-op -Wmaybe-uninitialized... yes
  463. checking whether C compiler accepts -g -O2 -pthread -fvisibility=hidden -fPIC -fPIE -fno-strict-aliasing -fno-strict-overflow -fstack-protector -Wextra -Wbad-function-cast -Wcast-qual -Wdiv-by-zero -Wfloat-equal -Wformat=2 -Wlogical-op -Wmaybe-uninitialized -Wmisleading-indentation... no
  464. checking whether C compiler accepts -g -O2 -pthread -fvisibility=hidden -fPIC -fPIE -fno-strict-aliasing -fno-strict-overflow -fstack-protector -Wextra -Wbad-function-cast -Wcast-qual -Wdiv-by-zero -Wfloat-equal -Wformat=2 -Wlogical-op -Wmaybe-uninitialized -Wmissing-declarations... yes
  465. checking whether C compiler accepts -g -O2 -pthread -fvisibility=hidden -fPIC -fPIE -fno-strict-aliasing -fno-strict-overflow -fstack-protector -Wextra -Wbad-function-cast -Wcast-qual -Wdiv-by-zero -Wfloat-equal -Wformat=2 -Wlogical-op -Wmaybe-uninitialized -Wmissing-declarations -Wmissing-prototypes... yes
  466. checking whether C compiler accepts -g -O2 -pthread -fvisibility=hidden -fPIC -fPIE -fno-strict-aliasing -fno-strict-overflow -fstack-protector -Wextra -Wbad-function-cast -Wcast-qual -Wdiv-by-zero -Wfloat-equal -Wformat=2 -Wlogical-op -Wmaybe-uninitialized -Wmissing-declarations -Wmissing-prototypes -Wnested-externs... yes
  467. checking whether C compiler accepts -g -O2 -pthread -fvisibility=hidden -fPIC -fPIE -fno-strict-aliasing -fno-strict-overflow -fstack-protector -Wextra -Wbad-function-cast -Wcast-qual -Wdiv-by-zero -Wfloat-equal -Wformat=2 -Wlogical-op -Wmaybe-uninitialized -Wmissing-declarations -Wmissing-prototypes -Wnested-externs -Wno-type-limits... yes
  468. checking whether C compiler accepts -g -O2 -pthread -fvisibility=hidden -fPIC -fPIE -fno-strict-aliasing -fno-strict-overflow -fstack-protector -Wextra -Wbad-function-cast -Wcast-qual -Wdiv-by-zero -Wfloat-equal -Wformat=2 -Wlogical-op -Wmaybe-uninitialized -Wmissing-declarations -Wmissing-prototypes -Wnested-externs -Wno-type-limits -Wno-unknown-pragmas... yes
  469. checking whether C compiler accepts -g -O2 -pthread -fvisibility=hidden -fPIC -fPIE -fno-strict-aliasing -fno-strict-overflow -fstack-protector -Wextra -Wbad-function-cast -Wcast-qual -Wdiv-by-zero -Wfloat-equal -Wformat=2 -Wlogical-op -Wmaybe-uninitialized -Wmissing-declarations -Wmissing-prototypes -Wnested-externs -Wno-type-limits -Wno-unknown-pragmas -Wnormalized=id... yes
  470. checking whether C compiler accepts -g -O2 -pthread -fvisibility=hidden -fPIC -fPIE -fno-strict-aliasing -fno-strict-overflow -fstack-protector -Wextra -Wbad-function-cast -Wcast-qual -Wdiv-by-zero -Wfloat-equal -Wformat=2 -Wlogical-op -Wmaybe-uninitialized -Wmissing-declarations -Wmissing-prototypes -Wnested-externs -Wno-type-limits -Wno-unknown-pragmas -Wnormalized=id -Wnull-dereference... no
  471. checking whether C compiler accepts -g -O2 -pthread -fvisibility=hidden -fPIC -fPIE -fno-strict-aliasing -fno-strict-overflow -fstack-protector -Wextra -Wbad-function-cast -Wcast-qual -Wdiv-by-zero -Wfloat-equal -Wformat=2 -Wlogical-op -Wmaybe-uninitialized -Wmissing-declarations -Wmissing-prototypes -Wnested-externs -Wno-type-limits -Wno-unknown-pragmas -Wnormalized=id -Wold-style-declaration... yes
  472. checking whether C compiler accepts -g -O2 -pthread -fvisibility=hidden -fPIC -fPIE -fno-strict-aliasing -fno-strict-overflow -fstack-protector -Wextra -Wbad-function-cast -Wcast-qual -Wdiv-by-zero -Wfloat-equal -Wformat=2 -Wlogical-op -Wmaybe-uninitialized -Wmissing-declarations -Wmissing-prototypes -Wnested-externs -Wno-type-limits -Wno-unknown-pragmas -Wnormalized=id -Wold-style-declaration -Wpointer-arith... yes
  473. checking whether C compiler accepts -g -O2 -pthread -fvisibility=hidden -fPIC -fPIE -fno-strict-aliasing -fno-strict-overflow -fstack-protector -Wextra -Wbad-function-cast -Wcast-qual -Wdiv-by-zero -Wfloat-equal -Wformat=2 -Wlogical-op -Wmaybe-uninitialized -Wmissing-declarations -Wmissing-prototypes -Wnested-externs -Wno-type-limits -Wno-unknown-pragmas -Wnormalized=id -Wold-style-declaration -Wpointer-arith -Wredundant-decls... yes
  474. checking whether C compiler accepts -g -O2 -pthread -fvisibility=hidden -fPIC -fPIE -fno-strict-aliasing -fno-strict-overflow -fstack-protector -Wextra -Wbad-function-cast -Wcast-qual -Wdiv-by-zero -Wfloat-equal -Wformat=2 -Wlogical-op -Wmaybe-uninitialized -Wmissing-declarations -Wmissing-prototypes -Wnested-externs -Wno-type-limits -Wno-unknown-pragmas -Wnormalized=id -Wold-style-declaration -Wpointer-arith -Wredundant-decls -Wrestrict... no
  475. checking whether C compiler accepts -g -O2 -pthread -fvisibility=hidden -fPIC -fPIE -fno-strict-aliasing -fno-strict-overflow -fstack-protector -Wextra -Wbad-function-cast -Wcast-qual -Wdiv-by-zero -Wfloat-equal -Wformat=2 -Wlogical-op -Wmaybe-uninitialized -Wmissing-declarations -Wmissing-prototypes -Wnested-externs -Wno-type-limits -Wno-unknown-pragmas -Wnormalized=id -Wold-style-declaration -Wpointer-arith -Wredundant-decls -Wshorten-64-to-32... no
  476. checking whether C compiler accepts -g -O2 -pthread -fvisibility=hidden -fPIC -fPIE -fno-strict-aliasing -fno-strict-overflow -fstack-protector -Wextra -Wbad-function-cast -Wcast-qual -Wdiv-by-zero -Wfloat-equal -Wformat=2 -Wlogical-op -Wmaybe-uninitialized -Wmissing-declarations -Wmissing-prototypes -Wnested-externs -Wno-type-limits -Wno-unknown-pragmas -Wnormalized=id -Wold-style-declaration -Wpointer-arith -Wredundant-decls -Wsometimes-uninitialized... no
  477. checking whether C compiler accepts -g -O2 -pthread -fvisibility=hidden -fPIC -fPIE -fno-strict-aliasing -fno-strict-overflow -fstack-protector -Wextra -Wbad-function-cast -Wcast-qual -Wdiv-by-zero -Wfloat-equal -Wformat=2 -Wlogical-op -Wmaybe-uninitialized -Wmissing-declarations -Wmissing-prototypes -Wnested-externs -Wno-type-limits -Wno-unknown-pragmas -Wnormalized=id -Wold-style-declaration -Wpointer-arith -Wredundant-decls -Wstrict-prototypes... yes
  478. checking whether C compiler accepts -g -O2 -pthread -fvisibility=hidden -fPIC -fPIE -fno-strict-aliasing -fno-strict-overflow -fstack-protector -Wextra -Wbad-function-cast -Wcast-qual -Wdiv-by-zero -Wfloat-equal -Wformat=2 -Wlogical-op -Wmaybe-uninitialized -Wmissing-declarations -Wmissing-prototypes -Wnested-externs -Wno-type-limits -Wno-unknown-pragmas -Wnormalized=id -Wold-style-declaration -Wpointer-arith -Wredundant-decls -Wstrict-prototypes -Wswitch-enum... yes
  479. checking whether C compiler accepts -g -O2 -pthread -fvisibility=hidden -fPIC -fPIE -fno-strict-aliasing -fno-strict-overflow -fstack-protector -Wextra -Wbad-function-cast -Wcast-qual -Wdiv-by-zero -Wfloat-equal -Wformat=2 -Wlogical-op -Wmaybe-uninitialized -Wmissing-declarations -Wmissing-prototypes -Wnested-externs -Wno-type-limits -Wno-unknown-pragmas -Wnormalized=id -Wold-style-declaration -Wpointer-arith -Wredundant-decls -Wstrict-prototypes -Wswitch-enum -Wvariable-decl... no
  480. checking whether C compiler accepts -g -O2 -pthread -fvisibility=hidden -fPIC -fPIE -fno-strict-aliasing -fno-strict-overflow -fstack-protector -Wextra -Wbad-function-cast -Wcast-qual -Wdiv-by-zero -Wfloat-equal -Wformat=2 -Wlogical-op -Wmaybe-uninitialized -Wmissing-declarations -Wmissing-prototypes -Wnested-externs -Wno-type-limits -Wno-unknown-pragmas -Wnormalized=id -Wold-style-declaration -Wpointer-arith -Wredundant-decls -Wstrict-prototypes -Wswitch-enum -Wwrite-strings... yes
  481. checking whether the linker accepts -Wl,-z,relro... yes
  482. checking whether the linker accepts -Wl,-z,now... yes
  483. checking whether the linker accepts -Wl,-z,noexecstack... yes
  484. checking whether segmentation violations can be caught when using the C compiler... yes
  485. checking whether SIGABRT can be caught when using the C compiler... yes
  486. checking for thread local storage (TLS) class... __thread
  487. thread local storage is supported
  488. checking whether C compiler accepts -ftls-model=local-dynamic... yes
  489. checking how to print strings... printf
  490. checking for a sed that does not truncate output... (cached) /bin/sed
  491. checking for fgrep... /bin/grep -F
  492. checking for ld used by ccache gcc -std=gnu99... /bin/ld
  493. checking if the linker (/bin/ld) is GNU ld... yes
  494. checking for BSD- or MS-compatible name lister (nm)... /bin/nm -B
  495. checking the name lister (/bin/nm -B) interface... BSD nm
  496. checking whether ln -s works... yes
  497. checking the maximum length of command line arguments... 1572864
  498. checking how to convert x86_64-pc-linux-gnu file names to x86_64-pc-linux-gnu format... func_convert_file_noop
  499. checking how to convert x86_64-pc-linux-gnu file names to toolchain format... func_convert_file_noop
  500. checking for /bin/ld option to reload object files... -r
  501. checking for objdump... objdump
  502. checking how to recognize dependent libraries... pass_all
  503. checking for dlltool... no
  504. checking how to associate runtime and link libraries... printf %s\n
  505. checking for ar... ar
  506. checking for archiver @FILE support... @
  507. checking for strip... strip
  508. checking for ranlib... ranlib
  509. checking command to parse /bin/nm -B output from ccache gcc -std=gnu99 object... ok
  510. checking for sysroot... no
  511. checking for a working dd... /bin/dd
  512. checking how to truncate binary pipes... /bin/dd bs=4096 count=1
  513. checking for mt... no
  514. checking if : is a manifest tool... no
  515. checking for dlfcn.h... yes
  516. checking for objdir... .libs
  517. checking if ccache gcc -std=gnu99 supports -fno-rtti -fno-exceptions... no
  518. checking for ccache gcc -std=gnu99 option to produce PIC... -fPIC -DPIC
  519. checking if ccache gcc -std=gnu99 PIC flag -fPIC -DPIC works... yes
  520. checking if ccache gcc -std=gnu99 static flag -static works... no
  521. checking if ccache gcc -std=gnu99 supports -c -o file.o... yes
  522. checking if ccache gcc -std=gnu99 supports -c -o file.o... (cached) yes
  523. checking whether the ccache gcc -std=gnu99 linker (/bin/ld -m elf_x86_64) supports shared libraries... yes
  524. checking whether -lc should be explicitly linked in... no
  525. checking dynamic linker characteristics... GNU/Linux ld.so
  526. checking how to hardcode library paths into programs... immediate
  527. checking whether stripping libraries is possible... yes
  528. checking if libtool supports shared libraries... yes
  529. checking whether to build shared libraries... yes
  530. checking whether to build static libraries... yes
  531. checking for ar... (cached) ar
  532. checking whether C compiler accepts -mmmx... yes
  533. checking for MMX instructions set... yes
  534. checking whether C compiler accepts -mmmx... (cached) yes
  535. checking whether C compiler accepts -msse2... yes
  536. checking for SSE2 instructions set... yes
  537. checking whether C compiler accepts -msse2... (cached) yes
  538. checking whether C compiler accepts -msse3... yes
  539. checking for SSE3 instructions set... yes
  540. checking whether C compiler accepts -msse3... (cached) yes
  541. checking whether C compiler accepts -mssse3... yes
  542. checking for SSSE3 instructions set... yes
  543. checking whether C compiler accepts -mssse3... (cached) yes
  544. checking whether C compiler accepts -msse4.1... yes
  545. checking for SSE4.1 instructions set... yes
  546. checking whether C compiler accepts -msse4.1... (cached) yes
  547. checking whether C compiler accepts -mavx... yes
  548. checking for AVX instructions set... yes
  549. checking whether C compiler accepts -mavx... (cached) yes
  550. checking whether C compiler accepts -mavx2... yes
  551. checking for AVX2 instructions set... yes
  552. checking whether C compiler accepts -mavx2... (cached) yes
  553. checking if _mm256_broadcastsi128_si256 is correctly defined... yes
  554. checking whether C compiler accepts -mavx512f... no
  555. checking for AVX512F instructions set... no
  556. checking whether C compiler accepts -g -O2 -pthread -fvisibility=hidden -fPIC -fPIE -fno-strict-aliasing -fno-strict-overflow -fstack-protector -ftls-model=local-dynamic -mno-avx512f... no
  557. checking whether C compiler accepts -maes... yes
  558. checking whether C compiler accepts -mpclmul... yes
  559. checking for AESNI instructions set and PCLMULQDQ... yes
  560. checking whether C compiler accepts -maes... (cached) yes
  561. checking whether C compiler accepts -mpclmul... (cached) yes
  562. checking whether C compiler accepts -mrdrnd... yes
  563. checking for RDRAND... yes
  564. checking whether C compiler accepts -mrdrnd... (cached) yes
  565. checking sys/mman.h usability... yes
  566. checking sys/mman.h presence... yes
  567. checking for sys/mman.h... yes
  568. checking intrin.h usability... no
  569. checking intrin.h presence... no
  570. checking for intrin.h... no
  571. checking if _xgetbv() is available... no
  572. checking for inline... inline
  573. checking whether byte ordering is bigendian... (cached) no
  574. checking whether __STDC_LIMIT_MACROS is required... no
  575. checking whether we can use inline asm code... yes
  576. no
  577. checking whether we can use x86_64 asm code... yes
  578. checking whether we can assemble AVX opcodes... yes
  579. checking for 128-bit arithmetic... yes
  580. checking for cpuid instruction... yes
  581. checking if the .private_extern asm directive is supported... no
  582. checking if the .hidden asm directive is supported... yes
  583. checking if weak symbols are supported... yes
  584. checking if data alignment is required... no
  585. checking if atomic operations are supported... yes
  586. checking for size_t... yes
  587. checking for working alloca.h... yes
  588. checking for alloca... yes
  589. checking for arc4random... no
  590. checking for arc4random_buf... no
  591. checking for mmap... yes
  592. checking for mlock... yes
  593. checking for madvise... yes
  594. checking for mprotect... yes
  595. checking for memset_s... no
  596. checking for explicit_bzero... no
  597. checking for explicit_memset... no
  598. checking for nanosleep... yes
  599. checking for posix_memalign... yes
  600. checking for getpid... yes
  601. checking if gcc/ld supports -Wl,--output-def... no
  602. checking that generated files are newer than configure... done
  603. configure: creating ./config.status
  604. config.status: creating Makefile
  605. config.status: creating builds/Makefile
  606. config.status: creating contrib/Makefile
  607. config.status: creating dist-build/Makefile
  608. config.status: creating libsodium.pc
  609. config.status: creating libsodium-uninstalled.pc
  610. config.status: creating msvc-scripts/Makefile
  611. config.status: creating src/Makefile
  612. config.status: creating src/libsodium/Makefile
  613. config.status: creating src/libsodium/include/Makefile
  614. config.status: creating src/libsodium/include/sodium/version.h
  615. config.status: creating test/default/Makefile
  616. config.status: creating test/Makefile
  617. config.status: executing depfiles commands
  618. config.status: executing libtool commands
  619. Making all in builds
  620. make[1]: Entering directory `/svr-setup/libsodium-1.0.17/builds'
  621. make[1]: Nothing to be done for `all'.
  622. make[1]: Leaving directory `/svr-setup/libsodium-1.0.17/builds'
  623. Making all in contrib
  624. make[1]: Entering directory `/svr-setup/libsodium-1.0.17/contrib'
  625. make[1]: Nothing to be done for `all'.
  626. make[1]: Leaving directory `/svr-setup/libsodium-1.0.17/contrib'
  627. Making all in dist-build
  628. make[1]: Entering directory `/svr-setup/libsodium-1.0.17/dist-build'
  629. make[1]: Nothing to be done for `all'.
  630. make[1]: Leaving directory `/svr-setup/libsodium-1.0.17/dist-build'
  631. Making all in msvc-scripts
  632. make[1]: Entering directory `/svr-setup/libsodium-1.0.17/msvc-scripts'
  633. make[1]: Nothing to be done for `all'.
  634. make[1]: Leaving directory `/svr-setup/libsodium-1.0.17/msvc-scripts'
  635. Making all in src
  636. make[1]: Entering directory `/svr-setup/libsodium-1.0.17/src'
  637. Making all in libsodium
  638. make[2]: Entering directory `/svr-setup/libsodium-1.0.17/src/libsodium'
  639. Making all in include
  640. make[3]: Entering directory `/svr-setup/libsodium-1.0.17/src/libsodium/include'
  641. make[3]: Nothing to be done for `all'.
  642. make[3]: Leaving directory `/svr-setup/libsodium-1.0.17/src/libsodium/include'
  643. make[3]: Entering directory `/svr-setup/libsodium-1.0.17/src/libsodium'
  644.   CC       crypto_aead/chacha20poly1305/sodium/libsodium_la-aead_chacha20poly1305.lo
  645.   CC       crypto_aead/xchacha20poly1305/sodium/libsodium_la-aead_xchacha20poly1305.lo
  646.   CC       crypto_auth/libsodium_la-crypto_auth.lo
  647.   CC       crypto_auth/hmacsha256/libsodium_la-auth_hmacsha256.lo
  648.   CC       crypto_auth/hmacsha512/libsodium_la-auth_hmacsha512.lo
  649.   CC       crypto_auth/hmacsha512256/libsodium_la-auth_hmacsha512256.lo
  650.   CC       crypto_box/libsodium_la-crypto_box.lo
  651.   CC       crypto_box/libsodium_la-crypto_box_easy.lo
  652.   CC       crypto_box/libsodium_la-crypto_box_seal.lo
  653.   CC       crypto_box/curve25519xsalsa20poly1305/libsodium_la-box_curve25519xsalsa20poly1305.lo
  654.   CC       crypto_core/ed25519/ref10/libsodium_la-ed25519_ref10.lo
  655.   CC       crypto_core/hchacha20/libsodium_la-core_hchacha20.lo
  656.   CC       crypto_core/hsalsa20/ref2/libsodium_la-core_hsalsa20_ref2.lo
  657.   CC       crypto_core/hsalsa20/libsodium_la-core_hsalsa20.lo
  658.   CC       crypto_core/salsa/ref/libsodium_la-core_salsa_ref.lo
  659.   CC       crypto_generichash/libsodium_la-crypto_generichash.lo
  660.   CC       crypto_generichash/blake2b/libsodium_la-generichash_blake2.lo
  661.   CC       crypto_generichash/blake2b/ref/libsodium_la-blake2b-compress-ref.lo
  662.   CC       crypto_generichash/blake2b/ref/libsodium_la-blake2b-ref.lo
  663.   CC       crypto_generichash/blake2b/ref/libsodium_la-generichash_blake2b.lo
  664.   CC       crypto_hash/libsodium_la-crypto_hash.lo
  665.   CC       crypto_hash/sha256/libsodium_la-hash_sha256.lo
  666.   CC       crypto_hash/sha256/cp/libsodium_la-hash_sha256_cp.lo
  667.   CC       crypto_hash/sha512/libsodium_la-hash_sha512.lo
  668.   CC       crypto_hash/sha512/cp/libsodium_la-hash_sha512_cp.lo
  669.   CC       crypto_kdf/blake2b/libsodium_la-kdf_blake2b.lo
  670.   CC       crypto_kdf/libsodium_la-crypto_kdf.lo
  671.   CC       crypto_kx/libsodium_la-crypto_kx.lo
  672.   CC       crypto_onetimeauth/libsodium_la-crypto_onetimeauth.lo
  673.   CC       crypto_onetimeauth/poly1305/libsodium_la-onetimeauth_poly1305.lo
  674.   CC       crypto_onetimeauth/poly1305/donna/libsodium_la-poly1305_donna.lo
  675.   CC       crypto_pwhash/argon2/libsodium_la-argon2-core.lo
  676.   CC       crypto_pwhash/argon2/libsodium_la-argon2-encoding.lo
  677.   CC       crypto_pwhash/argon2/libsodium_la-argon2-fill-block-ref.lo
  678.   CC       crypto_pwhash/argon2/libsodium_la-argon2.lo
  679.   CC       crypto_pwhash/argon2/libsodium_la-blake2b-long.lo
  680.   CC       crypto_pwhash/argon2/libsodium_la-pwhash_argon2i.lo
  681.   CC       crypto_pwhash/argon2/libsodium_la-pwhash_argon2id.lo
  682.   CC       crypto_pwhash/libsodium_la-crypto_pwhash.lo
  683.   CC       crypto_scalarmult/libsodium_la-crypto_scalarmult.lo
  684.   CC       crypto_scalarmult/curve25519/ref10/libsodium_la-x25519_ref10.lo
  685.   CC       crypto_scalarmult/curve25519/libsodium_la-scalarmult_curve25519.lo
  686.   CC       crypto_secretbox/libsodium_la-crypto_secretbox.lo
  687.   CC       crypto_secretbox/libsodium_la-crypto_secretbox_easy.lo
  688.   CC       crypto_secretbox/xsalsa20poly1305/libsodium_la-secretbox_xsalsa20poly1305.lo
  689.   CC       crypto_secretstream/xchacha20poly1305/libsodium_la-secretstream_xchacha20poly1305.lo
  690.   CC       crypto_shorthash/libsodium_la-crypto_shorthash.lo
  691.   CC       crypto_shorthash/siphash24/libsodium_la-shorthash_siphash24.lo
  692.   CC       crypto_shorthash/siphash24/ref/libsodium_la-shorthash_siphash24_ref.lo
  693.   CC       crypto_sign/libsodium_la-crypto_sign.lo
  694.   CC       crypto_sign/ed25519/libsodium_la-sign_ed25519.lo
  695.   CC       crypto_sign/ed25519/ref10/libsodium_la-keypair.lo
  696.   CC       crypto_sign/ed25519/ref10/libsodium_la-open.lo
  697.   CC       crypto_sign/ed25519/ref10/libsodium_la-sign.lo
  698.   CC       crypto_stream/chacha20/libsodium_la-stream_chacha20.lo
  699.   CC       crypto_stream/chacha20/ref/libsodium_la-chacha20_ref.lo
  700.   CC       crypto_stream/libsodium_la-crypto_stream.lo
  701.   CC       crypto_stream/salsa20/libsodium_la-stream_salsa20.lo
  702.   CC       crypto_stream/xsalsa20/libsodium_la-stream_xsalsa20.lo
  703.   CC       crypto_verify/sodium/libsodium_la-verify.lo
  704.   CC       randombytes/libsodium_la-randombytes.lo
  705.   CC       sodium/libsodium_la-codecs.lo
  706.   CC       sodium/libsodium_la-core.lo
  707.   CC       sodium/libsodium_la-runtime.lo
  708.   CC       sodium/libsodium_la-utils.lo
  709.   CC       sodium/libsodium_la-version.lo
  710.   CPPAS    crypto_stream/salsa20/xmm6/libsodium_la-salsa20_xmm6-asm.lo
  711.   CC       crypto_stream/salsa20/xmm6/libsodium_la-salsa20_xmm6.lo
  712.   CC       crypto_scalarmult/curve25519/sandy2x/libsodium_la-curve25519_sandy2x.lo
  713.   CC       crypto_scalarmult/curve25519/sandy2x/libsodium_la-fe51_invert.lo
  714.   CC       crypto_scalarmult/curve25519/sandy2x/libsodium_la-fe_frombytes_sandy2x.lo
  715.   CPPAS    crypto_scalarmult/curve25519/sandy2x/libsodium_la-sandy2x.lo
  716.   CC       crypto_box/curve25519xchacha20poly1305/libsodium_la-box_curve25519xchacha20poly1305.lo
  717.   CC       crypto_box/curve25519xchacha20poly1305/libsodium_la-box_seal_curve25519xchacha20poly1305.lo
  718.   CC       crypto_core/ed25519/libsodium_la-core_ed25519.lo
  719.   CC       crypto_pwhash/scryptsalsa208sha256/libsodium_la-crypto_scrypt-common.lo
  720.   CC       crypto_pwhash/scryptsalsa208sha256/libsodium_la-scrypt_platform.lo
  721.   CC       crypto_pwhash/scryptsalsa208sha256/libsodium_la-pbkdf2-sha256.lo
  722.   CC       crypto_pwhash/scryptsalsa208sha256/libsodium_la-pwhash_scryptsalsa208sha256.lo
  723.   CC       crypto_pwhash/scryptsalsa208sha256/nosse/libsodium_la-pwhash_scryptsalsa208sha256_nosse.lo
  724.   CC       crypto_scalarmult/ed25519/ref10/libsodium_la-scalarmult_ed25519_ref10.lo
  725.   CC       crypto_secretbox/xchacha20poly1305/libsodium_la-secretbox_xchacha20poly1305.lo
  726.   CC       crypto_shorthash/siphash24/libsodium_la-shorthash_siphashx24.lo
  727.   CC       crypto_shorthash/siphash24/ref/libsodium_la-shorthash_siphashx24_ref.lo
  728.   CC       crypto_sign/ed25519/ref10/libsodium_la-obsolete.lo
  729.   CC       crypto_stream/salsa2012/ref/libsodium_la-stream_salsa2012_ref.lo
  730.   CC       crypto_stream/salsa2012/libsodium_la-stream_salsa2012.lo
  731.   CC       crypto_stream/salsa208/ref/libsodium_la-stream_salsa208_ref.lo
  732.   CC       crypto_stream/salsa208/libsodium_la-stream_salsa208.lo
  733.   CC       crypto_stream/xchacha20/libsodium_la-stream_xchacha20.lo
  734.   CC       randombytes/sysrandom/libsodium_la-randombytes_sysrandom.lo
  735.   CC       crypto_aead/aes256gcm/aesni/libaesni_la-aead_aes256gcm_aesni.lo
  736.   CC       crypto_onetimeauth/poly1305/sse2/libsse2_la-poly1305_sse2.lo
  737.   CC       crypto_pwhash/scryptsalsa208sha256/sse/libsse2_la-pwhash_scryptsalsa208sha256_sse.lo
  738.   CC       crypto_generichash/blake2b/ref/libssse3_la-blake2b-compress-ssse3.lo
  739.   CC       crypto_pwhash/argon2/libssse3_la-argon2-fill-block-ssse3.lo
  740.   CC       crypto_stream/chacha20/dolbeau/libssse3_la-chacha20_dolbeau-ssse3.lo
  741.   CC       crypto_generichash/blake2b/ref/libsse41_la-blake2b-compress-sse41.lo
  742.   CC       crypto_generichash/blake2b/ref/libavx2_la-blake2b-compress-avx2.lo
  743.   CC       crypto_pwhash/argon2/libavx2_la-argon2-fill-block-avx2.lo
  744.   CC       crypto_stream/chacha20/dolbeau/libavx2_la-chacha20_dolbeau-avx2.lo
  745.   CC       crypto_stream/salsa20/xmm6int/libavx2_la-salsa20_xmm6int-avx2.lo
  746.   CC       crypto_pwhash/argon2/libavx512f_la-argon2-fill-block-avx512f.lo
  747.   CC       randombytes/salsa20/librdrand_la-randombytes_salsa20_random.lo
  748.   CCLD     libaesni.la
  749. libtool: warning: '-version-info/-version-number' is ignored for convenience libraries
  750.   CCLD     libsse2.la
  751. libtool: warning: '-version-info/-version-number' is ignored for convenience libraries
  752.   CCLD     libssse3.la
  753. libtool: warning: '-version-info/-version-number' is ignored for convenience libraries
  754.   CCLD     libsse41.la
  755. libtool: warning: '-version-info/-version-number' is ignored for convenience libraries
  756.   CCLD     libavx512f.la
  757.   CCLD     libavx2.la
  758.   CCLD     librdrand.la
  759. libtool: warning: '-version-info/-version-number' is ignored for convenience libraries
  760. libtool: warning: '-version-info/-version-number' is ignored for convenience libraries
  761. libtool: warning: '-version-info/-version-number' is ignored for convenience libraries
  762.   CCLD     libsodium.la
  763. make[3]: Leaving directory `/svr-setup/libsodium-1.0.17/src/libsodium'
  764. make[2]: Leaving directory `/svr-setup/libsodium-1.0.17/src/libsodium'
  765. make[2]: Entering directory `/svr-setup/libsodium-1.0.17/src'
  766. make[2]: Nothing to be done for `all-am'.
  767. make[2]: Leaving directory `/svr-setup/libsodium-1.0.17/src'
  768. make[1]: Leaving directory `/svr-setup/libsodium-1.0.17/src'
  769. Making all in test
  770. make[1]: Entering directory `/svr-setup/libsodium-1.0.17/test'
  771. Making all in default
  772. make[2]: Entering directory `/svr-setup/libsodium-1.0.17/test/default'
  773. make[2]: Nothing to be done for `all'.
  774. make[2]: Leaving directory `/svr-setup/libsodium-1.0.17/test/default'
  775. make[2]: Entering directory `/svr-setup/libsodium-1.0.17/test'
  776. make[2]: Nothing to be done for `all-am'.
  777. make[2]: Leaving directory `/svr-setup/libsodium-1.0.17/test'
  778. make[1]: Leaving directory `/svr-setup/libsodium-1.0.17/test'
  779. make[1]: Entering directory `/svr-setup/libsodium-1.0.17'
  780. make[1]: Nothing to be done for `all-am'.
  781. make[1]: Leaving directory `/svr-setup/libsodium-1.0.17'
  782. Making install in builds
  783. make[1]: Entering directory `/svr-setup/libsodium-1.0.17/builds'
  784. make[2]: Entering directory `/svr-setup/libsodium-1.0.17/builds'
  785. make[2]: Nothing to be done for `install-exec-am'.
  786. make[2]: Nothing to be done for `install-data-am'.
  787. make[2]: Leaving directory `/svr-setup/libsodium-1.0.17/builds'
  788. make[1]: Leaving directory `/svr-setup/libsodium-1.0.17/builds'
  789. Making install in contrib
  790. make[1]: Entering directory `/svr-setup/libsodium-1.0.17/contrib'
  791. make[2]: Entering directory `/svr-setup/libsodium-1.0.17/contrib'
  792. make[2]: Nothing to be done for `install-exec-am'.
  793. make[2]: Nothing to be done for `install-data-am'.
  794. make[2]: Leaving directory `/svr-setup/libsodium-1.0.17/contrib'
  795. make[1]: Leaving directory `/svr-setup/libsodium-1.0.17/contrib'
  796. Making install in dist-build
  797. make[1]: Entering directory `/svr-setup/libsodium-1.0.17/dist-build'
  798. make[2]: Entering directory `/svr-setup/libsodium-1.0.17/dist-build'
  799. make[2]: Nothing to be done for `install-exec-am'.
  800. make[2]: Nothing to be done for `install-data-am'.
  801. make[2]: Leaving directory `/svr-setup/libsodium-1.0.17/dist-build'
  802. make[1]: Leaving directory `/svr-setup/libsodium-1.0.17/dist-build'
  803. Making install in msvc-scripts
  804. make[1]: Entering directory `/svr-setup/libsodium-1.0.17/msvc-scripts'
  805. make[2]: Entering directory `/svr-setup/libsodium-1.0.17/msvc-scripts'
  806. make[2]: Nothing to be done for `install-exec-am'.
  807. make[2]: Nothing to be done for `install-data-am'.
  808. make[2]: Leaving directory `/svr-setup/libsodium-1.0.17/msvc-scripts'
  809. make[1]: Leaving directory `/svr-setup/libsodium-1.0.17/msvc-scripts'
  810. Making install in src
  811. make[1]: Entering directory `/svr-setup/libsodium-1.0.17/src'
  812. Making install in libsodium
  813. make[2]: Entering directory `/svr-setup/libsodium-1.0.17/src/libsodium'
  814. Making install in include
  815. make[3]: Entering directory `/svr-setup/libsodium-1.0.17/src/libsodium/include'
  816. make[4]: Entering directory `/svr-setup/libsodium-1.0.17/src/libsodium/include'
  817. make[4]: Nothing to be done for `install-exec-am'.
  818.  /bin/mkdir -p '/usr/local/include'
  819.  /bin/mkdir -p '/usr/local/include/sodium'
  820.  /bin/install -c -m 644  sodium/core.h sodium/crypto_aead_aes256gcm.h sodium/crypto_aead_chacha20poly1305.h sodium/crypto_aead_xchacha20poly1305.h sodium/crypto_auth.h sodium/crypto_auth_hmacsha256.h sodium/crypto_auth_hmacsha512.h sodium/crypto_auth_hmacsha512256.h sodium/crypto_box.h sodium/crypto_box_curve25519xchacha20poly1305.h sodium/crypto_box_curve25519xsalsa20poly1305.h sodium/crypto_core_ed25519.h sodium/crypto_core_hchacha20.h sodium/crypto_core_hsalsa20.h sodium/crypto_core_salsa20.h sodium/crypto_core_salsa2012.h sodium/crypto_core_salsa208.h sodium/crypto_generichash.h sodium/crypto_generichash_blake2b.h sodium/crypto_hash.h sodium/crypto_hash_sha256.h sodium/crypto_hash_sha512.h sodium/crypto_kdf.h sodium/crypto_kdf_blake2b.h sodium/crypto_kx.h sodium/crypto_onetimeauth.h sodium/crypto_onetimeauth_poly1305.h sodium/crypto_pwhash.h sodium/crypto_pwhash_argon2i.h sodium/crypto_pwhash_argon2id.h sodium/crypto_pwhash_scryptsalsa208sha256.h sodium/crypto_scalarmult.h sodium/crypto_scalarmult_curve25519.h sodium/crypto_scalarmult_ed25519.h sodium/crypto_secretbox.h sodium/crypto_secretbox_xchacha20poly1305.h sodium/crypto_secretbox_xsalsa20poly1305.h sodium/crypto_secretstream_xchacha20poly1305.h sodium/crypto_shorthash.h sodium/crypto_shorthash_siphash24.h '/usr/local/include/sodium'
  821.  /bin/mkdir -p '/usr/local/include/sodium'
  822.  /bin/install -c -m 644  sodium/crypto_sign.h sodium/crypto_sign_ed25519.h sodium/crypto_sign_edwards25519sha512batch.h sodium/crypto_stream.h sodium/crypto_stream_chacha20.h sodium/crypto_stream_salsa20.h sodium/crypto_stream_salsa2012.h sodium/crypto_stream_salsa208.h sodium/crypto_stream_xchacha20.h sodium/crypto_stream_xsalsa20.h sodium/crypto_verify_16.h sodium/crypto_verify_32.h sodium/crypto_verify_64.h sodium/export.h sodium/randombytes.h sodium/randombytes_salsa20_random.h sodium/randombytes_sysrandom.h sodium/runtime.h sodium/utils.h '/usr/local/include/sodium'
  823.  /bin/install -c -m 644  sodium.h '/usr/local/include/.'
  824.  /bin/mkdir -p '/usr/local/include'
  825.  /bin/mkdir -p '/usr/local/include/sodium'
  826.  /bin/install -c -m 644  sodium/version.h '/usr/local/include/sodium'
  827. make[4]: Leaving directory `/svr-setup/libsodium-1.0.17/src/libsodium/include'
  828. make[3]: Leaving directory `/svr-setup/libsodium-1.0.17/src/libsodium/include'
  829. make[3]: Entering directory `/svr-setup/libsodium-1.0.17/src/libsodium'
  830. make[4]: Entering directory `/svr-setup/libsodium-1.0.17/src/libsodium'
  831.  /bin/mkdir -p '/usr/local/lib64'
  832.  /bin/sh ../../libtool   --mode=install /bin/install -c   libsodium.la '/usr/local/lib64'
  833. libtool: install: /bin/install -c .libs/libsodium.so.23.2.0 /usr/local/lib64/libsodium.so.23.2.0
  834. libtool: install: (cd /usr/local/lib64 && { ln -s -f libsodium.so.23.2.0 libsodium.so.23 || { rm -f libsodium.so.23 && ln -s libsodium.so.23.2.0 libsodium.so.23; }; })
  835. libtool: install: (cd /usr/local/lib64 && { ln -s -f libsodium.so.23.2.0 libsodium.so || { rm -f libsodium.so && ln -s libsodium.so.23.2.0 libsodium.so; }; })
  836. libtool: install: /bin/install -c .libs/libsodium.lai /usr/local/lib64/libsodium.la
  837. libtool: install: /bin/install -c .libs/libsodium.a /usr/local/lib64/libsodium.a
  838. libtool: install: chmod 644 /usr/local/lib64/libsodium.a
  839. libtool: install: ranlib /usr/local/lib64/libsodium.a
  840. libtool: finish: PATH="/usr/local/sbin:/usr/local/bin:/sbin:/bin:/usr/sbin:/usr/bin:/root/bin:/sbin" ldconfig -n /usr/local/lib64
  841. ----------------------------------------------------------------------
  842. Libraries have been installed in:
  843.    /usr/local/lib64
  844.  
  845. If you ever happen to want to link against installed libraries
  846. in a given directory, LIBDIR, you must either use libtool, and
  847. specify the full pathname of the library, or use the '-LLIBDIR'
  848. flag during linking and do at least one of the following:
  849.    - add LIBDIR to the 'LD_LIBRARY_PATH' environment variable
  850.      during execution
  851.    - add LIBDIR to the 'LD_RUN_PATH' environment variable
  852.      during linking
  853.    - use the '-Wl,-rpath -Wl,LIBDIR' linker flag
  854.    - have your system administrator add LIBDIR to '/etc/ld.so.conf'
  855.  
  856. See any operating system documentation about shared libraries for
  857. more information, such as the ld(1) and ld.so(8) manual pages.
  858. ----------------------------------------------------------------------
  859. make[4]: Nothing to be done for `install-data-am'.
  860. make[4]: Leaving directory `/svr-setup/libsodium-1.0.17/src/libsodium'
  861. make[3]: Leaving directory `/svr-setup/libsodium-1.0.17/src/libsodium'
  862. make[2]: Leaving directory `/svr-setup/libsodium-1.0.17/src/libsodium'
  863. make[2]: Entering directory `/svr-setup/libsodium-1.0.17/src'
  864. make[3]: Entering directory `/svr-setup/libsodium-1.0.17/src'
  865. make[3]: Nothing to be done for `install-exec-am'.
  866. make[3]: Nothing to be done for `install-data-am'.
  867. make[3]: Leaving directory `/svr-setup/libsodium-1.0.17/src'
  868. make[2]: Leaving directory `/svr-setup/libsodium-1.0.17/src'
  869. make[1]: Leaving directory `/svr-setup/libsodium-1.0.17/src'
  870. Making install in test
  871. make[1]: Entering directory `/svr-setup/libsodium-1.0.17/test'
  872. Making install in default
  873. make[2]: Entering directory `/svr-setup/libsodium-1.0.17/test/default'
  874. make[3]: Entering directory `/svr-setup/libsodium-1.0.17/test/default'
  875. make[3]: Nothing to be done for `install-exec-am'.
  876. make[3]: Nothing to be done for `install-data-am'.
  877. make[3]: Leaving directory `/svr-setup/libsodium-1.0.17/test/default'
  878. make[2]: Leaving directory `/svr-setup/libsodium-1.0.17/test/default'
  879. make[2]: Entering directory `/svr-setup/libsodium-1.0.17/test'
  880. make[3]: Entering directory `/svr-setup/libsodium-1.0.17/test'
  881. make[3]: Nothing to be done for `install-exec-am'.
  882. make[3]: Nothing to be done for `install-data-am'.
  883. make[3]: Leaving directory `/svr-setup/libsodium-1.0.17/test'
  884. make[2]: Leaving directory `/svr-setup/libsodium-1.0.17/test'
  885. make[1]: Leaving directory `/svr-setup/libsodium-1.0.17/test'
  886. make[1]: Entering directory `/svr-setup/libsodium-1.0.17'
  887. make[2]: Entering directory `/svr-setup/libsodium-1.0.17'
  888. make[2]: Nothing to be done for `install-exec-am'.
  889.  /bin/mkdir -p '/usr/local/lib64/pkgconfig'
  890.  /bin/install -c -m 644 libsodium.pc '/usr/local/lib64/pkgconfig'
  891. make[2]: Leaving directory `/svr-setup/libsodium-1.0.17'
  892. make[1]: Leaving directory `/svr-setup/libsodium-1.0.17'
  893. /svr-setup/php-7.3.3/fpm-build
  894. /svr-setup /svr-setup/php-7.3.3/fpm-build
  895. 20171227.tar.gz found, skipping download...
  896. Building with optimizations for native
  897. rm -f argon2 bench genkat
  898. rm -f libargon2.so.1 libargon2.a kat-argon2*
  899. rm -f testcase
  900. rm -rf *.dSYM
  901. cd src/ && rm -f *.o
  902. cd src/blake2/ && rm -f *.o
  903. cd kats/ &&  rm -f kat-* diff* run_* make_*
  904. Building with optimizations for native
  905. ccache gcc -std=c89 -O3 -Wall -g -Iinclude -Isrc -pthread -march=native  src/argon2.c src/core.c src/blake2/blake2b.c src/thread.c src/encoding.c src/opt.c src/run.c -o argon2
  906. ccache gcc -std=c89 -O3 -Wall -g -Iinclude -Isrc -pthread -march=native -shared -fPIC -fvisibility=hidden -DA2_VISCTL=1  -Wl,-soname,libargon2.so.1 src/argon2.c src/core.c src/blake2/blake2b.c src/thread.c src/encoding.c src/opt.c -o libargon2.so.1
  907. ccache gcc -std=c89 -O3 -Wall -g -Iinclude -Isrc -pthread -march=native   -c -o src/argon2.o src/argon2.c
  908. ccache gcc -std=c89 -O3 -Wall -g -Iinclude -Isrc -pthread -march=native   -c -o src/core.o src/core.c
  909. ccache gcc -std=c89 -O3 -Wall -g -Iinclude -Isrc -pthread -march=native   -c -o src/blake2/blake2b.o src/blake2/blake2b.c
  910. ccache gcc -std=c89 -O3 -Wall -g -Iinclude -Isrc -pthread -march=native   -c -o src/thread.o src/thread.c
  911. ccache gcc -std=c89 -O3 -Wall -g -Iinclude -Isrc -pthread -march=native   -c -o src/encoding.o src/encoding.c
  912. ccache gcc -std=c89 -O3 -Wall -g -Iinclude -Isrc -pthread -march=native   -c -o src/opt.o src/opt.c
  913. ar rcs libargon2.a src/argon2.o src/core.o src/blake2/blake2b.o src/thread.o src/encoding.o src/opt.o
  914. Building with optimizations for native
  915. install -d /usr/local/include
  916. install -m 0644 include/argon2.h /usr/local/include
  917. install -d /usr/local/lib64
  918. install libargon2.so.1 libargon2.a /usr/local/lib64
  919. cd /usr/local/lib64 && ln -s libargon2.so.1 libargon2.so
  920. install -d /usr/local/bin
  921. install argon2 /usr/local/bin
  922. /svr-setup/php-7.3.3/fpm-build
  923. NEWLIBICU=n
  924. /opt/rh/devtoolset-8/root/usr/bin/gcc
  925. /opt/rh/devtoolset-8/root/usr/bin/g++
  926. centos 7 set devtoolset-8
  927. ccache /opt/rh/devtoolset-8/root/usr/bin/gcc
  928. ccache /opt/rh/devtoolset-8/root/usr/bin/g++
  929. gcc (GCC) 8.2.1 20180905 (Red Hat 8.2.1-3)
  930. Copyright (C) 2018 Free Software Foundation, Inc.
  931. This is free software; see the source for copying conditions.  There is NO
  932. warranty; not even for MERCHANTABILITY or FITNESS FOR A PARTICULAR PURPOSE.
  933.  
  934.   -m128bit-long-double                  [enabled]
  935.   -m64                                  [enabled]
  936.   -m80387                               [enabled]
  937.   -mabm                                 [enabled]
  938.   -maes                                 [enabled]
  939.   -malign-stringops                     [enabled]
  940.   -march=                               haswell
  941.   -mavx                                 [enabled]
  942.   -mavx2                                [enabled]
  943.   -mbmi                                 [enabled]
  944.   -mbmi2                                [enabled]
  945.   -mcx16                                [enabled]
  946.   -mf16c                                [enabled]
  947.   -mfancy-math-387                      [enabled]
  948.   -mfma                                 [enabled]
  949.   -mfp-ret-in-387                       [enabled]
  950.   -mfpmath=                             sse
  951.   -mfsgsbase                            [enabled]
  952.   -mfxsr                                [enabled]
  953.   -mglibc                               [enabled]
  954.   -mhard-float                          [enabled]
  955.   -mhle                                 [enabled]
  956.   -mieee-fp                             [enabled]
  957.   -mlong-double-80                      [enabled]
  958.   -mlzcnt                               [enabled]
  959.   -mmmx                                 [enabled]
  960.   -mmovbe                               [enabled]
  961.   -mpclmul                              [enabled]
  962.   -mpopcnt                              [enabled]
  963.   -mpush-args                           [enabled]
  964.   -mrdrnd                               [enabled]
  965.   -mred-zone                            [enabled]
  966.   -msahf                                [enabled]
  967.   -msse                                 [enabled]
  968.   -msse2                                [enabled]
  969.   -msse3                                [enabled]
  970.   -msse4                                [enabled]
  971.   -msse4.1                              [enabled]
  972.   -msse4.2                              [enabled]
  973.   -mssse3                               [enabled]
  974.   -mstv                                 [enabled]
  975.   -mtls-direct-seg-refs                 [enabled]
  976.   -mtune-ctrl=                
  977.   -mtune=                               haswell
  978.   -mvzeroupper                          [enabled]
  979.   -mxsave                               [enabled]
  980.   -mxsaveopt                            [enabled]
  981.   Valid arguments to -mfpmath=:
  982.  
  983. set vm.nr.hugepages in /etc/sysctl.conf
  984.  
  985. net.ipv4.conf.all.rp_filter = 0
  986. net.ipv4.conf.default.rp_filter = 0
  987. net.ipv4.conf.eth0.rp_filter = 0
  988. net.ipv4.conf.eth1.rp_filter = 0
  989. net.ipv4.conf.eth2.rp_filter = 0
  990. sysctl: cannot stat /proc/sys/net/ipv4/conf/eth3/rp_filter: No such file or directory
  991. sysctl: cannot stat /proc/sys/net/ipv4/conf/eth4/rp_filter: No such file or directory
  992. sysctl: cannot stat /proc/sys/net/ipv4/conf/eth5/rp_filter: No such file or directory
  993. vm.overcommit_memory = 1
  994. vm.swappiness = 10
  995. net.ipv6.conf.all.disable_ipv6 = 0
  996. net.ipv6.conf.default.disable_ipv6 = 0
  997. vm.nr_hugepages = 240
  998.  
  999.  
  1000. set system max locked memory limit
  1001.  
  1002. /etc/security/limits.conf
  1003. * soft memlock 3932160
  1004. * hard memlock 3932160
  1005.  
  1006. # /etc/security/limits.conf
  1007. #
  1008. #This file sets the resource limits for the users logged in via PAM.
  1009. #It does not affect resource limits of the system services.
  1010. #
  1011. #Also note that configuration files in /etc/security/limits.d directory,
  1012. #which are read in alphabetical order, override the settings in this
  1013. #file in case the domain is the same or more specific.
  1014. #That means for example that setting a limit for wildcard domain here
  1015. #can be overriden with a wildcard setting in a config file in the
  1016. #subdirectory, but a user specific setting here can be overriden only
  1017. #with a user specific setting in the subdirectory.
  1018. #
  1019. #Each line describes a limit for a user in the form:
  1020. #
  1021. #<domain>        <type>  <item>  <value>
  1022. #
  1023. #Where:
  1024. #<domain> can be:
  1025. #        - a user name
  1026. #        - a group name, with @group syntax
  1027. #        - the wildcard *, for default entry
  1028. #        - the wildcard %, can be also used with %group syntax,
  1029. #                 for maxlogin limit
  1030. #
  1031. #<type> can have the two values:
  1032. #        - "soft" for enforcing the soft limits
  1033. #        - "hard" for enforcing hard limits
  1034. #
  1035. #<item> can be one of the following:
  1036. #        - core - limits the core file size (KB)
  1037. #        - data - max data size (KB)
  1038. #        - fsize - maximum filesize (KB)
  1039. #        - memlock - max locked-in-memory address space (KB)
  1040. #        - nofile - max number of open file descriptors
  1041. #        - rss - max resident set size (KB)
  1042. #        - stack - max stack size (KB)
  1043. #        - cpu - max CPU time (MIN)
  1044. #        - nproc - max number of processes
  1045. #        - as - address space limit (KB)
  1046. #        - maxlogins - max number of logins for this user
  1047. #        - maxsyslogins - max number of logins on the system
  1048. #        - priority - the priority to run user process with
  1049. #        - locks - max number of file locks the user can hold
  1050. #        - sigpending - max number of pending signals
  1051. #        - msgqueue - max memory used by POSIX message queues (bytes)
  1052. #        - nice - max nice priority allowed to raise to values: [-20, 19]
  1053. #        - rtprio - max realtime priority
  1054. #
  1055. #<domain>      <type>  <item>         <value>
  1056. #
  1057.  
  1058. #*               soft    core            0
  1059. #*               hard    rss             10000
  1060. #@student        hard    nproc           20
  1061. #@faculty        soft    nproc           20
  1062. #@faculty        hard    nproc           50
  1063. #ftp             hard    nproc           0
  1064. #@student        -       maxlogins       4
  1065.  
  1066. # End of file
  1067. * soft nofile 262144
  1068. * hard nofile 262144
  1069. nginx soft nofile 262144
  1070. nginx hard nofile 262144
  1071. nobody soft nofile 262144
  1072. nobody hard nofile 262144
  1073. root soft nofile 262144
  1074. root hard nofile 262144
  1075. * soft memlock 3932160
  1076. * hard memlock 3932160
  1077.  
  1078. 3342336
  1079.  
  1080.  
  1081. sysctl vm.nr_hugepages
  1082. vm.nr_hugepages = 240
  1083.  
  1084. MemTotal:        8008860 kB
  1085. MemFree:         1092196 kB
  1086. MemAvailable:    3959984 kB
  1087. Buffers:               0 kB
  1088. Cached:          2316080 kB
  1089. SwapCached:            0 kB
  1090. Active:          3642900 kB
  1091. Inactive:        1446112 kB
  1092. Active(anon):    2541984 kB
  1093. Inactive(anon):   277064 kB
  1094. Active(file):    1100916 kB
  1095. Inactive(file):  1169048 kB
  1096. Unevictable:           0 kB
  1097. Mlocked:               0 kB
  1098. SwapTotal:       1048572 kB
  1099. SwapFree:        1048572 kB
  1100. Dirty:            162160 kB
  1101. Writeback:            16 kB
  1102. AnonPages:       2773208 kB
  1103. Mapped:            90144 kB
  1104. Shmem:             46164 kB
  1105. Slab:            1041812 kB
  1106. SReclaimable:     895604 kB
  1107. SUnreclaim:       146208 kB
  1108. KernelStack:        4128 kB
  1109. PageTables:        15692 kB
  1110. NFS_Unstable:          0 kB
  1111. Bounce:                0 kB
  1112. WritebackTmp:          0 kB
  1113. CommitLimit:     4807240 kB
  1114. Committed_AS:    6143936 kB
  1115. VmallocTotal:   34359738367 kB
  1116. VmallocUsed:       23512 kB
  1117. VmallocChunk:   34359675892 kB
  1118. HardwareCorrupted:     0 kB
  1119. AnonHugePages:      2048 kB
  1120. CmaTotal:              0 kB
  1121. CmaFree:               0 kB
  1122. HugePages_Total:     240
  1123. HugePages_Free:      240
  1124. HugePages_Rsvd:        0
  1125. HugePages_Surp:        0
  1126. Hugepagesize:       2048 kB
  1127. DirectMap4k:      137072 kB
  1128. DirectMap2M:     6154240 kB
  1129. DirectMap1G:     4194304 kB
  1130.  
  1131. opcache.huge_code_pages => Off => Off
  1132.  
  1133. ../configure --enable-fpm --enable-opcache --enable-intl --enable-pcntl --with-mcrypt --with-snmp --enable-embed=shared --with-mhash --with-zlib --with-gettext --enable-exif --enable-zip --with-libzip --with-bz2 --enable-soap --enable-sockets --enable-sysvmsg --enable-sysvsem --enable-sysvshm --enable-shmop --with-pear --enable-mbstring --with-openssl --with-mysql=mysqlnd --with-libdir=lib64 --with-mysqli=mysqlnd --with-mysql-sock=/var/lib/mysql/mysql.sock --with-curl --with-gd --with-xmlrpc --enable-bcmath --enable-calendar  --enable-ftp --enable-gd-native-ttf --with-freetype-dir=/usr --with-jpeg-dir=/usr --with-png-dir=/usr --with-xpm-dir=/usr --with-webp-dir=/usr --with-t1lib=/usr --enable-pdo --with-pdo-sqlite --with-pdo-mysql=mysqlnd --enable-inline-optimization --with-imap --with-imap-ssl --with-kerberos --with-readline --with-libedit --with-gmp --with-pspell --with-tidy --with-enchant --with-fpm-user=nginx --with-fpm-group=nginx --disable-fileinfo --with-ldap --with-ldap-sasl --with-password-argon2 --with-sodium --with-config-file-scan-dir=/etc/centminmod/php.d --with-fpm-systemd --with-xsl
  1134. configure: WARNING: unrecognized options: --with-mcrypt, --with-mysql, --enable-gd-native-ttf, --with-t1lib
  1135. checking for grep that handles long lines and -e... /bin/grep
  1136. checking for egrep... /bin/grep -E
  1137. checking for a sed that does not truncate output... /bin/sed
  1138. checking build system type... x86_64-pc-linux-gnu
  1139. checking host system type... x86_64-pc-linux-gnu
  1140. checking target system type... x86_64-pc-linux-gnu
  1141. checking whether the C compiler works... yes
  1142. checking for C compiler default output file name... a.out
  1143. checking for suffix of executables...
  1144. checking whether we are cross compiling... no
  1145. checking for suffix of object files... o
  1146. checking whether we are using the GNU C compiler... yes
  1147. checking whether ccache /opt/rh/devtoolset-8/root/usr/bin/gcc accepts -g... yes
  1148. checking for ccache /opt/rh/devtoolset-8/root/usr/bin/gcc option to accept ISO C89... none needed
  1149. checking how to run the C preprocessor... ccache /opt/rh/devtoolset-8/root/usr/bin/gcc -E
  1150. checking for icc... no
  1151. checking for suncc... no
  1152. checking whether ccache /opt/rh/devtoolset-8/root/usr/bin/gcc and cc understand -c and -o together... yes
  1153. checking how to run the C preprocessor... ccache /opt/rh/devtoolset-8/root/usr/bin/gcc -E
  1154. checking for ANSI C header files... yes
  1155. checking for sys/types.h... yes
  1156. checking for sys/stat.h... yes
  1157. checking for stdlib.h... yes
  1158. checking for string.h... yes
  1159. checking for memory.h... yes
  1160. checking for strings.h... yes
  1161. checking for inttypes.h... yes
  1162. checking for stdint.h... yes
  1163. checking for unistd.h... yes
  1164. checking minix/config.h usability... no
  1165. checking minix/config.h presence... no
  1166. checking for minix/config.h... no
  1167. checking whether it is safe to define __EXTENSIONS__... yes
  1168. checking whether ln -s works... yes
  1169. checking for system library directory... lib64
  1170. checking whether to enable runpaths... yes
  1171. checking if compiler supports -R... no
  1172. checking if compiler supports -Wl,-rpath,... yes
  1173. checking for gawk... gawk
  1174. checking for bison... bison -y
  1175. checking for bison version... 3.0 (ok)
  1176. checking for re2c... re2c
  1177. checking for re2c version... 0.14.3 (ok)
  1178. checking whether to enable computed goto gcc extension with re2c... no
  1179. checking whether C compiler accepts -fvisibility=hidden... yes
  1180. checking whether to force non-PIC code in shared modules... no
  1181. checking whether /dev/urandom exists... yes
  1182. checking whether /dev/arandom exists... no
  1183. checking for global register variables support... yes
  1184. checking whether atof() accepts NAN... no
  1185. checking whether atof() accepts INF... no
  1186. checking whether HUGE_VAL == INF... yes
  1187. checking whether HUGE_VAL + -HUGEVAL == NAN... no
  1188. checking whether __cpuid_count is available... yes
  1189. checking for pthreads_cflags... -pthread
  1190. checking for pthreads_lib... pthread
  1191.  
  1192. Configuring SAPI modules
  1193. checking for Apache 2.0 handler-module support via DSO through APXS... no
  1194. checking for setproctitle... no
  1195. checking sys/pstat.h usability... no
  1196. checking sys/pstat.h presence... no
  1197. checking for sys/pstat.h... no
  1198. checking for PS_STRINGS... no
  1199. checking for CLI build... yes
  1200. checking for embedded SAPI library support... shared
  1201. checking for FPM build... yes
  1202. checking for setenv... yes
  1203. checking for clearenv... yes
  1204. checking for setproctitle... (cached) no
  1205. checking for setproctitle_fast... no
  1206. checking for library containing socket... none required
  1207. checking for library containing inet_addr... none required
  1208. checking errno.h usability... yes
  1209. checking errno.h presence... yes
  1210. checking for errno.h... yes
  1211. checking fcntl.h usability... yes
  1212. checking fcntl.h presence... yes
  1213. checking for fcntl.h... yes
  1214. checking stdio.h usability... yes
  1215. checking stdio.h presence... yes
  1216. checking for stdio.h... yes
  1217. checking for stdlib.h... (cached) yes
  1218. checking for unistd.h... (cached) yes
  1219. checking sys/uio.h usability... yes
  1220. checking sys/uio.h presence... yes
  1221. checking for sys/uio.h... yes
  1222. checking sys/select.h usability... yes
  1223. checking sys/select.h presence... yes
  1224. checking for sys/select.h... yes
  1225. checking sys/socket.h usability... yes
  1226. checking sys/socket.h presence... yes
  1227. checking for sys/socket.h... yes
  1228. checking sys/time.h usability... yes
  1229. checking sys/time.h presence... yes
  1230. checking for sys/time.h... yes
  1231. checking arpa/inet.h usability... yes
  1232. checking arpa/inet.h presence... yes
  1233. checking for arpa/inet.h... yes
  1234. checking netinet/in.h usability... yes
  1235. checking netinet/in.h presence... yes
  1236. checking for netinet/in.h... yes
  1237. checking sysexits.h usability... yes
  1238. checking sysexits.h presence... yes
  1239. checking for sysexits.h... yes
  1240. checking for prctl... yes
  1241. checking for clock_gettime... yes
  1242. checking for ptrace... yes
  1243. checking whether ptrace works... yes
  1244. checking for proc mem file... mem
  1245. checking if gcc supports __sync_bool_compare_and_swap... yes
  1246. checking for TCP_INFO... yes
  1247. checking for sysconf... yes
  1248. checking for times... yes
  1249. checking for kqueue... no
  1250. checking for port framework... no
  1251. checking for /dev/poll... no
  1252. checking for epoll... yes
  1253. checking for poll... yes
  1254. checking for select... yes
  1255. checking for apparmor... no
  1256. checking for pkg-config... /bin/pkg-config
  1257. checking for libsystemd... version 219
  1258. checking systemd/sd-daemon.h usability... yes
  1259. checking systemd/sd-daemon.h presence... yes
  1260. checking for systemd/sd-daemon.h... yes
  1261. checking for LiteSpeed support... no
  1262. checking for phpdbg support... yes
  1263. checking for phpdbg web SAPI support... no
  1264. checking for phpdbg debug build... no
  1265. checking whether termios.h defines TIOCGWINSZ... no
  1266. checking whether sys/ioctl.h defines TIOCGWINSZ... yes
  1267. checking for CGI build... yes
  1268. checking for socklen_t in sys/socket.h... yes
  1269. checking for sun_len in sys/un.h... no
  1270. checking whether cross-process locking is required by accept()... no
  1271. checking for chosen SAPI module... embed
  1272. checking for executable SAPI binaries...  cli fpm phpdbg cgi
  1273.  
  1274. Running system checks
  1275. checking for sendmail... /sbin/sendmail
  1276. checking whether system uses EBCDIC... no
  1277. checking whether byte ordering is bigendian... no
  1278. checking whether writing to stdout works... This is the test message -- yes
  1279. checking for socket... yes
  1280. checking for socketpair... yes
  1281. checking for htonl... yes
  1282. checking for gethostname... yes
  1283. checking for gethostbyaddr... yes
  1284. checking for yp_get_default_domain... no
  1285. checking for __yp_get_default_domain... no
  1286. checking for yp_get_default_domain in -lnsl... yes
  1287. checking for dlopen... no
  1288. checking for __dlopen... no
  1289. checking for dlopen in -ldl... yes
  1290. checking for sin in -lm... yes
  1291. checking for inet_aton... yes
  1292. checking for ANSI C header files... (cached) yes
  1293. checking for dirent.h that defines DIR... yes
  1294. checking for library containing opendir... none required
  1295. checking for inttypes.h... (cached) yes
  1296. checking for stdint.h... (cached) yes
  1297. checking for dirent.h... yes
  1298. checking for ApplicationServices/ApplicationServices.h... no
  1299. checking for sys/param.h... yes
  1300. checking for sys/types.h... (cached) yes
  1301. checking for sys/time.h... (cached) yes
  1302. checking for netinet/in.h... (cached) yes
  1303. checking for alloca.h... yes
  1304. checking for arpa/inet.h... (cached) yes
  1305. checking for arpa/nameser.h... yes
  1306. checking for assert.h... yes
  1307. checking for crypt.h... yes
  1308. checking for dns.h... no
  1309. checking for fcntl.h... (cached) yes
  1310. checking for grp.h... yes
  1311. checking for ieeefp.h... no
  1312. checking for langinfo.h... yes
  1313. checking for limits.h... yes
  1314. checking for locale.h... yes
  1315. checking for monetary.h... yes
  1316. checking for netdb.h... yes
  1317. checking for poll.h... yes
  1318. checking for pwd.h... yes
  1319. checking for resolv.h... yes
  1320. checking for signal.h... yes
  1321. checking for stdarg.h... yes
  1322. checking for stdlib.h... (cached) yes
  1323. checking for string.h... (cached) yes
  1324. checking for syslog.h... yes
  1325. checking for sysexits.h... (cached) yes
  1326. checking for sys/ioctl.h... yes
  1327. checking for sys/file.h... yes
  1328. checking for sys/mman.h... yes
  1329. checking for sys/mount.h... yes
  1330. checking for sys/poll.h... yes
  1331. checking for sys/resource.h... yes
  1332. checking for sys/select.h... (cached) yes
  1333. checking for sys/socket.h... (cached) yes
  1334. checking for sys/stat.h... (cached) yes
  1335. checking for sys/statfs.h... yes
  1336. checking for sys/statvfs.h... yes
  1337. checking for sys/vfs.h... yes
  1338. checking for sys/sysexits.h... no
  1339. checking for sys/varargs.h... no
  1340. checking for sys/wait.h... yes
  1341. checking for sys/loadavg.h... no
  1342. checking for termios.h... yes
  1343. checking for unistd.h... (cached) yes
  1344. checking for unix.h... no
  1345. checking for utime.h... yes
  1346. checking for sys/utsname.h... yes
  1347. checking for sys/ipc.h... yes
  1348. checking for dlfcn.h... yes
  1349. checking for assert.h... (cached) yes
  1350. checking for tmmintrin.h... yes
  1351. checking for nmmintrin.h... yes
  1352. checking for immintrin.h... yes
  1353. checking for fopencookie... yes
  1354. checking for broken getcwd... no
  1355. checking for broken libc stdio... yes
  1356. checking for broken gcc optimize-strlen... no
  1357. checking whether struct tm is in sys/time.h or time.h... time.h
  1358. checking for struct tm.tm_zone... yes
  1359. checking for missing declarations of reentrant functions... done
  1360. checking for fclose declaration... ok
  1361. checking for tm_gmtoff in struct tm... yes
  1362. checking for struct flock... yes
  1363. checking for socklen_t... yes
  1364. checking size of size_t... 8
  1365. checking size of long long... 8
  1366. checking size of long long int... 8
  1367. checking size of long... 8
  1368. checking size of int... 4
  1369. checking size of intmax_t... 8
  1370. checking size of ssize_t... 8
  1371. checking size of ptrdiff_t... 8
  1372. checking size of short... 2
  1373. checking size of int... (cached) 4
  1374. checking size of long... (cached) 8
  1375. checking size of long long... (cached) 8
  1376. checking for int8... no
  1377. checking for int16... no
  1378. checking for int32... no
  1379. checking for int64... no
  1380. checking for int8_t... yes
  1381. checking for int16_t... yes
  1382. checking for int32_t... yes
  1383. checking for int64_t... yes
  1384. checking for uint8... no
  1385. checking for uint16... no
  1386. checking for uint32... no
  1387. checking for uint64... no
  1388. checking for uint8_t... yes
  1389. checking for uint16_t... yes
  1390. checking for uint32_t... yes
  1391. checking for uint64_t... yes
  1392. checking for u_int8_t... yes
  1393. checking for u_int16_t... yes
  1394. checking for u_int32_t... yes
  1395. checking for u_int64_t... yes
  1396. checking for __builtin_expect... yes
  1397. checking for __builtin_clz... yes
  1398. checking for __builtin_ctzl... yes
  1399. checking for __builtin_ctzll... yes
  1400. checking for __builtin_smull_overflow... yes
  1401. checking for __builtin_smulll_overflow... yes
  1402. checking for __builtin_saddl_overflow... yes
  1403. checking for __builtin_saddll_overflow... yes
  1404. checking for __builtin_ssubl_overflow... yes
  1405. checking for __builtin_ssubll_overflow... yes
  1406. checking for __builtin_cpu_init... yes
  1407. checking for __builtin_cpu_supports... yes
  1408. checking for ssse3 instructions supports... yes
  1409. checking for sse4.2 instructions supports... yes
  1410. checking for avx instructions supports... yes
  1411. checking for avx2 instructions supports... yes
  1412. checking whether __SSE4_2__ is defined... no
  1413. checking for struct stat.st_blksize... yes
  1414. checking for struct stat.st_rdev... yes
  1415. checking for struct stat.st_blocks... yes
  1416. checking for size_t... yes
  1417. checking for uid_t in sys/types.h... yes
  1418. checking for struct sockaddr_storage... yes
  1419. checking for field sa_len in struct sockaddr... no
  1420. checking for __attribute__((ifunc))... yes
  1421. checking for __attribute__((target))... yes
  1422. checking for IPv6 support... yes
  1423. checking for vprintf... yes
  1424. checking for _doprnt... no
  1425. checking for alphasort... yes
  1426. checking for asctime_r... yes
  1427. checking for chroot... yes
  1428. checking for ctime_r... yes
  1429. checking for cuserid... yes
  1430. checking for crypt... no
  1431. checking for explicit_memset... no
  1432. checking for flock... yes
  1433. checking for ftok... yes
  1434. checking for funopen... no
  1435. checking for gai_strerror... yes
  1436. checking for gcvt... yes
  1437. checking for getloadavg... yes
  1438. checking for getlogin... yes
  1439. checking for getprotobyname... yes
  1440. checking for getprotobynumber... yes
  1441. checking for getservbyname... yes
  1442. checking for getservbyport... yes
  1443. checking for gethostname... (cached) yes
  1444. checking for getrusage... yes
  1445. checking for gettimeofday... yes
  1446. checking for gmtime_r... yes
  1447. checking for getpwnam_r... yes
  1448. checking for getgrnam_r... yes
  1449. checking for getpwuid_r... yes
  1450. checking for grantpt... yes
  1451. checking for inet_ntoa... yes
  1452. checking for inet_ntop... yes
  1453. checking for inet_pton... yes
  1454. checking for isascii... yes
  1455. checking for link... yes
  1456. checking for localtime_r... yes
  1457. checking for lockf... yes
  1458. checking for lchown... yes
  1459. checking for lrand48... yes
  1460. checking for memcpy... yes
  1461. checking for memmove... yes
  1462. checking for mkstemp... yes
  1463. checking for mmap... yes
  1464. checking for nl_langinfo... yes
  1465. checking for perror... yes
  1466. checking for poll... yes
  1467. checking for ptsname... yes
  1468. checking for putenv... yes
  1469. checking for realpath... yes
  1470. checking for random... yes
  1471. checking for rand_r... yes
  1472. checking for scandir... yes
  1473. checking for setitimer... yes
  1474. checking for setlocale... yes
  1475. checking for localeconv... yes
  1476. checking for setenv... (cached) yes
  1477. checking for setpgid... yes
  1478. checking for setsockopt... yes
  1479. checking for setvbuf... yes
  1480. checking for shutdown... yes
  1481. checking for sin... yes
  1482. checking for snprintf... yes
  1483. checking for srand48... yes
  1484. checking for srandom... yes
  1485. checking for statfs... yes
  1486. checking for statvfs... yes
  1487. checking for std_syslog... no
  1488. checking for strcasecmp... yes
  1489. checking for strcoll... yes
  1490. checking for strdup... yes
  1491. checking for strerror... yes
  1492. checking for strftime... yes
  1493. checking for strnlen... yes
  1494. checking for strptime... yes
  1495. checking for strstr... yes
  1496. checking for strtok_r... yes
  1497. checking for symlink... yes
  1498. checking for tempnam... yes
  1499. checking for tzset... yes
  1500. checking for unlockpt... yes
  1501. checking for unsetenv... yes
  1502. checking for usleep... yes
  1503. checking for utime... yes
  1504. checking for vsnprintf... yes
  1505. checking for vasprintf... yes
  1506. checking for asprintf... yes
  1507. checking for nanosleep... yes
  1508. checking for nanosleep in -lrt... yes
  1509. checking for getaddrinfo... yes
  1510. checking for __sync_fetch_and_add... yes
  1511. checking for strlcat... no
  1512. checking for strlcpy... no
  1513. checking for explicit_bzero... no
  1514. checking for getopt... yes
  1515. checking for utime.h... (cached) yes
  1516. checking whether utime accepts a null argument... yes
  1517. checking for working alloca.h... yes
  1518. checking for alloca... yes
  1519. checking for declared timezone... yes
  1520. checking for type of reentrant time-related functions... POSIX
  1521. checking for readdir_r... yes
  1522. checking for type of readdir_r... POSIX
  1523. checking for in_addr_t... yes
  1524. checking for crypt_r... no
  1525. checking for asm goto... yes
  1526. checking whether compiler supports VLA... yes
  1527. checking whether to enable valgrind support... yes
  1528. checking for valgrind header... not found
  1529.  
  1530. General settings
  1531. checking whether to include gcov symbols... no
  1532. checking whether to include debugging symbols... no
  1533. checking layout of installed files... PHP
  1534. checking path to configuration file... DEFAULT
  1535. checking where to scan for configuration files... /etc/centminmod/php.d
  1536. checking whether to enable PHP's own SIGCHLD handler... no
  1537. checking whether to explicitly link against libgcc... no
  1538. checking whether to enable short tags by default... yes
  1539. checking whether to enable dmalloc... no
  1540. checking whether to enable IPv6 support... yes
  1541. checking whether to enable DTrace support... no
  1542. checking how big to make fd sets... using system default
  1543.  
  1544. Configuring extensions
  1545. checking for strings.h... (cached) yes
  1546. checking io.h usability... no
  1547. checking io.h presence... no
  1548. checking for io.h... no
  1549. checking for strtoll... yes
  1550. checking for atoll... yes
  1551. checking whether to enable LIBXML support... yes
  1552. checking libxml2 install dir... no
  1553. checking for xml2-config path... /usr/bin/xml2-config
  1554. checking whether libxml build works... yes
  1555. checking for OpenSSL support... yes
  1556. checking for Kerberos support... yes
  1557. checking whether to use system default cipher list instead of hardcoded value... no
  1558. checking for krb5-config... /bin/krb5-config
  1559. checking for RAND_egd... no
  1560. checking for PCRE library to use... bundled
  1561. checking whether to enable PCRE JIT functionality... yes
  1562. checking whether to enable the SQLite3 extension... yes
  1563. checking bundled sqlite3 library... yes
  1564. checking for ZLIB support... yes
  1565. checking if the location of ZLIB install directory is defined... no
  1566. checking for zlib version >= 1.2.0.4... 1.2.7
  1567. checking for gzgets in -lz... yes
  1568. checking whether to enable bc style precision math functions... yes
  1569. checking for BZip2 support... yes
  1570. checking for BZip2 in default path... found in /usr
  1571. checking for BZ2_bzerror in -lbz2... yes
  1572. checking whether to enable calendar conversion support... yes
  1573. checking whether to enable ctype functions... yes
  1574. checking for cURL support... yes
  1575. checking for libcurl.pc... using default path
  1576. checking for cURL 7.15.5 or greater... 7.64.0
  1577. checking for SSL support in libcurl... yes
  1578. checking how to run the C preprocessor... ccache /opt/rh/devtoolset-8/root/usr/bin/gcc -E
  1579. checking for openssl support in libcurl... no
  1580. checking for gnutls support in libcurl... no
  1581. checking for curl_easy_perform in -lcurl... yes
  1582. checking for curl_easy_strerror in -lcurl... yes
  1583. checking for curl_multi_strerror in -lcurl... yes
  1584. checking for QDBM support... no
  1585. checking for GDBM support... no
  1586. checking for NDBM support... no
  1587. checking for TCADB support... no
  1588. checking for LMDB support... no
  1589. checking for Berkeley DB4 support... no
  1590. checking for Berkeley DB3 support... no
  1591. checking for Berkeley DB2 support... no
  1592. checking for DB1 support... no
  1593. checking for DBM support... no
  1594. checking for CDB support... no
  1595. checking for INI File support... no
  1596. checking for FlatFile support... no
  1597. checking whether to enable DBA interface... no
  1598. checking whether to enable DOM support... yes
  1599. checking for xml2-config path... (cached) /usr/bin/xml2-config
  1600. checking whether libxml build works... (cached) yes
  1601. checking for ENCHANT support... yes
  1602. checking for enchant_broker_set_param in -lenchant... yes
  1603. checking whether to enable EXIF (metadata from images) support... yes
  1604. checking for fileinfo support... no
  1605. checking whether to enable input filter support... yes
  1606. checking pcre install prefix... no
  1607. checking whether to enable FTP support... yes
  1608. checking OpenSSL dir for FTP... no
  1609. checking for GD support... yes
  1610. checking for the location of libwebp... /usr
  1611. checking for the location of libjpeg... /usr
  1612. checking for the location of libpng... /usr
  1613. checking for the location of libXpm... /usr
  1614. checking for FreeType 2... /usr
  1615. checking whether to enable JIS-mapped Japanese font support in GD... no
  1616. checking for WebPGetInfo in -lwebp... yes
  1617. checking for jpeg_read_header in -ljpeg... yes
  1618. checking for png_write_image in -lpng... yes
  1619. checking for XpmFreeXpmImage in -lXpm... yes
  1620. checking for fabsf... yes
  1621. checking for floorf... yes
  1622. checking for GNU gettext support... yes
  1623. checking for bindtextdomain in -lintl... no
  1624. checking for bindtextdomain in -lc... yes
  1625. checking for ngettext in -lc... yes
  1626. checking for dngettext in -lc... yes
  1627. checking for dcngettext in -lc... yes
  1628. checking for bind_textdomain_codeset in -lc... yes
  1629. checking for GNU MP support... yes
  1630. checking for __gmpz_rootrem in -lgmp... yes
  1631. checking for mhash support... yes
  1632. checking whether to enable hash support... yes
  1633. checking whether byte ordering is bigendian... (cached) no
  1634. checking size of short... (cached) 2
  1635. checking size of int... (cached) 4
  1636. checking size of long... (cached) 8
  1637. checking size of long long... (cached) 8
  1638. checking size of long int... 8
  1639. checking checking if we're at 64-bit platform... yes
  1640. checking for iconv support... yes
  1641. checking for iconv... yes
  1642. checking if iconv is glibc's... yes
  1643. checking if iconv supports errno... yes
  1644. checking if iconv supports //IGNORE... no
  1645. checking if your cpp allows macro usage in include lines... yes
  1646. checking for IMAP support... yes
  1647. checking for IMAP Kerberos support... yes
  1648. checking for IMAP SSL support... yes
  1649. checking for utf8_mime2text signature... new
  1650. checking for U8T_DECOMPOSE... yes
  1651. checking for pam_start in -lpam... yes
  1652. checking for crypt in -lcrypt... yes
  1653. checking whether rfc822_output_address_list function present... yes
  1654. checking whether build with IMAP works... yes
  1655. checking for Firebird support... no
  1656. checking whether to enable internationalization support... yes
  1657. checking for location of ICU headers and libraries... found 50.1.2
  1658. found
  1659. checking whether we are using the GNU C++ compiler... yes
  1660. checking whether ccache /opt/rh/devtoolset-8/root/usr/bin/g++ accepts -g... yes
  1661. checking how to run the C++ preprocessor... ccache /opt/rh/devtoolset-8/root/usr/bin/g++ -E
  1662. checking whether to enable JavaScript Object Serialization support... yes
  1663. checking for ANSI C header files... (cached) yes
  1664. checking for LDAP support... yes
  1665. checking for LDAP Cyrus SASL support... yes
  1666. checking size of long int... (cached) 8
  1667. checking for 3 arg ldap_set_rebind_proc... yes
  1668. checking for ldap_parse_result... yes
  1669. checking for ldap_parse_reference... yes
  1670. checking for ldap_start_tls_s... yes
  1671. checking for ldap_control_find... yes
  1672. checking for ldap_parse_extended_result... yes
  1673. checking for ldap_extended_operation... yes
  1674. checking for ldap_extended_operation_s... yes
  1675. checking for ldap_passwd... yes
  1676. checking for ldap_whoami_s... yes
  1677. checking for ldap_refresh_s... yes
  1678. checking for sasl_version in -lsasl2... yes
  1679. checking for ldap_bind_s... yes
  1680. checking whether to enable multibyte string support... yes
  1681. checking whether to enable multibyte regex support... yes
  1682. checking whether to check multibyte regex backtrack... yes
  1683. checking for external oniguruma... no
  1684. checking for variable length prototypes and stdarg.h... yes
  1685. checking for stdlib.h... (cached) yes
  1686. checking for string.h... (cached) yes
  1687. checking for strings.h... (cached) yes
  1688. checking for unistd.h... (cached) yes
  1689. checking for sys/time.h... (cached) yes
  1690. checking sys/times.h usability... yes
  1691. checking sys/times.h presence... yes
  1692. checking for sys/times.h... yes
  1693. checking for stdarg.h... (cached) yes
  1694. checking for limits.h... (cached) yes
  1695. checking size of int... (cached) 4
  1696. checking size of short... (cached) 2
  1697. checking size of long... (cached) 8
  1698. checking for an ANSI C-conforming const... yes
  1699. checking whether time.h and sys/time.h may both be included... yes
  1700. checking for working alloca.h... (cached) yes
  1701. checking for alloca... (cached) yes
  1702. checking for working memcmp... yes
  1703. checking for stdarg.h... (cached) yes
  1704. checking for MySQLi support... yes
  1705. checking whether to enable embedded MySQLi support... no
  1706. checking for specified location of the MySQL UNIX socket... /var/lib/mysql/mysql.sock
  1707. checking for MySQL UNIX socket location... /var/lib/mysql/mysql.sock
  1708. checking for Oracle Database OCI8 support... no
  1709. checking for Adabas support... no
  1710. checking for SAP DB support... no
  1711. checking for Solid support... no
  1712. checking for IBM DB2 support... no
  1713. checking for Empress support... no
  1714. checking for Empress local access support... no
  1715. checking for a custom ODBC support... no
  1716. checking for iODBC support... no
  1717. checking for Easysoft ODBC-ODBC Bridge support... no
  1718. checking for unixODBC support... no
  1719. checking for DBMaker support... no
  1720. checking for any ODBC driver support... no
  1721. checking whether to enable Zend OPcache support... yes
  1722. checking whether to enable file based caching... yes
  1723. checking whether to enable copying PHP CODE pages into HUGE PAGES... yes
  1724. checking for mprotect... yes
  1725. checking for unistd.h... (cached) yes
  1726. checking for sys/uio.h... (cached) yes
  1727. checking for sysvipc shared memory support... yes
  1728. checking for mmap() using MAP_ANON shared memory support... yes
  1729. checking for mmap() using /dev/zero shared memory support... yes
  1730. checking for mmap() using shm_open() shared memory support... yes
  1731. checking for mmap() using regular file shared memory support... yes
  1732. checking whether to enable pcntl support... yes
  1733. checking for fork... yes
  1734. checking for waitpid... yes
  1735. checking for sigaction... yes
  1736. checking for getpriority... yes
  1737. checking for setpriority... yes
  1738. checking for wait3... yes
  1739. checking for wait4... yes
  1740. checking for sigprocmask... yes
  1741. checking for sigwaitinfo... yes
  1742. checking for sigtimedwait... yes
  1743. checking for siginfo_t... yes
  1744. checking whether to enable PDO support... yes
  1745. checking for PDO_DBLIB support via FreeTDS... no
  1746. checking for Firebird support for PDO... no
  1747. checking for MySQL support for PDO... yes
  1748. checking for MySQL UNIX socket location... /var/lib/mysql/mysql.sock
  1749. checking for PDO includes... checking for PDO includes... /svr-setup/php-7.3.3/ext
  1750. checking Oracle OCI support for PDO... no
  1751. checking for ODBC v3 support for PDO... no
  1752. checking for PostgreSQL support for PDO... no
  1753. checking for sqlite 3 support for PDO... yes
  1754. checking for PDO includes... (cached) /svr-setup/php-7.3.3/ext
  1755. checking for usleep... (cached) yes
  1756. checking for nanosleep... (cached) yes
  1757. checking time.h usability... yes
  1758. checking time.h presence... yes
  1759. checking for time.h... yes
  1760. checking for fdatasync in -lrt... yes
  1761. checking for PostgreSQL support... no
  1762. checking for phar archive support... yes
  1763. checking for phar openssl support... yes
  1764. checking whether to enable POSIX-like functions... yes
  1765. checking sys/mkdev.h usability... no
  1766. checking sys/mkdev.h presence... no
  1767. checking for sys/mkdev.h... no
  1768. checking sys/sysmacros.h usability... yes
  1769. checking sys/sysmacros.h presence... yes
  1770. checking for sys/sysmacros.h... yes
  1771. checking for seteuid... yes
  1772. checking for setegid... yes
  1773. checking for setsid... yes
  1774. checking for getsid... yes
  1775. checking for setpgid... (cached) yes
  1776. checking for getpgid... yes
  1777. checking for ctermid... yes
  1778. checking for mkfifo... yes
  1779. checking for mknod... yes
  1780. checking for setrlimit... yes
  1781. checking for getrlimit... yes
  1782. checking for getlogin... (cached) yes
  1783. checking for getgroups... yes
  1784. checking for makedev... no
  1785. checking for initgroups... yes
  1786. checking for getpwuid_r... (cached) yes
  1787. checking for getgrgid_r... yes
  1788. checking for working ttyname_r() implementation... yes
  1789. checking for utsname.domainname... yes
  1790. checking for PSPELL support... yes
  1791. checking for new_aspell_config in -laspell... yes
  1792. checking for libedit readline replacement... yes
  1793. checking for tgetent in -lncurses... yes
  1794. checking for readline in -ledit... yes
  1795. checking for rl_callback_read_char in -ledit... yes
  1796. checking for rl_on_new_line in -ledit... yes
  1797. checking for rl_completion_matches in -ledit... yes
  1798. checking for recode support... no
  1799. checking whether to enable PHP sessions... yes
  1800. checking for mm support... no
  1801. checking whether pwrite works... yes
  1802. checking whether pread works... yes
  1803. checking whether to enable shmop support... yes
  1804. checking whether to enable SimpleXML support... yes
  1805. checking for xml2-config path... (cached) /usr/bin/xml2-config
  1806. checking whether libxml build works... (cached) yes
  1807. checking for SNMP support... yes
  1808. checking OpenSSL dir for SNMP... no
  1809. checking for net-snmp-config... /bin/net-snmp-config
  1810. checking for init_snmp in -lnetsnmp... yes
  1811. checking for shutdown_snmp_logging in -lnetsnmp... yes
  1812. checking whether to enable SOAP support... yes
  1813. checking for xml2-config path... (cached) /usr/bin/xml2-config
  1814. checking whether libxml build works... (cached) yes
  1815. checking whether to enable sockets support... yes
  1816. checking for struct cmsghdr... yes
  1817. checking for hstrerror... yes
  1818. checking for socketpair... (cached) yes
  1819. checking for if_nametoindex... yes
  1820. checking for if_indextoname... yes
  1821. checking for netdb.h... (cached) yes
  1822. checking netinet/tcp.h usability... yes
  1823. checking netinet/tcp.h presence... yes
  1824. checking for netinet/tcp.h... yes
  1825. checking sys/un.h usability... yes
  1826. checking sys/un.h presence... yes
  1827. checking for sys/un.h... yes
  1828. checking sys/sockio.h usability... no
  1829. checking sys/sockio.h presence... no
  1830. checking for sys/sockio.h... no
  1831. checking for errno.h... (cached) yes
  1832. checking for field ss_family in struct sockaddr_storage... yes
  1833. checking if getaddrinfo supports AI_V4MAPPED... yes
  1834. checking if getaddrinfo supports AI_ALL... yes
  1835. checking if getaddrinfo supports AI_IDN... yes
  1836. checking for sodium support... yes
  1837. checking for pkg-config... (cached) /bin/pkg-config
  1838. checking for libsodium... found in /usr/local
  1839. checking for sodium_add in -lsodium... yes
  1840. checking whether flush should be called explicitly after a buffered io... no
  1841. checking for crypt in -lcrypt... (cached) yes
  1842. checking for standard DES crypt... yes
  1843. checking for extended DES crypt... no
  1844. checking for MD5 crypt... yes
  1845. checking for Blowfish crypt... no
  1846. checking for SHA512 crypt... yes
  1847. checking for SHA256 crypt... yes
  1848. checking whether the compiler supports __alignof__... yes
  1849. checking whether the compiler supports aligned attribute... yes
  1850. checking for getcwd... yes
  1851. checking for getwd... yes
  1852. checking for asinh... yes
  1853. checking for acosh... yes
  1854. checking for atanh... yes
  1855. checking for log1p... yes
  1856. checking for hypot... yes
  1857. checking for glob... yes
  1858. checking for strfmon... yes
  1859. checking for nice... yes
  1860. checking for fpclass... no
  1861. checking for mempcpy... yes
  1862. checking for strpncpy... no
  1863. checking for working POSIX fnmatch... yes
  1864. checking for fork... (cached) yes
  1865. checking if your OS can spawn processes with inherited handles... yes
  1866. checking for res_nsearch... no
  1867. checking for __res_nsearch... no
  1868. checking for res_nsearch in -lresolv... no
  1869. checking for __res_nsearch in -lresolv... yes
  1870. checking for res_ndestroy... no
  1871. checking for __res_ndestroy... no
  1872. checking for res_ndestroy in -lresolv... no
  1873. checking for __res_ndestroy in -lresolv... no
  1874. checking for res_ndestroy in -lbind... no
  1875. checking for __res_ndestroy in -lbind... no
  1876. checking for res_ndestroy in -lsocket... no
  1877. checking for __res_ndestroy in -lsocket... no
  1878. checking for dns_search... no
  1879. checking for __dns_search... no
  1880. checking for dns_search in -lresolv... no
  1881. checking for __dns_search in -lresolv... no
  1882. checking for dns_search in -lbind... no
  1883. checking for __dns_search in -lbind... no
  1884. checking for dns_search in -lsocket... no
  1885. checking for __dns_search in -lsocket... no
  1886. checking for dn_expand... no
  1887. checking for __dn_expand... yes
  1888. checking for dn_skipname... no
  1889. checking for __dn_skipname... yes
  1890. checking for res_search... no
  1891. checking for __res_search... yes
  1892. checking whether strptime() declaration fails... yes
  1893. checking wchar.h usability... yes
  1894. checking wchar.h presence... yes
  1895. checking for wchar.h... yes
  1896. checking for mblen... yes
  1897. checking for mbrlen... yes
  1898. checking for mbsinit... yes
  1899. checking for mbstate_t... yes
  1900. checking atomic.h usability... no
  1901. checking atomic.h presence... no
  1902. checking for atomic.h... no
  1903. checking whether arc4random_buf is declared... no
  1904. checking for Argon2 support... yes
  1905. checking for Argon2 library... found in /usr/local
  1906. checking for argon2id_hash_raw in -largon2... yes
  1907. checking for net/if.h... yes
  1908. checking for netdb.h... (cached) yes
  1909. checking for usable getifaddrs... yes
  1910. checking whether to enable System V IPC support... yes
  1911. checking sys/msg.h usability... yes
  1912. checking sys/msg.h presence... yes
  1913. checking for sys/msg.h... yes
  1914. checking whether to enable System V semaphore support... yes
  1915. checking for union semun... no
  1916. checking whether to enable System V shared memory support... yes
  1917. checking for TIDY support... yes
  1918. checking for tidyOptGetDoc in -ltidy... yes
  1919. checking for tidyReleaseDate in -ltidy... yes
  1920. checking whether to enable tokenizer support... yes
  1921. checking whether to enable WDDX support... no
  1922. checking libexpat dir for WDDX... no
  1923. checking whether to enable XML support... yes
  1924. checking libexpat install dir... no
  1925. checking for xml2-config path... (cached) /usr/bin/xml2-config
  1926. checking whether libxml build works... (cached) yes
  1927. checking whether to enable XMLReader support... yes
  1928. checking for xml2-config path... (cached) /usr/bin/xml2-config
  1929. checking whether libxml build works... (cached) yes
  1930. checking for XMLRPC-EPI support... yes
  1931. checking libexpat dir for XMLRPC-EPI... no
  1932. checking iconv dir for XMLRPC-EPI... no
  1933. checking for xml2-config path... (cached) /usr/bin/xml2-config
  1934. checking whether libxml build works... (cached) yes
  1935. checking for ranlib... ranlib
  1936. checking for inline... inline
  1937. checking for ANSI C header files... (cached) yes
  1938. checking xmlparse.h usability... no
  1939. checking xmlparse.h presence... no
  1940. checking for xmlparse.h... no
  1941. checking xmltok.h usability... no
  1942. checking xmltok.h presence... no
  1943. checking for xmltok.h... no
  1944. checking for stdlib.h... (cached) yes
  1945. checking for strings.h... (cached) yes
  1946. checking for string.h... (cached) yes
  1947. checking size of char... 1
  1948. checking size of int... (cached) 4
  1949. checking size of long... (cached) 8
  1950. checking size of long long... (cached) 8
  1951. checking for size_t... (cached) yes
  1952. checking whether time.h and sys/time.h may both be included... (cached) yes
  1953. checking for uid_t in sys/types.h... (cached) yes
  1954. checking for strtoul... yes
  1955. checking for strtoull... yes
  1956. checking for snprintf... (cached) yes
  1957. checking for strstr... (cached) yes
  1958. checking for strpbrk... yes
  1959. checking for strerror... (cached) yes
  1960. checking for memcpy... (cached) yes
  1961. checking for memmove... (cached) yes
  1962. checking whether to enable XMLWriter support... yes
  1963. checking for xml2-config path... (cached) /usr/bin/xml2-config
  1964. checking whether libxml build works... (cached) yes
  1965. checking for XSL support... yes
  1966. checking for EXSLT support... found
  1967. checking whether to enable zend-test extension... no
  1968. checking for zip archive read/writesupport... yes
  1969. checking pcre install prefix... no
  1970. checking libzip... yes
  1971. checking for the location of zlib... /usr
  1972. checking for pkg-config... (cached) /bin/pkg-config
  1973. checking for libzip... in default path: found in /usr/local
  1974. checking for zip_open in -lzip... yes
  1975. checking for zip_file_set_encryption in -lzip... yes
  1976. checking for zip_libzip_version in -lzip... yes
  1977. checking stdbool.h usability... yes
  1978. checking stdbool.h presence... yes
  1979. checking for stdbool.h... yes
  1980. checking fts.h usability... yes
  1981. checking fts.h presence... yes
  1982. checking for fts.h... yes
  1983. checking for int8_t... (cached) yes
  1984. checking for int16_t... (cached) yes
  1985. checking for int32_t... (cached) yes
  1986. checking for int64_t... (cached) yes
  1987. checking for uint8_t... (cached) yes
  1988. checking for uint16_t... (cached) yes
  1989. checking for uint32_t... (cached) yes
  1990. checking for uint64_t... (cached) yes
  1991. checking for ssize_t... yes
  1992. checking size of short... (cached) 2
  1993. checking size of int... (cached) 4
  1994. checking size of long... (cached) 8
  1995. checking size of long long... (cached) 8
  1996. checking size of off_t... 8
  1997. checking size of size_t... (cached) 8
  1998. checking for touch... /bin/touch
  1999. checking for unzip... /bin/unzip
  2000. checking for struct tm.tm_zone... (cached) yes
  2001. checking whether to enable mysqlnd... no
  2002. checking whether to disable compressed protocol support in mysqlnd... yes
  2003. checking for DSA_get_default_method in -lssl... yes
  2004. checking for X509_free in -lcrypto... yes
  2005.  
  2006. Configuring PEAR
  2007. checking whether to install PEAR... yes
  2008.  
  2009. Configuring Zend
  2010. checking for bison version... (cached) 3.0 (ok)
  2011. checking for inttypes.h... (cached) yes
  2012. checking for stdint.h... (cached) yes
  2013. checking for limits.h... (cached) yes
  2014. checking malloc.h usability... yes
  2015. checking malloc.h presence... yes
  2016. checking for malloc.h... yes
  2017. checking for string.h... (cached) yes
  2018. checking for unistd.h... (cached) yes
  2019. checking for stdarg.h... (cached) yes
  2020. checking for sys/types.h... (cached) yes
  2021. checking for sys/time.h... (cached) yes
  2022. checking for signal.h... (cached) yes
  2023. checking for unix.h... (cached) no
  2024. checking for stdlib.h... (cached) yes
  2025. checking cpuid.h usability... yes
  2026. checking cpuid.h presence... yes
  2027. checking for cpuid.h... yes
  2028. checking for dlfcn.h... (cached) yes
  2029. checking for size_t... (cached) yes
  2030. checking for uint... yes
  2031. checking for ulong... yes
  2032. checking for int32_t... yes
  2033. checking for uint32_t... yes
  2034. checking for vprintf... (cached) yes
  2035. checking for _doprnt... (cached) no
  2036. checking for working memcmp... (cached) yes
  2037. checking for working alloca.h... (cached) yes
  2038. checking for alloca... (cached) yes
  2039. checking for memcpy... (cached) yes
  2040. checking for strdup... (cached) yes
  2041. checking for getpid... yes
  2042. checking for kill... yes
  2043. checking for strtod... yes
  2044. checking for strtol... yes
  2045. checking for finite... yes
  2046. checking for fpclass... (cached) no
  2047. checking for sigsetjmp... no
  2048. checking whether sprintf is broken... no
  2049. checking whether isfinite is declared... yes
  2050. checking whether isnan is declared... yes
  2051. checking whether isinf is declared... yes
  2052. checking whether fp_except is defined... no
  2053. checking for usable _FPU_SETCW... no
  2054. checking for usable fpsetprec... no
  2055. checking for usable _controlfp... no
  2056. checking for usable _controlfp_s... no
  2057. checking whether FPU control word can be manipulated by inline assembler... no
  2058. checking whether double cast to long preserves least significant bits... no
  2059. checking for dlfcn.h... (cached) yes
  2060. checking whether dlsym() requires a leading underscore in symbol names... no
  2061. checking whether to enable thread-safety... no
  2062. checking whether to enable inline optimization for GCC... yes
  2063. checking whether to enable Zend debugging... no
  2064. checking for inline... (cached) inline
  2065. checking target system is Darwin... no
  2066. checking for MM alignment and log values... done
  2067. checking for memory allocation using mmap(MAP_ANON)... yes
  2068. checking for memory allocation using mmap("/dev/zero")... yes
  2069. checking for mremap... yes
  2070. checking for sigaction... (cached) yes
  2071. checking whether to enable zend signal handling... yes
  2072.  
  2073. Configuring TSRM
  2074. checking for stdarg.h... (cached) yes
  2075. checking for sigprocmask... (cached) yes
  2076. checking how many arguments gethostbyname_r() takes... six
  2077.  
  2078. Configuring libtool
  2079. checking for ld used by ccache /opt/rh/devtoolset-8/root/usr/bin/gcc... /opt/rh/devtoolset-8/root/usr/libexec/gcc/x86_64-redhat-linux/8/ld
  2080. checking if the linker (/opt/rh/devtoolset-8/root/usr/libexec/gcc/x86_64-redhat-linux/8/ld) is GNU ld... yes
  2081. checking for /opt/rh/devtoolset-8/root/usr/libexec/gcc/x86_64-redhat-linux/8/ld option to reload object files... -r
  2082. checking for BSD-compatible nm... /opt/rh/devtoolset-8/root/usr/bin/nm -B
  2083. checking how to recognize dependent libraries... pass_all
  2084. checking how to run the C++ preprocessor... ccache /opt/rh/devtoolset-8/root/usr/bin/g++ -E
  2085. checking the maximum length of command line arguments... 1572864
  2086. checking command to parse /opt/rh/devtoolset-8/root/usr/bin/nm -B output from ccache /opt/rh/devtoolset-8/root/usr/bin/gcc object... ok
  2087. checking for objdir... .libs
  2088. checking for ar... ar
  2089. checking for ranlib... (cached) ranlib
  2090. checking for strip... strip
  2091. checking if ccache /opt/rh/devtoolset-8/root/usr/bin/gcc supports -fno-rtti -fno-exceptions... no
  2092. checking for ccache /opt/rh/devtoolset-8/root/usr/bin/gcc option to produce PIC... -fPIC
  2093. checking if ccache /opt/rh/devtoolset-8/root/usr/bin/gcc PIC flag -fPIC works... yes
  2094. checking if ccache /opt/rh/devtoolset-8/root/usr/bin/gcc static flag -static works... no
  2095. checking if ccache /opt/rh/devtoolset-8/root/usr/bin/gcc supports -c -o file.o... yes
  2096. checking whether the ccache /opt/rh/devtoolset-8/root/usr/bin/gcc linker (/opt/rh/devtoolset-8/root/usr/libexec/gcc/x86_64-redhat-linux/8/ld -m elf_x86_64) supports shared libraries... yes
  2097. checking whether -lc should be explicitly linked in... no
  2098. checking dynamic linker characteristics... GNU/Linux ld.so
  2099. checking how to hardcode library paths into programs... immediate
  2100. checking whether stripping libraries is possible... yes
  2101. checking if libtool supports shared libraries... yes
  2102. checking whether to build shared libraries... yes
  2103. checking whether to build static libraries... no
  2104.  
  2105. creating libtool
  2106. appending configuration tag "CXX" to libtool
  2107. checking for ld used by ccache /opt/rh/devtoolset-8/root/usr/bin/g++... /opt/rh/devtoolset-8/root/usr/libexec/gcc/x86_64-redhat-linux/8/ld -m elf_x86_64
  2108. checking if the linker (/opt/rh/devtoolset-8/root/usr/libexec/gcc/x86_64-redhat-linux/8/ld -m elf_x86_64) is GNU ld... yes
  2109. checking whether the ccache /opt/rh/devtoolset-8/root/usr/bin/g++ linker (/opt/rh/devtoolset-8/root/usr/libexec/gcc/x86_64-redhat-linux/8/ld -m elf_x86_64) supports shared libraries... yes
  2110. checking for ccache /opt/rh/devtoolset-8/root/usr/bin/g++ option to produce PIC... -fPIC
  2111. checking if ccache /opt/rh/devtoolset-8/root/usr/bin/g++ PIC flag -fPIC works... yes
  2112. checking if ccache /opt/rh/devtoolset-8/root/usr/bin/g++ static flag -static works... no
  2113. checking if ccache /opt/rh/devtoolset-8/root/usr/bin/g++ supports -c -o file.o... yes
  2114. checking whether the ccache /opt/rh/devtoolset-8/root/usr/bin/g++ linker (/opt/rh/devtoolset-8/root/usr/libexec/gcc/x86_64-redhat-linux/8/ld -m elf_x86_64) supports shared libraries... yes
  2115. checking dynamic linker characteristics... GNU/Linux ld.so
  2116. (cached) (cached) checking how to hardcode library paths into programs... immediate
  2117.  
  2118. Generating files
  2119. configure: creating ./config.status
  2120. creating main/internal_functions.c
  2121. creating main/internal_functions_cli.c
  2122. +--------------------------------------------------------------------+
  2123. | License:                                                           |
  2124. | This software is subject to the PHP License, available in this     |
  2125. | distribution in the file LICENSE.  By continuing this installation |
  2126. | process, you are bound by the terms of this license agreement.     |
  2127. | If you do not agree with the terms of this license, you must abort |
  2128. | the installation process at this point.                            |
  2129. +--------------------------------------------------------------------+
  2130.  
  2131. Thank you for using PHP.
  2132.  
  2133. config.status: creating php7.spec
  2134. config.status: creating main/build-defs.h
  2135. config.status: creating scripts/phpize
  2136. config.status: creating scripts/man1/phpize.1
  2137. config.status: creating scripts/php-config
  2138. config.status: creating scripts/man1/php-config.1
  2139. config.status: creating sapi/cli/php.1
  2140. config.status: creating sapi/fpm/php-fpm.conf
  2141. config.status: creating sapi/fpm/www.conf
  2142. config.status: creating sapi/fpm/init.d.php-fpm
  2143. config.status: creating sapi/fpm/php-fpm.service
  2144. config.status: creating sapi/fpm/php-fpm.8
  2145. config.status: creating sapi/fpm/status.html
  2146. config.status: creating sapi/phpdbg/phpdbg.1
  2147. config.status: creating sapi/cgi/php-cgi.1
  2148. config.status: creating ext/phar/phar.1
  2149. config.status: creating ext/phar/phar.phar.1
  2150. config.status: creating main/php_config.h
  2151. config.status: executing default commands
  2152. configure: WARNING: unrecognized options: --with-mcrypt, --with-mysql, --enable-gd-native-ttf, --with-t1lib
  2153.  
  2154. Fri Mar  8 22:06:22 CET 2019
  2155. Success: PHP configure ok
  2156.  
  2157. service php-fpm restart
  2158. Gracefully shutting down php-fpm . done
  2159. Starting php-fpm  done
  2160.               ____   _   _  ____       __  __         _        
  2161.              |  _ \ | | | ||  _ \  _  |  \/  |  __ _ | | __ ___
  2162.              | |_) || |_| || |_) |(_) | |\/| | / _` || |/ // _ \
  2163.              |  __/ |  _  ||  __/  _  | |  | || (_| ||   <|  __/
  2164.              |_|    |_| |_||_|    (_) |_|  |_| \__,_||_|\_\\___|
  2165.                                                                
  2166. PHPMUVER = 7.3
  2167. PHP_PGO = y
  2168. make -j4 prof-gen
  2169. CCACHE_DISABLE=1 make PROF_FLAGS=-fprofile-generate all
  2170. make[1]: Entering directory `/svr-setup/php-7.3.3/fpm-build'
  2171. /bin/sh /svr-setup/php-7.3.3/fpm-build/libtool --silent --preserve-dup-deps --mode=compile ccache /opt/rh/devtoolset-8/root/usr/bin/gcc -Iext/date/lib -DZEND_ENABLE_STATIC_TSRMLS_CACHE=1 -DHAVE_TIMELIB_CONFIG_H=1 -Iext/date/ -I/svr-setup/php-7.3.3/ext/date/ -DPHP_ATOM_INC -I/svr-setup/php-7.3.3/fpm-build/include -I/svr-setup/php-7.3.3/fpm-build/main -I/svr-setup/php-7.3.3 -I/svr-setup/php-7.3.3/fpm-build/ext/date/lib -I/svr-setup/php-7.3.3/ext/date/lib -I/usr/include/libxml2 -I/usr/include/enchant -I/usr/X11 -I/usr/include/freetype2 -I/usr/include/libpng15 -I/usr/local/include -I/usr/include/imap -I/svr-setup/php-7.3.3/ext/mbstring/oniguruma -I/svr-setup/php-7.3.3/fpm-build/ext/mbstring/oniguruma -I/svr-setup/php-7.3.3/ext/mbstring/libmbfl -I/svr-setup/php-7.3.3/fpm-build/ext/mbstring/libmbfl -I/svr-setup/php-7.3.3/ext/mbstring/libmbfl/mbfl -I/svr-setup/php-7.3.3/fpm-build/ext/mbstring/libmbfl/mbfl -I/svr-setup/php-7.3.3/ext/sqlite3/libsqlite -I/usr/include/pspell -I/svr-setup/php-7.3.3/fpm-build/TSRM -I/svr-setup/php-7.3.3/fpm-build/Zend -I/svr-setup/php-7.3.3/main -I/svr-setup/php-7.3.3/Zend -I/svr-setup/php-7.3.3/TSRM -I/svr-setup/php-7.3.3/fpm-build/    -I/usr/include -O3 -m64 -march=x86-64 -pipe -gsplit-dwarf -Wno-deprecated-declarations -Wimplicit-fallthrough=0 -fcode-hoisting -Wno-cast-function-type -Wno-error=cast-align -Wno-implicit-function-declaration -Wno-builtin-declaration-mismatch -fvisibility=hidden -DZEND_SIGNALS -fprofile-generate  -c /svr-setup/php-7.3.3/ext/date/php_date.c -o ext/date/php_date.lo
  2172. /bin/sh /svr-setup/php-7.3.3/fpm-build/libtool --silent --preserve-dup-deps --mode=compile ccache /opt/rh/devtoolset-8/root/usr/bin/gcc -Iext/date/lib -DZEND_ENABLE_STATIC_TSRMLS_CACHE=1 -DHAVE_TIMELIB_CONFIG_H=1 -Iext/date/ -I/svr-setup/php-7.3.3/ext/date/ -DPHP_ATOM_INC -I/svr-setup/php-7.3.3/fpm-build/include -I/svr-setup/php-7.3.3/fpm-build/main -I/svr-setup/php-7.3.3 -I/svr-setup/php-7.3.3/fpm-build/ext/date/lib -I/svr-setup/php-7.3.3/ext/date/lib -I/usr/include/libxml2 -I/usr/include/enchant -I/usr/X11 -I/usr/include/freetype2 -I/usr/include/libpng15 -I/usr/local/include -I/usr/include/imap -I/svr-setup/php-7.3.3/ext/mbstring/oniguruma -I/svr-setup/php-7.3.3/fpm-build/ext/mbstring/oniguruma -I/svr-setup/php-7.3.3/ext/mbstring/libmbfl -I/svr-setup/php-7.3.3/fpm-build/ext/mbstring/libmbfl -I/svr-setup/php-7.3.3/ext/mbstring/libmbfl/mbfl -I/svr-setup/php-7.3.3/fpm-build/ext/mbstring/libmbfl/mbfl -I/svr-setup/php-7.3.3/ext/sqlite3/libsqlite -I/usr/include/pspell -I/svr-setup/php-7.3.3/fpm-build/TSRM -I/svr-setup/php-7.3.3/fpm-build/Zend -I/svr-setup/php-7.3.3/main -I/svr-setup/php-7.3.3/Zend -I/svr-setup/php-7.3.3/TSRM -I/svr-setup/php-7.3.3/fpm-build/    -I/usr/include -O3 -m64 -march=x86-64 -pipe -gsplit-dwarf -Wno-deprecated-declarations -Wimplicit-fallthrough=0 -fcode-hoisting -Wno-cast-function-type -Wno-error=cast-align -Wno-implicit-function-declaration -Wno-builtin-declaration-mismatch -fvisibility=hidden -DZEND_SIGNALS -fprofile-generate  -c /svr-setup/php-7.3.3/ext/date/lib/astro.c -o ext/date/lib/astro.lo
  2173. /bin/sh /svr-setup/php-7.3.3/fpm-build/libtool --silent --preserve-dup-deps --mode=compile ccache /opt/rh/devtoolset-8/root/usr/bin/gcc -Iext/date/lib -DZEND_ENABLE_STATIC_TSRMLS_CACHE=1 -DHAVE_TIMELIB_CONFIG_H=1 -Iext/date/ -I/svr-setup/php-7.3.3/ext/date/ -DPHP_ATOM_INC -I/svr-setup/php-7.3.3/fpm-build/include -I/svr-setup/php-7.3.3/fpm-build/main -I/svr-setup/php-7.3.3 -I/svr-setup/php-7.3.3/fpm-build/ext/date/lib -I/svr-setup/php-7.3.3/ext/date/lib -I/usr/include/libxml2 -I/usr/include/enchant -I/usr/X11 -I/usr/include/freetype2 -I/usr/include/libpng15 -I/usr/local/include -I/usr/include/imap -I/svr-setup/php-7.3.3/ext/mbstring/oniguruma -I/svr-setup/php-7.3.3/fpm-build/ext/mbstring/oniguruma -I/svr-setup/php-7.3.3/ext/mbstring/libmbfl -I/svr-setup/php-7.3.3/fpm-build/ext/mbstring/libmbfl -I/svr-setup/php-7.3.3/ext/mbstring/libmbfl/mbfl -I/svr-setup/php-7.3.3/fpm-build/ext/mbstring/libmbfl/mbfl -I/svr-setup/php-7.3.3/ext/sqlite3/libsqlite -I/usr/include/pspell -I/svr-setup/php-7.3.3/fpm-build/TSRM -I/svr-setup/php-7.3.3/fpm-build/Zend -I/svr-setup/php-7.3.3/main -I/svr-setup/php-7.3.3/Zend -I/svr-setup/php-7.3.3/TSRM -I/svr-setup/php-7.3.3/fpm-build/    -I/usr/include -O3 -m64 -march=x86-64 -pipe -gsplit-dwarf -Wno-deprecated-declarations -Wimplicit-fallthrough=0 -fcode-hoisting -Wno-cast-function-type -Wno-error=cast-align -Wno-implicit-function-declaration -Wno-builtin-declaration-mismatch -fvisibility=hidden -DZEND_SIGNALS -fprofile-generate  -c /svr-setup/php-7.3.3/ext/date/lib/dow.c -o ext/date/lib/dow.lo
  2174. /bin/sh /svr-setup/php-7.3.3/fpm-build/libtool --silent --preserve-dup-deps --mode=compile ccache /opt/rh/devtoolset-8/root/usr/bin/gcc -Iext/date/lib -DZEND_ENABLE_STATIC_TSRMLS_CACHE=1 -DHAVE_TIMELIB_CONFIG_H=1 -Iext/date/ -I/svr-setup/php-7.3.3/ext/date/ -DPHP_ATOM_INC -I/svr-setup/php-7.3.3/fpm-build/include -I/svr-setup/php-7.3.3/fpm-build/main -I/svr-setup/php-7.3.3 -I/svr-setup/php-7.3.3/fpm-build/ext/date/lib -I/svr-setup/php-7.3.3/ext/date/lib -I/usr/include/libxml2 -I/usr/include/enchant -I/usr/X11 -I/usr/include/freetype2 -I/usr/include/libpng15 -I/usr/local/include -I/usr/include/imap -I/svr-setup/php-7.3.3/ext/mbstring/oniguruma -I/svr-setup/php-7.3.3/fpm-build/ext/mbstring/oniguruma -I/svr-setup/php-7.3.3/ext/mbstring/libmbfl -I/svr-setup/php-7.3.3/fpm-build/ext/mbstring/libmbfl -I/svr-setup/php-7.3.3/ext/mbstring/libmbfl/mbfl -I/svr-setup/php-7.3.3/fpm-build/ext/mbstring/libmbfl/mbfl -I/svr-setup/php-7.3.3/ext/sqlite3/libsqlite -I/usr/include/pspell -I/svr-setup/php-7.3.3/fpm-build/TSRM -I/svr-setup/php-7.3.3/fpm-build/Zend -I/svr-setup/php-7.3.3/main -I/svr-setup/php-7.3.3/Zend -I/svr-setup/php-7.3.3/TSRM -I/svr-setup/php-7.3.3/fpm-build/    -I/usr/include -O3 -m64 -march=x86-64 -pipe -gsplit-dwarf -Wno-deprecated-declarations -Wimplicit-fallthrough=0 -fcode-hoisting -Wno-cast-function-type -Wno-error=cast-align -Wno-implicit-function-declaration -Wno-builtin-declaration-mismatch -fvisibility=hidden -DZEND_SIGNALS -fprofile-generate  -c /svr-setup/php-7.3.3/ext/date/lib/parse_date.c -o ext/date/lib/parse_date.lo
  2175. /svr-setup/php-7.3.3/ext/date/lib/astro.c: In function ‘astro_revolution’:
  2176. /svr-setup/php-7.3.3/ext/date/lib/astro.c:76:2: internal compiler error: Illegal instruction
  2177.   return (x - 360.0 * floor(x * INV360));
  2178.   ^~~~~~
  2179. Please submit a full bug report,
  2180. with preprocessed source if appropriate.
  2181. See <http://bugzilla.redhat.com/bugzilla> for instructions.
  2182. /svr-setup/php-7.3.3/ext/date/php_date.c: In function ‘date_object_get_properties_interval’:
  2183. /svr-setup/php-7.3.3/ext/date/php_date.c:2491:2: internal compiler error: Illegal instruction
  2184.   ZVAL_DOUBLE(&zv, (double)intervalobj->diff->us / 1000000.0);
  2185.   ^~~~~~~~~~~
  2186. Please submit a full bug report,
  2187. with preprocessed source if appropriate.
  2188. See <http://bugzilla.redhat.com/bugzilla> for instructions.
  2189. /bin/sh /svr-setup/php-7.3.3/fpm-build/libtool --silent --preserve-dup-deps --mode=compile ccache /opt/rh/devtoolset-8/root/usr/bin/gcc -Iext/date/lib -DZEND_ENABLE_STATIC_TSRMLS_CACHE=1 -DHAVE_TIMELIB_CONFIG_H=1 -Iext/date/ -I/svr-setup/php-7.3.3/ext/date/ -DPHP_ATOM_INC -I/svr-setup/php-7.3.3/fpm-build/include -I/svr-setup/php-7.3.3/fpm-build/main -I/svr-setup/php-7.3.3 -I/svr-setup/php-7.3.3/fpm-build/ext/date/lib -I/svr-setup/php-7.3.3/ext/date/lib -I/usr/include/libxml2 -I/usr/include/enchant -I/usr/X11 -I/usr/include/freetype2 -I/usr/include/libpng15 -I/usr/local/include -I/usr/include/imap -I/svr-setup/php-7.3.3/ext/mbstring/oniguruma -I/svr-setup/php-7.3.3/fpm-build/ext/mbstring/oniguruma -I/svr-setup/php-7.3.3/ext/mbstring/libmbfl -I/svr-setup/php-7.3.3/fpm-build/ext/mbstring/libmbfl -I/svr-setup/php-7.3.3/ext/mbstring/libmbfl/mbfl -I/svr-setup/php-7.3.3/fpm-build/ext/mbstring/libmbfl/mbfl -I/svr-setup/php-7.3.3/ext/sqlite3/libsqlite -I/usr/include/pspell -I/svr-setup/php-7.3.3/fpm-build/TSRM -I/svr-setup/php-7.3.3/fpm-build/Zend -I/svr-setup/php-7.3.3/main -I/svr-setup/php-7.3.3/Zend -I/svr-setup/php-7.3.3/TSRM -I/svr-setup/php-7.3.3/fpm-build/    -I/usr/include -O3 -m64 -march=x86-64 -pipe -gsplit-dwarf -Wno-deprecated-declarations -Wimplicit-fallthrough=0 -fcode-hoisting -Wno-cast-function-type -Wno-error=cast-align -Wno-implicit-function-declaration -Wno-builtin-declaration-mismatch -fvisibility=hidden -DZEND_SIGNALS -fprofile-generate  -c /svr-setup/php-7.3.3/ext/date/lib/parse_tz.c -o ext/date/lib/parse_tz.lo
  2190. Preprocessed source stored into /tmp/ccAx6R2P.out file, please attach this to your bugreport.
  2191. make[1]: *** [ext/date/lib/astro.lo] Error 1
  2192. make[1]: *** Waiting for unfinished jobs....
  2193. Preprocessed source stored into /tmp/cc8guQWU.out file, please attach this to your bugreport.
  2194. make[1]: *** [ext/date/php_date.lo] Error 1
  2195. make[1]: Leaving directory `/svr-setup/php-7.3.3/fpm-build'
  2196. make: *** [prof-gen] Error 2
  2197.  
  2198. real    0m20.503s
  2199. user    0m22.540s
  2200. sys     0m1.570s
  2201. /svr-setup/php_pgo_training_scripts /svr-setup/php-7.3.3/fpm-build
  2202. Saved working directory and index state WIP on master: 3f4a289 Merge pull request #1 from bogdanandone/master
  2203. HEAD is now at 3f4a289 Merge pull request #1 from bogdanandone/master
  2204. Already up-to-date.
  2205. /svr-setup/php-7.3.3/fpm-build
  2206. inc/php_upgrade.inc: line 625: ./sapi/cli/php: No such file or directory
  2207. time ./sapi/cgi/php-cgi -T2,80 ../Zend/bench.php
  2208. inc/php_upgrade.inc: line 627: ./sapi/cgi/php-cgi: No such file or directory
  2209.  
  2210. real    0m0.001s
  2211. user    0m0.001s
  2212. sys     0m0.000s
  2213. time ./sapi/cgi/php-cgi -T2,80 ../Zend/micro_bench.php
  2214. inc/php_upgrade.inc: line 629: ./sapi/cgi/php-cgi: No such file or directory
  2215.  
  2216. real    0m0.001s
  2217. user    0m0.001s
  2218. sys     0m0.000s
  2219. ./sapi/cgi/php-cgi -T80 /svr-setup/php_pgo_training_scripts/index.php
  2220. inc/php_upgrade.inc: line 631: ./sapi/cgi/php-cgi: No such file or directory
  2221.  
  2222. real    0m0.001s
  2223. user    0m0.001s
  2224. sys     0m0.000s
  2225. ./sapi/cgi/php-cgi -T80 /home/nginx/domains/pijanitvor.com/public/index.php
  2226. inc/php_upgrade.inc: line 634: ./sapi/cgi/php-cgi: No such file or directory
  2227.  
  2228. real    0m0.001s
  2229. user    0m0.000s
  2230. sys     0m0.001s
  2231. make prof-clean
  2232. find . -name \*.lo -o -name \*.o | xargs rm -f
  2233. find . -name \*.la -o -name \*.a | xargs rm -f
  2234. find . -name \*.so | xargs rm -f
  2235. rm -f libphp7.la sapi/cli/php sapi/cgi/php-cgi  sapi/fpm/php-fpm libphp7.la modules/* libs/*
  2236.  
  2237. real    0m0.028s
  2238. user    0m0.011s
  2239. sys     0m0.021s
  2240. make -j4 prof-use
  2241. CCACHE_DISABLE=1 make PROF_FLAGS=-fprofile-use all
  2242. make[1]: Entering directory `/svr-setup/php-7.3.3/fpm-build'
  2243. /bin/sh /svr-setup/php-7.3.3/fpm-build/libtool --silent --preserve-dup-deps --mode=compile ccache /opt/rh/devtoolset-8/root/usr/bin/gcc -Iext/date/lib -DZEND_ENABLE_STATIC_TSRMLS_CACHE=1 -DHAVE_TIMELIB_CONFIG_H=1 -Iext/date/ -I/svr-setup/php-7.3.3/ext/date/ -DPHP_ATOM_INC -I/svr-setup/php-7.3.3/fpm-build/include -I/svr-setup/php-7.3.3/fpm-build/main -I/svr-setup/php-7.3.3 -I/svr-setup/php-7.3.3/fpm-build/ext/date/lib -I/svr-setup/php-7.3.3/ext/date/lib -I/usr/include/libxml2 -I/usr/include/enchant -I/usr/X11 -I/usr/include/freetype2 -I/usr/include/libpng15 -I/usr/local/include -I/usr/include/imap -I/svr-setup/php-7.3.3/ext/mbstring/oniguruma -I/svr-setup/php-7.3.3/fpm-build/ext/mbstring/oniguruma -I/svr-setup/php-7.3.3/ext/mbstring/libmbfl -I/svr-setup/php-7.3.3/fpm-build/ext/mbstring/libmbfl -I/svr-setup/php-7.3.3/ext/mbstring/libmbfl/mbfl -I/svr-setup/php-7.3.3/fpm-build/ext/mbstring/libmbfl/mbfl -I/svr-setup/php-7.3.3/ext/sqlite3/libsqlite -I/usr/include/pspell -I/svr-setup/php-7.3.3/fpm-build/TSRM -I/svr-setup/php-7.3.3/fpm-build/Zend -I/svr-setup/php-7.3.3/main -I/svr-setup/php-7.3.3/Zend -I/svr-setup/php-7.3.3/TSRM -I/svr-setup/php-7.3.3/fpm-build/    -I/usr/include -O3 -m64 -march=x86-64 -pipe -gsplit-dwarf -Wno-deprecated-declarations -Wimplicit-fallthrough=0 -fcode-hoisting -Wno-cast-function-type -Wno-error=cast-align -Wno-implicit-function-declaration -Wno-builtin-declaration-mismatch -fvisibility=hidden -DZEND_SIGNALS -fprofile-use  -c /svr-setup/php-7.3.3/ext/date/php_date.c -o ext/date/php_date.lo
  2244. /bin/sh /svr-setup/php-7.3.3/fpm-build/libtool --silent --preserve-dup-deps --mode=compile ccache /opt/rh/devtoolset-8/root/usr/bin/gcc -Iext/date/lib -DZEND_ENABLE_STATIC_TSRMLS_CACHE=1 -DHAVE_TIMELIB_CONFIG_H=1 -Iext/date/ -I/svr-setup/php-7.3.3/ext/date/ -DPHP_ATOM_INC -I/svr-setup/php-7.3.3/fpm-build/include -I/svr-setup/php-7.3.3/fpm-build/main -I/svr-setup/php-7.3.3 -I/svr-setup/php-7.3.3/fpm-build/ext/date/lib -I/svr-setup/php-7.3.3/ext/date/lib -I/usr/include/libxml2 -I/usr/include/enchant -I/usr/X11 -I/usr/include/freetype2 -I/usr/include/libpng15 -I/usr/local/include -I/usr/include/imap -I/svr-setup/php-7.3.3/ext/mbstring/oniguruma -I/svr-setup/php-7.3.3/fpm-build/ext/mbstring/oniguruma -I/svr-setup/php-7.3.3/ext/mbstring/libmbfl -I/svr-setup/php-7.3.3/fpm-build/ext/mbstring/libmbfl -I/svr-setup/php-7.3.3/ext/mbstring/libmbfl/mbfl -I/svr-setup/php-7.3.3/fpm-build/ext/mbstring/libmbfl/mbfl -I/svr-setup/php-7.3.3/ext/sqlite3/libsqlite -I/usr/include/pspell -I/svr-setup/php-7.3.3/fpm-build/TSRM -I/svr-setup/php-7.3.3/fpm-build/Zend -I/svr-setup/php-7.3.3/main -I/svr-setup/php-7.3.3/Zend -I/svr-setup/php-7.3.3/TSRM -I/svr-setup/php-7.3.3/fpm-build/    -I/usr/include -O3 -m64 -march=x86-64 -pipe -gsplit-dwarf -Wno-deprecated-declarations -Wimplicit-fallthrough=0 -fcode-hoisting -Wno-cast-function-type -Wno-error=cast-align -Wno-implicit-function-declaration -Wno-builtin-declaration-mismatch -fvisibility=hidden -DZEND_SIGNALS -fprofile-use  -c /svr-setup/php-7.3.3/ext/date/lib/astro.c -o ext/date/lib/astro.lo
  2245. /bin/sh /svr-setup/php-7.3.3/fpm-build/libtool --silent --preserve-dup-deps --mode=compile ccache /opt/rh/devtoolset-8/root/usr/bin/gcc -Iext/date/lib -DZEND_ENABLE_STATIC_TSRMLS_CACHE=1 -DHAVE_TIMELIB_CONFIG_H=1 -Iext/date/ -I/svr-setup/php-7.3.3/ext/date/ -DPHP_ATOM_INC -I/svr-setup/php-7.3.3/fpm-build/include -I/svr-setup/php-7.3.3/fpm-build/main -I/svr-setup/php-7.3.3 -I/svr-setup/php-7.3.3/fpm-build/ext/date/lib -I/svr-setup/php-7.3.3/ext/date/lib -I/usr/include/libxml2 -I/usr/include/enchant -I/usr/X11 -I/usr/include/freetype2 -I/usr/include/libpng15 -I/usr/local/include -I/usr/include/imap -I/svr-setup/php-7.3.3/ext/mbstring/oniguruma -I/svr-setup/php-7.3.3/fpm-build/ext/mbstring/oniguruma -I/svr-setup/php-7.3.3/ext/mbstring/libmbfl -I/svr-setup/php-7.3.3/fpm-build/ext/mbstring/libmbfl -I/svr-setup/php-7.3.3/ext/mbstring/libmbfl/mbfl -I/svr-setup/php-7.3.3/fpm-build/ext/mbstring/libmbfl/mbfl -I/svr-setup/php-7.3.3/ext/sqlite3/libsqlite -I/usr/include/pspell -I/svr-setup/php-7.3.3/fpm-build/TSRM -I/svr-setup/php-7.3.3/fpm-build/Zend -I/svr-setup/php-7.3.3/main -I/svr-setup/php-7.3.3/Zend -I/svr-setup/php-7.3.3/TSRM -I/svr-setup/php-7.3.3/fpm-build/    -I/usr/include -O3 -m64 -march=x86-64 -pipe -gsplit-dwarf -Wno-deprecated-declarations -Wimplicit-fallthrough=0 -fcode-hoisting -Wno-cast-function-type -Wno-error=cast-align -Wno-implicit-function-declaration -Wno-builtin-declaration-mismatch -fvisibility=hidden -DZEND_SIGNALS -fprofile-use  -c /svr-setup/php-7.3.3/ext/date/lib/dow.c -o ext/date/lib/dow.lo
  2246. /bin/sh /svr-setup/php-7.3.3/fpm-build/libtool --silent --preserve-dup-deps --mode=compile ccache /opt/rh/devtoolset-8/root/usr/bin/gcc -Iext/date/lib -DZEND_ENABLE_STATIC_TSRMLS_CACHE=1 -DHAVE_TIMELIB_CONFIG_H=1 -Iext/date/ -I/svr-setup/php-7.3.3/ext/date/ -DPHP_ATOM_INC -I/svr-setup/php-7.3.3/fpm-build/include -I/svr-setup/php-7.3.3/fpm-build/main -I/svr-setup/php-7.3.3 -I/svr-setup/php-7.3.3/fpm-build/ext/date/lib -I/svr-setup/php-7.3.3/ext/date/lib -I/usr/include/libxml2 -I/usr/include/enchant -I/usr/X11 -I/usr/include/freetype2 -I/usr/include/libpng15 -I/usr/local/include -I/usr/include/imap -I/svr-setup/php-7.3.3/ext/mbstring/oniguruma -I/svr-setup/php-7.3.3/fpm-build/ext/mbstring/oniguruma -I/svr-setup/php-7.3.3/ext/mbstring/libmbfl -I/svr-setup/php-7.3.3/fpm-build/ext/mbstring/libmbfl -I/svr-setup/php-7.3.3/ext/mbstring/libmbfl/mbfl -I/svr-setup/php-7.3.3/fpm-build/ext/mbstring/libmbfl/mbfl -I/svr-setup/php-7.3.3/ext/sqlite3/libsqlite -I/usr/include/pspell -I/svr-setup/php-7.3.3/fpm-build/TSRM -I/svr-setup/php-7.3.3/fpm-build/Zend -I/svr-setup/php-7.3.3/main -I/svr-setup/php-7.3.3/Zend -I/svr-setup/php-7.3.3/TSRM -I/svr-setup/php-7.3.3/fpm-build/    -I/usr/include -O3 -m64 -march=x86-64 -pipe -gsplit-dwarf -Wno-deprecated-declarations -Wimplicit-fallthrough=0 -fcode-hoisting -Wno-cast-function-type -Wno-error=cast-align -Wno-implicit-function-declaration -Wno-builtin-declaration-mismatch -fvisibility=hidden -DZEND_SIGNALS -fprofile-use  -c /svr-setup/php-7.3.3/ext/date/lib/parse_date.c -o ext/date/lib/parse_date.lo
  2247. /svr-setup/php-7.3.3/ext/date/lib/astro.c: In function ‘astro_revolution’:
  2248. /svr-setup/php-7.3.3/ext/date/lib/astro.c:76:2: internal compiler error: Illegal instruction
  2249.   return (x - 360.0 * floor(x * INV360));
  2250.   ^~~~~~
  2251. Please submit a full bug report,
  2252. with preprocessed source if appropriate.
  2253. See <http://bugzilla.redhat.com/bugzilla> for instructions.
  2254. /svr-setup/php-7.3.3/ext/date/php_date.c: In function ‘date_object_get_properties_interval’:
  2255. /svr-setup/php-7.3.3/ext/date/php_date.c:2491:2: internal compiler error: Illegal instruction
  2256.   ZVAL_DOUBLE(&zv, (double)intervalobj->diff->us / 1000000.0);
  2257.   ^~~~~~~~~~~
  2258. Please submit a full bug report,
  2259. with preprocessed source if appropriate.
  2260. See <http://bugzilla.redhat.com/bugzilla> for instructions.
  2261. /bin/sh /svr-setup/php-7.3.3/fpm-build/libtool --silent --preserve-dup-deps --mode=compile ccache /opt/rh/devtoolset-8/root/usr/bin/gcc -Iext/date/lib -DZEND_ENABLE_STATIC_TSRMLS_CACHE=1 -DHAVE_TIMELIB_CONFIG_H=1 -Iext/date/ -I/svr-setup/php-7.3.3/ext/date/ -DPHP_ATOM_INC -I/svr-setup/php-7.3.3/fpm-build/include -I/svr-setup/php-7.3.3/fpm-build/main -I/svr-setup/php-7.3.3 -I/svr-setup/php-7.3.3/fpm-build/ext/date/lib -I/svr-setup/php-7.3.3/ext/date/lib -I/usr/include/libxml2 -I/usr/include/enchant -I/usr/X11 -I/usr/include/freetype2 -I/usr/include/libpng15 -I/usr/local/include -I/usr/include/imap -I/svr-setup/php-7.3.3/ext/mbstring/oniguruma -I/svr-setup/php-7.3.3/fpm-build/ext/mbstring/oniguruma -I/svr-setup/php-7.3.3/ext/mbstring/libmbfl -I/svr-setup/php-7.3.3/fpm-build/ext/mbstring/libmbfl -I/svr-setup/php-7.3.3/ext/mbstring/libmbfl/mbfl -I/svr-setup/php-7.3.3/fpm-build/ext/mbstring/libmbfl/mbfl -I/svr-setup/php-7.3.3/ext/sqlite3/libsqlite -I/usr/include/pspell -I/svr-setup/php-7.3.3/fpm-build/TSRM -I/svr-setup/php-7.3.3/fpm-build/Zend -I/svr-setup/php-7.3.3/main -I/svr-setup/php-7.3.3/Zend -I/svr-setup/php-7.3.3/TSRM -I/svr-setup/php-7.3.3/fpm-build/    -I/usr/include -O3 -m64 -march=x86-64 -pipe -gsplit-dwarf -Wno-deprecated-declarations -Wimplicit-fallthrough=0 -fcode-hoisting -Wno-cast-function-type -Wno-error=cast-align -Wno-implicit-function-declaration -Wno-builtin-declaration-mismatch -fvisibility=hidden -DZEND_SIGNALS -fprofile-use  -c /svr-setup/php-7.3.3/ext/date/lib/parse_tz.c -o ext/date/lib/parse_tz.lo
  2262. Preprocessed source stored into /tmp/ccT7OE63.out file, please attach this to your bugreport.
  2263. make[1]: *** [ext/date/lib/astro.lo] Error 1
  2264. make[1]: *** Waiting for unfinished jobs....
  2265. Preprocessed source stored into /tmp/ccrhO6V7.out file, please attach this to your bugreport.
  2266. make[1]: *** [ext/date/php_date.lo] Error 1
  2267. make[1]: Leaving directory `/svr-setup/php-7.3.3/fpm-build'
  2268. make: *** [prof-use] Error 2
  2269.  
  2270. real    0m24.448s
  2271. user    0m26.650s
  2272. sys     0m1.168s
  2273.  
  2274. Fri Mar  8 22:07:09 CET 2019
  2275. Error: 2, PHP make failed (123.09beta01.b109)
  2276.  
  2277.              total        used        free      shared  buff/cache   available
  2278. Mem:           7821        3476        1427          36        2916        3869
  2279. Swap:          1023           0        1023
  2280.  
  2281. report errors on the forums at community.centminmod.com/forums/8/
  2282.  
  2283.              total        used        free      shared  buff/cache   available
  2284. Mem:           7821        3476        1427          36        2916        3869
  2285. Swap:          1023           0        1023
  2286.  
  2287. Filesystem     Type      Size  Used Avail Use% Mounted on
  2288. /dev/vda1      xfs       160G   81G   80G  51% /
  2289. devtmpfs       devtmpfs  3.9G     0  3.9G   0% /dev
  2290. tmpfs          tmpfs     3.9G     0  3.9G   0% /dev/shm
  2291. tmpfs          tmpfs     3.9G   17M  3.9G   1% /run
  2292. tmpfs          tmpfs     3.9G     0  3.9G   0% /sys/fs/cgroup
  2293. tmpfs          tmpfs     783M     0  783M   0% /run/user/0
  2294.  
  2295. CPU: Intel(R) Xeon(R) CPU E5-2687W v3 @ 3.10GHz (4)
  2296.  
  2297. version increment history
  2298. 123.09beta01.b109 #Fri Mar  8 01:18:47 CET 2019
  2299. 123.09beta01.b109 #Fri Mar  8 21:45:00 CET 2019
  2300. 123.09beta01.b109 #Fri Mar  8 21:45:16 CET 2019
  2301. 123.09beta01.b109 #Fri Mar  8 21:47:08 CET 2019
  2302. 123.09beta01.b109 #Fri Mar  8 22:04:37 CET 2019
  2303.  
  2304. last Centmin Mod local git commit entry
  2305. /usr/local/src/centminmod /svr-setup/php-7.3.3/fpm-build
  2306.  
  2307. 17d671b George Liu Fri, 8 Mar 2019 22:57:26 +1000
  2308. move disk_cleanups function to end of routine in 123.09beta01
  2309.  
  2310. 1       0       centmin.sh
  2311. 0       1       inc/centminfinish.inc
  2312. 2 files changed, 1 insertion(+), 1 deletion(-)
  2313. /svr-setup/php-7.3.3/fpm-build
  2314.  
  2315. Total PHP Upgrade Time: 148.295439173 seconds
RAW Paste Data
We use cookies for various purposes including analytics. By continuing to use Pastebin, you agree to our use of cookies as described in the Cookies Policy. OK, I Understand
Not a member of Pastebin yet?
Sign Up, it unlocks many cool features!
 
Top