daily pastebin goal
28%
SHARE
TWEET

Untitled

a guest Jul 31st, 2013 25 Never
Not a member of Pastebin yet? Sign Up, it unlocks many cool features!
  1. pdq2s-MacBook-Pro:openttd2 andy$ hg purge
  2. pdq2s-MacBook-Pro:openttd2 andy$ hg st
  3. pdq2s-MacBook-Pro:openttd2 andy$ curl http://www.tt-forums.net/download/file.php?id=158280 | patch -p0
  4.   % Total    % Received % Xferd  Average Speed   Time    Time     Time  Current
  5.                                  Dload  Upload   Total   Spent    Left  Speed
  6. 100  189k  100  189k    0     0   454k      0 --:--:-- --:--:-- --:--:--  509k
  7. patching file src/train.h
  8. patching file src/lang/english.txt
  9. Hunk #1 succeeded at 4480 (offset 1 line).
  10. patching file src/aaa_template_gui_create.cpp
  11. patching file src/widgets/build_vehicle_widget.h
  12. patching file src/aaa_template_vehicle_func.cpp
  13. patching file src/group_cmd.cpp
  14. patching file src/aaa_template_gui_main.cpp
  15. patching file src/vehiclelist.cpp
  16. patching file src/window_type.h
  17. patching file src/autoreplace_func.h
  18. patching file src/vehicle_cmd.cpp
  19. patching file src/aaa_template_gui_replaceall.h
  20. patching file src/train_cmd.cpp
  21. Hunk #8 succeeded at 3710 (offset 11 lines).
  22. Hunk #9 succeeded at 4019 (offset 11 lines).
  23. patching file src/aaa_template_gui_create_virtualtrain.cpp
  24. patching file src/group_gui.cpp
  25. patching file src/depot_gui.cpp
  26. patching file src/vehicle_gui_base.h
  27. patching file src/newgrf_engine.h
  28. patching file src/articulated_vehicles.cpp
  29. patching file src/newgrf.h
  30. patching file src/vehicle_gui.h
  31. patching file src/aaa_template_vehicle_func.h
  32. patching file src/vehicle_gui.cpp
  33. patching file src/aaa_template_gui_replaceall.cpp
  34. patching file src/saveload/saveload.cpp
  35. patching file src/saveload/saveload_internal.h
  36. patching file src/saveload/aaa_template_replacement_sl.cpp
  37. patching file src/saveload/afterload.cpp
  38. patching file src/saveload/saveload.h
  39. patching file src/saveload/aaa_template_veh_sl.cpp
  40. patching file src/train_gui.cpp
  41. patching file src/aaa_template_gui_create_virtualtrain.h
  42. patching file src/aaa_template_vehicle.h
  43. patching file src/newgrf_spritegroup.cpp
  44. patching file src/newgrf_engine.cpp
  45. patching file src/vehicle.cpp
  46. Hunk #7 succeeded at 2234 (offset 4 lines).
  47. Hunk #8 succeeded at 2245 (offset 4 lines).
  48. Hunk #9 succeeded at 2291 (offset 4 lines).
  49. Hunk #10 succeeded at 2313 (offset 4 lines).
  50. Hunk #11 succeeded at 2329 (offset 4 lines).
  51. patching file src/viewport.cpp
  52. Hunk #1 succeeded at 1976 (offset 39 lines).
  53. patching file src/aaa_template_gui_main.h
  54. patching file src/aaa_template_gui_create.h
  55. patching file src/aaa_template_vehicle.cpp
  56. patching file src/vehicle_base.h
  57. patching file src/autoreplace_cmd.cpp
  58. patching file projects/openttd_vs80.vcproj
  59. patching file projects/openttd_vs90.vcproj
  60. patching file projects/openttd_vs100.vcxproj
  61. patching file projects/openttd_vs100.vcxproj.filters
  62. patching file source.list
  63. pdq2s-MacBook-Pro:openttd2 andy$ make run -j13
  64. [LANG] Generating table/strings.h
  65. [LANG] Compiling language afrikaans
  66. [LANG] Compiling language arabic_egypt
  67. [LANG] Compiling language belarusian
  68. [LANG] Compiling language brazilian_portuguese
  69. [LANG] Compiling language bulgarian
  70. [LANG] Compiling language catalan
  71. [LANG] Compiling language croatian
  72. [LANG] Compiling language danish
  73. [LANG] Compiling language english
  74. [LANG] Compiling language english_AU
  75. [LANG] Compiling language czech
  76. [LANG] Compiling language dutch
  77. [LANG] Compiling language esperanto
  78. [LANG] Compiling language english_US
  79. [LANG] Compiling language estonian
  80. [LANG] Compiling language finnish
  81. [LANG] Compiling language french
  82. [LANG] Compiling language galician
  83. [LANG] Compiling language german
  84. [LANG] Compiling language greek
  85. [LANG] Compiling language hebrew
  86. [LANG] Compiling language hungarian
  87. [LANG] Compiling language icelandic
  88. [LANG] Compiling language italian
  89. [LANG] Compiling language japanese
  90. [LANG] Compiling language indonesian
  91. [LANG] Compiling language irish
  92. [LANG] Compiling language korean
  93. [LANG] Compiling language latvian
  94. [LANG] Compiling language lithuanian
  95. [LANG] Compiling language luxembourgish
  96. [LANG] Compiling language malay
  97. [LANG] Compiling language norwegian_bokmal
  98. [LANG] Compiling language norwegian_nynorsk
  99. [LANG] Compiling language polish
  100. [LANG] Compiling language portuguese
  101. [LANG] Compiling language romanian
  102. [LANG] Compiling language russian
  103. [LANG] Compiling language serbian
  104. [LANG] Compiling language simplified_chinese
  105. [LANG] Compiling language slovenian
  106. [LANG] Compiling language spanish
  107. [LANG] Compiling language slovak
  108. [LANG] Compiling language swedish
  109. [LANG] Compiling language traditional_chinese
  110. [LANG] Compiling language turkish
  111. [LANG] Compiling language ukrainian
  112. [LANG] Compiling language vietnamese
  113. [LANG] Compiling language welsh
  114. make[1]: Nothing to be done for `all'.
  115. make[1]: Nothing to be done for `all'.
  116. make -C /Users/andy/Documents/workspace/openttd2/objs/lang table/strings.h
  117. [LANG] Generating table/strings.h
  118. [SRC] DEP CHECK (all files)
  119. make -C /Users/andy/Documents/workspace/openttd2/objs/lang table/strings.h
  120. [LANG] Generating table/strings.h
  121. [SRC] Compiling aaa_template_gui_create.cpp
  122. [SRC] Compiling aaa_template_gui_create_virtualtrain.cpp
  123. [SRC] Compiling aaa_template_gui_main.cpp
  124. [SRC] Compiling aaa_template_vehicle_func.cpp
  125. [SRC] Compiling aaa_template_gui_replaceall.cpp
  126. [SRC] Compiling aaa_template_vehicle.cpp
  127. [SRC] Compiling ai/ai_config.cpp
  128. [SRC] Compiling ai/ai_core.cpp
  129. [SRC] Compiling ai/ai_gui.cpp
  130. [SRC] Compiling ai/ai_instance.cpp
  131. [SRC] Compiling ai/ai_info.cpp
  132. [SRC] Compiling ai/ai_scanner.cpp
  133. [SRC] Compiling aircraft_cmd.cpp
  134. [SRC] Compiling aircraft_gui.cpp
  135. [SRC] Compiling airport_gui.cpp
  136. /Users/andy/Documents/workspace/openttd2/src/aaa_template_gui_replaceall.cpp: In destructor ‘virtual TemplateReplacementReplaceAllWindow::~TemplateReplacementReplaceAllWindow()’:
  137. /Users/andy/Documents/workspace/openttd2/src/aaa_template_gui_replaceall.cpp:173: warning: comparison between signed and unsigned integer expressions
  138. /Users/andy/Documents/workspace/openttd2/src/aaa_template_gui_replaceall.cpp: In member function ‘virtual void TemplateReplacementReplaceAllWindow::OnClick(OTTD_Point, int, int)’:
  139. /Users/andy/Documents/workspace/openttd2/src/aaa_template_gui_replaceall.cpp:263: warning: comparison between signed and unsigned integer expressions
  140. /Users/andy/Documents/workspace/openttd2/src/aaa_template_gui_replaceall.cpp: In member function ‘bool TemplateReplacementReplaceAllWindow::VirtualTrainHasEngineID(EngineID)’:
  141. /Users/andy/Documents/workspace/openttd2/src/aaa_template_gui_replaceall.cpp:369: warning: comparison between signed and unsigned integer expressions
  142. /Users/andy/Documents/workspace/openttd2/src/aaa_template_gui_replaceall.cpp: In member function ‘void TemplateReplacementReplaceAllWindow::RebuildIncludedTemplateList()’:
  143. /Users/andy/Documents/workspace/openttd2/src/aaa_template_gui_replaceall.cpp:384: warning: comparison between signed and unsigned integer expressions
  144. /Users/andy/Documents/workspace/openttd2/src/aaa_template_gui_replaceall.cpp: In member function ‘void TemplateReplacementReplaceAllWindow::ReplaceAll()’:
  145. /Users/andy/Documents/workspace/openttd2/src/aaa_template_gui_replaceall.cpp:406: warning: comparison between signed and unsigned integer expressions
  146. /Users/andy/Documents/workspace/openttd2/src/aaa_template_gui_create.cpp: In member function ‘void TemplateCreateWindow::ClickedOnVehiclePanel(int, int)’:
  147. /Users/andy/Documents/workspace/openttd2/src/aaa_template_gui_create.cpp:433: warning: unused variable ‘mode’
  148. [SRC] Compiling animated_tile.cpp
  149. [SRC] Compiling articulated_vehicles.cpp
  150. /Users/andy/Documents/workspace/openttd2/src/aaa_template_vehicle_func.cpp: In function ‘void ptv(TemplateVehicle*)’:
  151. /Users/andy/Documents/workspace/openttd2/src/aaa_template_vehicle_func.cpp:57: error: cast from ‘TemplateVehicle*’ to ‘unsigned int’ loses precision
  152. /Users/andy/Documents/workspace/openttd2/src/aaa_template_vehicle_func.cpp:57: error: cast from ‘TemplateVehicle*’ to ‘unsigned int’ loses precision
  153. /Users/andy/Documents/workspace/openttd2/src/aaa_template_vehicle_func.cpp:60: error: cast from ‘TemplateVehicle*’ to ‘unsigned int’ loses precision
  154. /Users/andy/Documents/workspace/openttd2/src/aaa_template_vehicle_func.cpp:60: error: cast from ‘TemplateVehicle*’ to ‘unsigned int’ loses precision
  155. /Users/andy/Documents/workspace/openttd2/src/aaa_template_vehicle_func.cpp: In function ‘void pvt(const Train*)’:
  156. /Users/andy/Documents/workspace/openttd2/src/aaa_template_vehicle_func.cpp:66: warning: format ‘%x’ expects type ‘unsigned int’, but argument 4 has type ‘const Train*’
  157. /Users/andy/Documents/workspace/openttd2/src/aaa_template_vehicle_func.cpp:66: warning: format ‘%x’ expects type ‘unsigned int’, but argument 4 has type ‘const Train*’
  158. /Users/andy/Documents/workspace/openttd2/src/aaa_template_vehicle_func.cpp:69: error: cast from ‘const Train*’ to ‘unsigned int’ loses precision
  159. /Users/andy/Documents/workspace/openttd2/src/aaa_template_vehicle_func.h: At global scope:
  160. /Users/andy/Documents/workspace/openttd2/src/aaa_template_vehicle_func.h:10: warning: ‘REPLACEMENT_IN_PROGRESS’ defined but not used
  161. /Users/andy/Documents/workspace/openttd2/src/aaa_template_vehicle_func.h: At global scope:
  162. /Users/andy/Documents/workspace/openttd2/src/aaa_template_vehicle_func.h:10: warning: ‘REPLACEMENT_IN_PROGRESS’ defined but not used
  163. /Users/andy/Documents/workspace/openttd2/src/aaa_template_vehicle_func.h: At global scope:
  164. /Users/andy/Documents/workspace/openttd2/src/aaa_template_vehicle_func.h:10: warning: ‘REPLACEMENT_IN_PROGRESS’ defined but not used
  165. make[1]: *** [aaa_template_vehicle_func.o] Error 1
  166. make[1]: *** Waiting for unfinished jobs....
  167. /Users/andy/Documents/workspace/openttd2/src/aaa_template_gui_main.cpp: In member function ‘void TemplateReplaceWindow::testfunc()’:
  168. /Users/andy/Documents/workspace/openttd2/src/aaa_template_gui_main.cpp:501: warning: cast from type ‘const TemplateVehicle*’ to type ‘TemplateVehicle*’ casts away constness
  169. /Users/andy/Documents/workspace/openttd2/src/aaa_template_gui_main.cpp:518: warning: unused variable ‘ntv’
  170. /Users/andy/Documents/workspace/openttd2/src/aaa_template_gui_main.cpp: In member function ‘void TemplateReplaceWindow::DrawTemplateList(int, const OTTD_Rect&) const’:
  171. /Users/andy/Documents/workspace/openttd2/src/aaa_template_gui_main.cpp:648: warning: comparison between signed and unsigned integer expressions
  172. /Users/andy/Documents/workspace/openttd2/src/aaa_template_vehicle_func.h: At global scope:
  173. /Users/andy/Documents/workspace/openttd2/src/aaa_template_vehicle_func.h:10: warning: ‘REPLACEMENT_IN_PROGRESS’ defined but not used
  174. /Users/andy/Documents/workspace/openttd2/src/articulated_vehicles.cpp: In function ‘void AddArticulatedParts(Vehicle*)’:
  175. /Users/andy/Documents/workspace/openttd2/src/articulated_vehicles.cpp:326: warning: unused variable ‘eid’
  176. make: *** [all] Error 1
RAW Paste Data
We use cookies for various purposes including analytics. By continuing to use Pastebin, you agree to our use of cookies as described in the Cookies Policy. OK, I Understand
 
Top