daily pastebin goal
78%
SHARE
TWEET

Untitled

a guest Oct 18th, 2018 69 Never
Not a member of Pastebin yet? Sign Up, it unlocks many cool features!
  1. esm:~/dcs-index-git$ cat dcs-index-integration/target/surefire-reports/org.dataconservancy.dcs.index.dcpsolr.transform.IndexOutputFactoryTest.txt
  2. -------------------------------------------------------------------------------
  3. Test set: org.dataconservancy.dcs.index.dcpsolr.transform.IndexOutputFactoryTest
  4. -------------------------------------------------------------------------------
  5. Tests run: 5, Failures: 1, Errors: 0, Skipped: 1, Time elapsed: 1.805 sec <<< FAILURE!
  6. testThreadSafe(org.dataconservancy.dcs.index.dcpsolr.transform.IndexOutputFactoryTest)  Time elapsed: 0.236 sec  <<< FAILURE!
  7. java.lang.AssertionError: Expected 12295, was 312 (Initial size: 12, added: 295) expected:<307> but was:<312>
  8.     at org.junit.Assert.fail(Assert.java:91)
  9.     at org.junit.Assert.failNotEquals(Assert.java:645)
  10.     at org.junit.Assert.assertEquals(Assert.java:126)
  11.     at org.junit.Assert.assertEquals(Assert.java:470)
  12.     at org.dataconservancy.dcs.index.transform.AbstractIndexOutputFactoryTest.testThreadSafe(AbstractIndexOutputFactoryTest.java:195)
  13.     at sun.reflect.NativeMethodAccessorImpl.invoke0(Native Method)
  14.     at sun.reflect.NativeMethodAccessorImpl.invoke(NativeMethodAccessorImpl.java:39)
  15.     at sun.reflect.DelegatingMethodAccessorImpl.invoke(DelegatingMethodAccessorImpl.java:25)
  16.     at java.lang.reflect.Method.invoke(Method.java:597)
  17.     at org.junit.runners.model.FrameworkMethod$1.runReflectiveCall(FrameworkMethod.java:44)
  18.     at org.junit.internal.runners.model.ReflectiveCallable.run(ReflectiveCallable.java:15)
  19.     at org.junit.runners.model.FrameworkMethod.invokeExplosively(FrameworkMethod.java:41)
  20.     at org.junit.internal.runners.statements.InvokeMethod.evaluate(InvokeMethod.java:20)
  21.     at org.junit.runners.BlockJUnit4ClassRunner.runChild(BlockJUnit4ClassRunner.java:76)
  22.     at org.junit.runners.BlockJUnit4ClassRunner.runChild(BlockJUnit4ClassRunner.java:50)
  23.     at org.junit.runners.ParentRunner$3.run(ParentRunner.java:193)
  24.     at org.junit.runners.ParentRunner$1.schedule(ParentRunner.java:52)
  25.     at org.junit.runners.ParentRunner.runChildren(ParentRunner.java:191)
  26.     at org.junit.runners.ParentRunner.access$000(ParentRunner.java:42)
  27.     at org.junit.runners.ParentRunner$2.evaluate(ParentRunner.java:184)
  28.     at org.junit.internal.runners.statements.RunBefores.evaluate(RunBefores.java:28)
  29.     at org.junit.runners.ParentRunner.run(ParentRunner.java:236)
  30.     at org.apache.maven.surefire.junit4.JUnit4TestSet.execute(JUnit4TestSet.java:59)
  31.     at org.apache.maven.surefire.suite.AbstractDirectoryTestSuite.executeTestSet(AbstractDirectoryTestSuite.java:115)
  32.     at org.apache.maven.surefire.suite.AbstractDirectoryTestSuite.execute(AbstractDirectoryTestSuite.java:102)
  33.     at org.apache.maven.surefire.Surefire.run(Surefire.java:180)
  34.     at sun.reflect.NativeMethodAccessorImpl.invoke0(Native Method)
  35.     at sun.reflect.NativeMethodAccessorImpl.invoke(NativeMethodAccessorImpl.java:39)
  36.     at sun.reflect.DelegatingMethodAccessorImpl.invoke(DelegatingMethodAccessorImpl.java:25)
  37.     at java.lang.reflect.Method.invoke(Method.java:597)
  38.     at org.apache.maven.surefire.booter.SurefireBooter.runSuitesInProcess(SurefireBooter.java:350)
  39.     at org.apache.maven.surefire.booter.SurefireBooter.main(SurefireBooter.java:1021)
  40.  
  41. esm:~/dcs-index-git$
RAW Paste Data
We use cookies for various purposes including analytics. By continuing to use Pastebin, you agree to our use of cookies as described in the Cookies Policy. OK, I Understand
 
Top