Guest User

Untitled

a guest
Nov 26th, 2014
186
Never
Not a member of Pastebin yet? Sign Up, it unlocks many cool features!
  1. external/skia/src/core/SkPictureFlat.h: In instantiation of 'class SkFlatDictionary<SkRegion>':
  2. external/skia/src/core/SkPictureFlat.h:665:35: required from here
  3. external/skia/src/core/SkPictureFlat.h:339:7: warning: 'SkFlatDictionary<SkRegion>' declared with greater visibility than the type of its field 'SkFlatDictionary<SkRegion>::fHash' [-Wattributes]
  4. In file included from external/skia/src/utils/debugger/SkDrawCommand.h:12:0,
  5. from external/skia/src/utils/debugger/SkDrawCommand.cpp:10:
  6. external/skia/src/core/SkPictureFlat.h: In instantiation of 'class SkFlatDictionary<SkMatrix>':
  7. external/skia/src/core/SkPictureFlat.h:637:35: required from here
  8. external/skia/src/core/SkPictureFlat.h:339:7: warning: 'SkFlatDictionary<SkMatrix>' declared with greater visibility than the type of its field 'SkFlatDictionary<SkMatrix>::fHash' [-Wattributes]
  9. external/skia/src/core/SkPictureFlat.h: In instantiation of 'class SkFlatDictionary<SkPaint>':
  10. external/skia/src/core/SkPictureFlat.h:655:34: required from here
  11. external/skia/src/core/SkPictureFlat.h:339:7: warning: 'SkFlatDictionary<SkPaint>' declared with greater visibility than the type of its field 'SkFlatDictionary<SkPaint>::fHash' [-Wattributes]
  12. external/skia/src/core/SkPictureFlat.h: In instantiation of 'class SkFlatDictionary<SkRegion>':
  13. external/skia/src/core/SkPictureFlat.h:665:35: required from here
  14. external/skia/src/core/SkPictureFlat.h:339:7: warning: 'SkFlatDictionary<SkRegion>' declared with greater visibility than the type of its field 'SkFlatDictionary<SkRegion>::fHash' [-Wattributes]
  15. external/skia/src/opts/SkBlitMask_opts_arm_neon.cpp: In function 'void D32_A8_Color_neon(void*, size_t, const void*, size_t, SkColor, int, int)':
  16. external/skia/src/opts/SkBlitMask_opts_arm_neon.cpp:77:13: warning: 'vpmc.uint8x8x4_t::val[2]' may be used uninitialized in this function [-Wmaybe-uninitialized]
  17. external/skia/src/opts/SkBlitMask_opts_arm_neon.cpp:47:17: note: 'vpmc.uint8x8x4_t::val[2]' was declared here
  18. external/skia/src/opts/SkBlitMask_opts_arm_neon.cpp:75:13: warning: 'vpmc.uint8x8x4_t::val[1]' may be used uninitialized in this function [-Wmaybe-uninitialized]
  19. external/skia/src/opts/SkBlitMask_opts_arm_neon.cpp:47:17: note: 'vpmc.uint8x8x4_t::val[1]' was declared here
  20. external/skia/src/opts/SkBlitMask_opts_arm_neon.cpp:73:13: warning: 'vpmc.uint8x8x4_t::val[0]' may be used uninitialized in this function [-Wmaybe-uninitialized]
  21. external/skia/src/opts/SkBlitMask_opts_arm_neon.cpp:47:17: note: 'vpmc.uint8x8x4_t::val[0]' was declared here
  22. external/skia/src/opts/SkBlitMask_opts_arm_neon.cpp:64:17: warning: 'vpmc.uint8x8x4_t::val[3]' may be used uninitialized in this function [-Wmaybe-uninitialized]
  23. external/skia/src/opts/SkBlitMask_opts_arm_neon.cpp:47:17: note: 'vpmc.uint8x8x4_t::val[3]' was declared here
  24. external/skia/src/opts/SkBlitMask_opts_arm_neon.cpp: In function 'void D32_A8_Opaque_neon(void*, size_t, const void*, size_t, SkColor, int, int)':
  25. external/skia/src/opts/SkBlitMask_opts_arm_neon.cpp:77:13: warning: 'vpmc.uint8x8x4_t::val[2]' may be used uninitialized in this function [-Wmaybe-uninitialized]
  26. external/skia/src/opts/SkBlitMask_opts_arm_neon.cpp:47:17: note: 'vpmc.uint8x8x4_t::val[2]' was declared here
  27. external/skia/src/opts/SkBlitMask_opts_arm_neon.cpp:75:13: warning: 'vpmc.uint8x8x4_t::val[1]' may be used uninitialized in this function [-Wmaybe-uninitialized]
  28. external/skia/src/opts/SkBlitMask_opts_arm_neon.cpp:47:17: note: 'vpmc.uint8x8x4_t::val[1]' was declared here
  29. external/skia/src/opts/SkBlitMask_opts_arm_neon.cpp:73:13: warning: 'vpmc.uint8x8x4_t::val[0]' may be used uninitialized in this function [-Wmaybe-uninitialized]
  30. external/skia/src/opts/SkBlitMask_opts_arm_neon.cpp:47:17: note: 'vpmc.uint8x8x4_t::val[0]' was declared here
  31. external/skia/src/opts/SkBlitMask_opts_arm_neon.cpp:71:13: warning: 'vpmc.uint8x8x4_t::val[3]' may be used uninitialized in this function [-Wmaybe-uninitialized]
  32. external/skia/src/opts/SkBlitMask_opts_arm_neon.cpp:47:17: note: 'vpmc.uint8x8x4_t::val[3]' was declared here
  33. external/skia/src/opts/SkBlitMask_opts_arm_neon.cpp: In function 'void SkBlitLCD16OpaqueRow_neon(SkPMColor*, const uint16_t*, SkColor, int, SkPMColor)':
  34. external/skia/src/opts/SkBlitMask_opts_arm_neon.cpp:177:75: warning: 'vcolB' may be used uninitialized in this function [-Wmaybe-uninitialized]
  35. external/skia/src/opts/SkBlitMask_opts_arm_neon.cpp:176:75: warning: 'vcolG' may be used uninitialized in this function [-Wmaybe-uninitialized]
  36. external/skia/src/opts/SkBlitMask_opts_arm_neon.cpp:175:75: warning: 'vcolR' may be used uninitialized in this function [-Wmaybe-uninitialized]
  37. external/skia/src/opts/SkBlitMask_opts_arm_neon.cpp: In function 'void SkBlitLCD16Row_neon(SkPMColor*, const uint16_t*, SkColor, int, SkPMColor)':
  38. external/skia/src/opts/SkBlitMask_opts_arm_neon.cpp:235:47: warning: 'vcolA' may be used uninitialized in this function [-Wmaybe-uninitialized]
  39. external/skia/src/opts/SkBlitMask_opts_arm_neon.cpp:242:75: warning: 'vcolB' may be used uninitialized in this function [-Wmaybe-uninitialized]
  40. external/skia/src/opts/SkBlitMask_opts_arm_neon.cpp:241:75: warning: 'vcolG' may be used uninitialized in this function [-Wmaybe-uninitialized]
  41. external/skia/src/opts/SkBlitMask_opts_arm_neon.cpp:240:75: warning: 'vcolR' may be used uninitialized in this function [-Wmaybe-uninitialized]
  42. In file included from external/protobuf/src/google/protobuf/message_lite.h:43:0,
  43. from external/protobuf/src/google/protobuf/repeated_field.h:52,
  44. from frameworks/native/opengl/libs/GLES_trace/src/gltrace.pb.h:23,
  45. from frameworks/native/opengl/libs/GLES_trace/src/gltrace_transport.h:22,
  46. from frameworks/native/opengl/libs/GLES_trace/src/gltrace_context.h:25,
  47. from frameworks/native/opengl/libs/GLES_trace/src/gltrace_eglapi.cpp:25:
  48. external/protobuf/src/google/protobuf/io/coded_stream.h: In member function 'bool google::protobuf::io::CodedInputStream::ReadLittleEndian32(google::protobuf::uint32*)':
  49. external/protobuf/src/google/protobuf/io/coded_stream.h:776:7: warning: comparison between signed and unsigned integer expressions [-Wsign-compare]
  50. external/protobuf/src/google/protobuf/io/coded_stream.h: In member function 'bool google::protobuf::io::CodedInputStream::ReadLittleEndian64(google::protobuf::uint64*)':
  51. external/protobuf/src/google/protobuf/io/coded_stream.h:791:7: warning: comparison between signed and unsigned integer expressions [-Wsign-compare]
  52. In file included from external/protobuf/src/google/protobuf/message_lite.h:43:0,
  53. from external/protobuf/src/google/protobuf/repeated_field.h:52,
  54. from frameworks/native/opengl/libs/GLES_trace/src/gltrace.pb.h:23,
  55. from frameworks/native/opengl/libs/GLES_trace/src/gltrace_transport.h:22,
  56. from frameworks/native/opengl/libs/GLES_trace/src/gltrace_transport.cpp:29:
  57. external/protobuf/src/google/protobuf/io/coded_stream.h: In member function 'bool google::protobuf::io::CodedInputStream::ReadLittleEndian32(google::protobuf::uint32*)':
  58. external/protobuf/src/google/protobuf/io/coded_stream.h:776:7: warning: comparison between signed and unsigned integer expressions [-Wsign-compare]
  59. external/protobuf/src/google/protobuf/io/coded_stream.h: In member function 'bool google::protobuf::io::CodedInputStream::ReadLittleEndian64(google::protobuf::uint64*)':
  60. external/protobuf/src/google/protobuf/io/coded_stream.h:791:7: warning: comparison between signed and unsigned integer expressions [-Wsign-compare]
  61. external/icu4c/common/ubidi.c: In function 'ubidi_setReorderingMode_51':
  62. external/icu4c/common/ubidi.c:294:5: warning: comparison of unsigned expression >= 0 is always true [-Wtype-limits]
  63. external/icu4c/common/ucnv.c: In function 'ucnv_safeClone_51':
  64. external/icu4c/common/ucnv.c:295:43: warning: comparison between signed and unsigned integer expressions [-Wsign-compare]
  65. external/icu4c/common/ucnv.c: In function 'ucnv_close_51':
  66. external/icu4c/common/ucnv.c:385:49: warning: comparison between signed and unsigned integer expressions [-Wsign-compare]
  67. external/icu4c/common/ucnvhz.c:608:1: warning: missing initializer [-Wmissing-field-initializers]
  68. external/icu4c/common/ucnvhz.c:608:1: warning: (near initialization for '_HZImpl.toUTF8') [-Wmissing-field-initializers]
  69. external/icu4c/common/ucnvhz.c:638:1: warning: missing initializer [-Wmissing-field-initializers]
  70. external/icu4c/common/ucnvhz.c:638:1: warning: (near initialization for '_HZData_51.mbcs') [-Wmissing-field-initializers]
  71. external/icu4c/common/ucnvisci.c: In function 'UConverter_toUnicode_ISCII_OFFSETS_LOGIC':
  72. external/icu4c/common/ucnvisci.c:1433:106: warning: comparison between signed and unsigned integer expressions [-Wsign-compare]
  73. external/icu4c/common/ucnvisci.c: At top level:
  74. external/icu4c/common/ucnvisci.c:1600:1: warning: missing initializer [-Wmissing-field-initializers]
  75. external/icu4c/common/ucnvisci.c:1600:1: warning: (near initialization for '_ISCIIImpl.toUTF8') [-Wmissing-field-initializers]
  76. external/icu4c/common/ucnvisci.c:1629:1: warning: missing initializer [-Wmissing-field-initializers]
  77. external/icu4c/common/ucnvisci.c:1629:1: warning: (near initialization for '_ISCIIData_51.mbcs') [-Wmissing-field-initializers]
  78. external/icu4c/common/ucnvlat1.c:465:1: warning: missing initializer [-Wmissing-field-initializers]
  79. external/icu4c/common/ucnvlat1.c:465:1: warning: (near initialization for '_Latin1Data_51.mbcs') [-Wmissing-field-initializers]
  80. external/icu4c/common/ucnvlat1.c:742:1: warning: missing initializer [-Wmissing-field-initializers]
  81. external/icu4c/common/ucnvlat1.c:742:1: warning: (near initialization for '_ASCIIData_51.mbcs') [-Wmissing-field-initializers]
  82. external/icu4c/common/ucnv_lmb.c: In function '_LMBCSOpenWorker':
  83. external/icu4c/common/ucnv_lmb.c:640:9: warning: missing initializer [-Wmissing-field-initializers]
  84. external/icu4c/common/ucnv_lmb.c:640:9: warning: (near initialization for 'stackArgs.nestedLoads') [-Wmissing-field-initializers]
  85. external/icu4c/common/ucnv_lmb.c: At top level:
  86. external/icu4c/common/ucnv_lmb.c:1364:1: warning: missing initializer [-Wmissing-field-initializers]
  87. external/icu4c/common/ucnv_lmb.c:1364:1: warning: (near initialization for '_LMBCSImpl1.toUTF8') [-Wmissing-field-initializers]
  88. external/icu4c/common/ucnv_lmb.c:1364:1: warning: missing initializer [-Wmissing-field-initializers]
  89. external/icu4c/common/ucnv_lmb.c:1364:1: warning: (near initialization for '_LMBCSData1_51.mbcs') [-Wmissing-field-initializers]
  90. external/icu4c/common/ucnv_lmb.c:1365:1: warning: missing initializer [-Wmissing-field-initializers]
  91. external/icu4c/common/ucnv_lmb.c:1365:1: warning: (near initialization for '_LMBCSImpl2.toUTF8') [-Wmissing-field-initializers]
  92. external/icu4c/common/ucnv_lmb.c:1365:1: warning: missing initializer [-Wmissing-field-initializers]
  93. external/icu4c/common/ucnv_lmb.c:1365:1: warning: (near initialization for '_LMBCSData2_51.mbcs') [-Wmissing-field-initializers]
  94. external/icu4c/common/ucnv_lmb.c:1366:1: warning: missing initializer [-Wmissing-field-initializers]
  95. external/icu4c/common/ucnv_lmb.c:1366:1: warning: (near initialization for '_LMBCSImpl3.toUTF8') [-Wmissing-field-initializers]
  96. external/icu4c/common/ucnv_lmb.c:1366:1: warning: missing initializer [-Wmissing-field-initializers]
  97. external/icu4c/common/ucnv_lmb.c:1366:1: warning: (near initialization for '_LMBCSData3_51.mbcs') [-Wmissing-field-initializers]
  98. external/icu4c/common/ucnv_lmb.c:1367:1: warning: missing initializer [-Wmissing-field-initializers]
  99. external/icu4c/common/ucnv_lmb.c:1367:1: warning: (near initialization for '_LMBCSImpl4.toUTF8') [-Wmissing-field-initializers]
  100. external/icu4c/common/ucnv_lmb.c:1367:1: warning: missing initializer [-Wmissing-field-initializers]
  101. external/icu4c/common/ucnv_lmb.c:1367:1: warning: (near initialization for '_LMBCSData4_51.mbcs') [-Wmissing-field-initializers]
  102. external/icu4c/common/ucnv_lmb.c:1368:1: warning: missing initializer [-Wmissing-field-initializers]
  103. external/icu4c/common/ucnv_lmb.c:1368:1: warning: (near initialization for '_LMBCSImpl5.toUTF8') [-Wmissing-field-initializers]
  104. external/icu4c/common/ucnv_lmb.c:1368:1: warning: missing initializer [-Wmissing-field-initializers]
  105. external/icu4c/common/ucnv_lmb.c:1368:1: warning: (near initialization for '_LMBCSData5_51.mbcs') [-Wmissing-field-initializers]
  106. external/icu4c/common/ucnv_lmb.c:1369:1: warning: missing initializer [-Wmissing-field-initializers]
  107. external/icu4c/common/ucnv_lmb.c:1369:1: warning: (near initialization for '_LMBCSImpl6.toUTF8') [-Wmissing-field-initializers]
  108. external/icu4c/common/ucnv_lmb.c:1369:1: warning: missing initializer [-Wmissing-field-initializers]
  109. external/icu4c/common/ucnv_lmb.c:1369:1: warning: (near initialization for '_LMBCSData6_51.mbcs') [-Wmissing-field-initializers]
  110. external/icu4c/common/ucnv_lmb.c:1370:1: warning: missing initializer [-Wmissing-field-initializers]
  111. external/icu4c/common/ucnv_lmb.c:1370:1: warning: (near initialization for '_LMBCSImpl8.toUTF8') [-Wmissing-field-initializers]
  112. external/icu4c/common/ucnv_lmb.c:1370:1: warning: missing initializer [-Wmissing-field-initializers]
  113. external/icu4c/common/ucnv_lmb.c:1370:1: warning: (near initialization for '_LMBCSData8_51.mbcs') [-Wmissing-field-initializers]
  114. external/icu4c/common/ucnv_lmb.c:1371:1: warning: missing initializer [-Wmissing-field-initializers]
  115. external/icu4c/common/ucnv_lmb.c:1371:1: warning: (near initialization for '_LMBCSImpl11.toUTF8') [-Wmissing-field-initializers]
  116. external/icu4c/common/ucnv_lmb.c:1371:1: warning: missing initializer [-Wmissing-field-initializers]
  117. external/icu4c/common/ucnv_lmb.c:1371:1: warning: (near initialization for '_LMBCSData11_51.mbcs') [-Wmissing-field-initializers]
  118. external/icu4c/common/ucnv_lmb.c:1372:1: warning: missing initializer [-Wmissing-field-initializers]
  119. external/icu4c/common/ucnv_lmb.c:1372:1: warning: (near initialization for '_LMBCSImpl16.toUTF8') [-Wmissing-field-initializers]
  120. external/icu4c/common/ucnv_lmb.c:1372:1: warning: missing initializer [-Wmissing-field-initializers]
  121. external/icu4c/common/ucnv_lmb.c:1372:1: warning: (near initialization for '_LMBCSData16_51.mbcs') [-Wmissing-field-initializers]
  122. external/icu4c/common/ucnv_lmb.c:1373:1: warning: missing initializer [-Wmissing-field-initializers]
  123. external/icu4c/common/ucnv_lmb.c:1373:1: warning: (near initialization for '_LMBCSImpl17.toUTF8') [-Wmissing-field-initializers]
  124. external/icu4c/common/ucnv_lmb.c:1373:1: warning: missing initializer [-Wmissing-field-initializers]
  125. external/icu4c/common/ucnv_lmb.c:1373:1: warning: (near initialization for '_LMBCSData17_51.mbcs') [-Wmissing-field-initializers]
  126. external/icu4c/common/ucnv_lmb.c:1374:1: warning: missing initializer [-Wmissing-field-initializers]
  127. external/icu4c/common/ucnv_lmb.c:1374:1: warning: (near initialization for '_LMBCSImpl18.toUTF8') [-Wmissing-field-initializers]
  128. external/icu4c/common/ucnv_lmb.c:1374:1: warning: missing initializer [-Wmissing-field-initializers]
  129. external/icu4c/common/ucnv_lmb.c:1374:1: warning: (near initialization for '_LMBCSData18_51.mbcs') [-Wmissing-field-initializers]
  130. external/icu4c/common/ucnv_lmb.c:1375:1: warning: missing initializer [-Wmissing-field-initializers]
  131. external/icu4c/common/ucnv_lmb.c:1375:1: warning: (near initialization for '_LMBCSImpl19.toUTF8') [-Wmissing-field-initializers]
  132. external/icu4c/common/ucnv_lmb.c:1375:1: warning: missing initializer [-Wmissing-field-initializers]
  133. external/icu4c/common/ucnv_lmb.c:1375:1: warning: (near initialization for '_LMBCSData19_51.mbcs') [-Wmissing-field-initializers]
  134. external/icu4c/common/ucnvmbcs.c: In function '_extFromU':
  135. external/icu4c/common/ucnvmbcs.c:990:19: warning: comparison between signed and unsigned integer expressions [-Wsign-compare]
  136. external/icu4c/common/ucnvmbcs.c: In function '_extToU':
  137. external/icu4c/common/ucnvmbcs.c:1057:19: warning: comparison between signed and unsigned integer expressions [-Wsign-compare]
  138. external/icu4c/common/ucnvmbcs.c: In function 'reconstituteData':
  139. external/icu4c/common/ucnvmbcs.c:1377:19: warning: comparison between signed and unsigned integer expressions [-Wsign-compare]
  140. external/icu4c/common/ucnvmbcs.c: At top level:
  141. external/icu4c/common/ucnvmbcs.c:5648:1: warning: missing initializer [-Wmissing-field-initializers]
  142. external/icu4c/common/ucnvmbcs.c:5648:1: warning: (near initialization for '_MBCSImpl.toUTF8') [-Wmissing-field-initializers]
  143. external/icu4c/common/ucnvmbcs.c:5659:1: warning: missing initializer [-Wmissing-field-initializers]
  144. external/icu4c/common/ucnvmbcs.c:5659:1: warning: (near initialization for '_MBCSData_51.mbcs') [-Wmissing-field-initializers]
  145. external/icu4c/common/ucnvscsu.c:1993:1: warning: missing initializer [-Wmissing-field-initializers]
  146. external/icu4c/common/ucnvscsu.c:1993:1: warning: (near initialization for '_SCSUImpl.toUTF8') [-Wmissing-field-initializers]
  147. external/icu4c/common/ucnvscsu.c:2016:1: warning: missing initializer [-Wmissing-field-initializers]
  148. external/icu4c/common/ucnvscsu.c:2016:1: warning: (near initialization for '_SCSUData_51.mbcs') [-Wmissing-field-initializers]
  149. external/icu4c/common/ucnv_set.c: In function 'ucnv_getUnicodeSet_51':
  150. external/icu4c/common/ucnv_set.c:38:5: warning: comparison of unsigned expression < 0 is always false [-Wtype-limits]
  151. external/icu4c/common/ucnv_u16.c:625:1: warning: missing initializer [-Wmissing-field-initializers]
  152. external/icu4c/common/ucnv_u16.c:625:1: warning: (near initialization for '_UTF16BEImpl.toUTF8') [-Wmissing-field-initializers]
  153. external/icu4c/common/ucnv_u16.c:642:1: warning: missing initializer [-Wmissing-field-initializers]
  154. external/icu4c/common/ucnv_u16.c:642:1: warning: (near initialization for '_UTF16BEData_51.mbcs') [-Wmissing-field-initializers]
  155. external/icu4c/common/ucnv_u16.c:1224:1: warning: missing initializer [-Wmissing-field-initializers]
  156. external/icu4c/common/ucnv_u16.c:1224:1: warning: (near initialization for '_UTF16LEImpl.toUTF8') [-Wmissing-field-initializers]
  157. external/icu4c/common/ucnv_u16.c:1242:1: warning: missing initializer [-Wmissing-field-initializers]
  158. external/icu4c/common/ucnv_u16.c:1242:1: warning: (near initialization for '_UTF16LEData_51.mbcs') [-Wmissing-field-initializers]
  159. external/icu4c/common/ucnv_u16.c:1496:1: warning: missing initializer [-Wmissing-field-initializers]
  160. external/icu4c/common/ucnv_u16.c:1496:1: warning: (near initialization for '_UTF16Impl.toUTF8') [-Wmissing-field-initializers]
  161. external/icu4c/common/ucnv_u16.c:1518:1: warning: missing initializer [-Wmissing-field-initializers]
  162. external/icu4c/common/ucnv_u16.c:1518:1: warning: (near initialization for '_UTF16Data_51.mbcs') [-Wmissing-field-initializers]
  163. external/icu4c/common/ucnv_u16.c:1541:1: warning: missing initializer [-Wmissing-field-initializers]
  164. external/icu4c/common/ucnv_u16.c:1541:1: warning: (near initialization for '_UTF16v2Impl.toUTF8') [-Wmissing-field-initializers]
  165. external/icu4c/common/ucnv_u16.c:1559:1: warning: missing initializer [-Wmissing-field-initializers]
  166. external/icu4c/common/ucnv_u16.c:1559:1: warning: (near initialization for '_UTF16v2Data.mbcs') [-Wmissing-field-initializers]
  167. external/icu4c/common/ucnv_u32.c:484:1: warning: missing initializer [-Wmissing-field-initializers]
  168. external/icu4c/common/ucnv_u32.c:484:1: warning: (near initialization for '_UTF32BEImpl.toUTF8') [-Wmissing-field-initializers]
  169. external/icu4c/common/ucnv_u32.c:502:1: warning: missing initializer [-Wmissing-field-initializers]
  170. external/icu4c/common/ucnv_u32.c:502:1: warning: (near initialization for '_UTF32BEData_51.mbcs') [-Wmissing-field-initializers]
  171. external/icu4c/common/ucnv_u32.c:979:1: warning: missing initializer [-Wmissing-field-initializers]
  172. external/icu4c/common/ucnv_u32.c:979:1: warning: (near initialization for '_UTF32LEImpl.toUTF8') [-Wmissing-field-initializers]
  173. external/icu4c/common/ucnv_u32.c:998:1: warning: missing initializer [-Wmissing-field-initializers]
  174. external/icu4c/common/ucnv_u32.c:998:1: warning: (near initialization for '_UTF32LEData_51.mbcs') [-Wmissing-field-initializers]
  175. external/icu4c/common/ucnv_u32.c:1224:1: warning: missing initializer [-Wmissing-field-initializers]
  176. external/icu4c/common/ucnv_u32.c:1224:1: warning: (near initialization for '_UTF32Impl.toUTF8') [-Wmissing-field-initializers]
  177. external/icu4c/common/ucnv_u32.c:1247:1: warning: missing initializer [-Wmissing-field-initializers]
  178. external/icu4c/common/ucnv_u32.c:1247:1: warning: (near initialization for '_UTF32Data_51.mbcs') [-Wmissing-field-initializers]
  179. external/icu4c/common/ucnv_u7.c:763:1: warning: missing initializer [-Wmissing-field-initializers]
  180. external/icu4c/common/ucnv_u7.c:763:1: warning: (near initialization for '_UTF7Impl.toUTF8') [-Wmissing-field-initializers]
  181. external/icu4c/common/ucnv_u7.c:782:1: warning: missing initializer [-Wmissing-field-initializers]
  182. external/icu4c/common/ucnv_u7.c:782:1: warning: (near initialization for '_UTF7Data_51.mbcs') [-Wmissing-field-initializers]
  183. external/icu4c/common/ucnv_u7.c:1463:1: warning: missing initializer [-Wmissing-field-initializers]
  184. external/icu4c/common/ucnv_u7.c:1463:1: warning: (near initialization for '_IMAPImpl.toUTF8') [-Wmissing-field-initializers]
  185. external/icu4c/common/ucnv_u7.c:1482:1: warning: missing initializer [-Wmissing-field-initializers]
  186. external/icu4c/common/ucnv_u7.c:1482:1: warning: (near initialization for '_IMAPData_51.mbcs') [-Wmissing-field-initializers]
  187. external/icu4c/common/ucnv_u8.c:1041:1: warning: missing initializer [-Wmissing-field-initializers]
  188. external/icu4c/common/ucnv_u8.c:1041:1: warning: (near initialization for '_UTF8Data_51.mbcs') [-Wmissing-field-initializers]
  189. external/icu4c/common/ucnv_u8.c:1066:1: warning: missing initializer [-Wmissing-field-initializers]
  190. external/icu4c/common/ucnv_u8.c:1066:1: warning: (near initialization for '_CESU8Impl.toUTF8') [-Wmissing-field-initializers]
  191. external/icu4c/common/ucnv_u8.c:1084:1: warning: missing initializer [-Wmissing-field-initializers]
  192. external/icu4c/common/ucnv_u8.c:1084:1: warning: (near initialization for '_CESU8Data_51.mbcs') [-Wmissing-field-initializers]
  193. external/icu4c/common/udataswp.c: In function 'udata_swapDataHeader_51':
  194. external/icu4c/common/udataswp.c:252:29: warning: comparison between signed and unsigned integer expressions [-Wsign-compare]
  195. external/icu4c/common/udataswp.c: In function 'udata_openSwapperForInputData_51':
  196. external/icu4c/common/udataswp.c:372:29: warning: comparison between signed and unsigned integer expressions [-Wsign-compare]
  197. external/icu4c/common/udataswp.c:380:29: warning: comparison between signed and unsigned integer expressions [-Wsign-compare]
  198. external/icu4c/common/uhash.c: In function '_uhash_rehash':
  199. external/icu4c/common/uhash.c:401:29: warning: comparison between signed and unsigned integer expressions [-Wsign-compare]
  200. external/icu4c/common/uhash.c: In function 'uhash_openSize_51':
  201. external/icu4c/common/uhash.c:554:13: warning: comparison between signed and unsigned integer expressions [-Wsign-compare]
  202. external/icu4c/common/unorm_it.c: In function 'unorm_openIter_51':
  203. external/icu4c/common/unorm_it.c:560:38: warning: comparison between signed and unsigned integer expressions [-Wsign-compare]
  204. external/icu4c/common/ures_cnv.c: In function 'ures_openU_51':
  205. external/icu4c/common/ures_cnv.c:44:18: warning: comparison between signed and unsigned integer expressions [-Wsign-compare]
  206. external/icu4c/common/ures_cnv.c:62:22: warning: comparison between signed and unsigned integer expressions [-Wsign-compare]
  207. external/icu4c/common/uresdata.c: In function 'ures_swap_51':
  208. external/icu4c/common/uresdata.c:1075:26: warning: comparison between signed and unsigned integer expressions [-Wsign-compare]
  209. external/icu4c/common/utrace.c: In function 'outputPtrBytes':
  210. external/icu4c/common/utrace.c:147:16: warning: comparison between signed and unsigned integer expressions [-Wsign-compare]
  211. external/icu4c/common/ulist.c: In function 'ulist_containsString_51':
  212. external/icu4c/common/ulist.c:132:24: warning: comparison between signed and unsigned integer expressions [-Wsign-compare]
  213. external/icu4c/common/uloc_tag.c: In function '_ldmlKeyToBCP47':
  214. external/icu4c/common/uloc_tag.c:638:16: warning: comparison between signed and unsigned integer expressions [-Wsign-compare]
  215. external/icu4c/common/uloc_tag.c: In function '_bcp47ToLDMLKey':
  216. external/icu4c/common/uloc_tag.c:700:19: warning: comparison between signed and unsigned integer expressions [-Wsign-compare]
  217. external/icu4c/common/uloc_tag.c: In function '_ldmlTypeToBCP47':
  218. external/icu4c/common/uloc_tag.c:778:16: warning: comparison between signed and unsigned integer expressions [-Wsign-compare]
  219. external/icu4c/common/uloc_tag.c:797:17: warning: comparison between signed and unsigned integer expressions [-Wsign-compare]
  220. external/icu4c/common/uloc_tag.c: In function '_bcp47ToLDMLType':
  221. external/icu4c/common/uloc_tag.c:896:16: warning: comparison between signed and unsigned integer expressions [-Wsign-compare]
  222. external/icu4c/common/uloc_tag.c: In function '_appendVariantsToLanguageTag':
  223. external/icu4c/common/uloc_tag.c:1181:66: warning: comparison between signed and unsigned integer expressions [-Wsign-compare]
  224. external/icu4c/common/ucnv_ct.c: In function '_CompoundTextOpen':
  225. external/icu4c/common/ucnv_ct.c:267:9: warning: missing initializer [-Wmissing-field-initializers]
  226. external/icu4c/common/ucnv_ct.c:267:9: warning: (near initialization for 'stackArgs.nestedLoads') [-Wmissing-field-initializers]
  227. external/icu4c/common/ucnv_ct.c: At top level:
  228. external/icu4c/common/ucnv_ct.c:617:1: warning: missing initializer [-Wmissing-field-initializers]
  229. external/icu4c/common/ucnv_ct.c:617:1: warning: (near initialization for '_CompoundTextImpl.toUTF8') [-Wmissing-field-initializers]
  230. external/icu4c/common/ucnv_ct.c:643:1: warning: missing initializer [-Wmissing-field-initializers]
  231. external/icu4c/common/ucnv_ct.c:643:1: warning: (near initialization for '_CompoundTextData_51.mbcs') [-Wmissing-field-initializers]
  232. In file included from frameworks/base/services/input/InputReader.cpp:42:0:
  233. frameworks/base/services/input/InputReader.h: In constructor 'android::InputDevice::InputDevice(android::InputReaderContext*, int32_t, int32_t, int32_t, const android::InputDeviceIdentifier&, uint32_t)':
  234. frameworks/base/services/input/InputReader.h:578:13: warning: 'android::InputDevice::mGeneration' will be initialized after [-Wreorder]
  235. frameworks/base/services/input/InputReader.h:577:13: warning: 'int32_t android::InputDevice::mControllerNumber' [-Wreorder]
  236. frameworks/base/services/input/InputReader.cpp:846:1: warning: when initialized here [-Wreorder]
  237. frameworks/base/services/input/SpriteController.cpp: In member function 'void android::SpriteController::doUpdateSprites()':
  238. frameworks/base/services/input/SpriteController.cpp:219:80: warning: comparison between signed and unsigned integer expressions [-Wsign-compare]
  239. frameworks/base/services/input/SpriteController.cpp:224:82: warning: comparison between signed and unsigned integer expressions [-Wsign-compare]
  240. In file included from /home/hm/WandBoard/android-4.4.4/external/skia/include/core/SkTypes.h:14:0,
  241. from /home/hm/WandBoard/android-4.4.4/external/skia/include/core/SkFixed.h:13,
  242. from /home/hm/WandBoard/android-4.4.4/external/skia/include/core/Sk64.h:13,
  243. from /home/hm/WandBoard/android-4.4.4/external/skia/include/core/SkBitmap.h:13,
  244. from /home/hm/WandBoard/android-4.4.4/external/skia/include/core/SkPicture.h:13,
  245. from external/chromium_org/skia/ext/lazy_pixel_ref_utils.h:10,
  246. from external/chromium_org/skia/ext/lazy_pixel_ref_utils.cc:5:
  247. /home/hm/WandBoard/android-4.4.4/external/skia/include/core/SkUserConfig.h:47:0: warning: "SK_FONTHOST_DOES_NOT_USE_FONTMGR" redefined [enabled by default]
  248. <command-line>:0:0: note: this is the location of the previous definition
  249. In file included from /home/hm/WandBoard/android-4.4.4/external/skia/include/core/SkTypes.h:14:0,
  250. from /home/hm/WandBoard/android-4.4.4/external/skia/include/core/SkThread.h:13,
  251. from /home/hm/WandBoard/android-4.4.4/external/skia/include/core/SkRefCnt.h:13,
  252. from external/chromium_org/third_party/skia/src/core/SkDiscardableMemory.h:11,
  253. from external/chromium_org/skia/ext/SkDiscardableMemory_chrome.h:10,
  254. from external/chromium_org/skia/ext/SkDiscardableMemory_chrome.cc:5:
  255. /home/hm/WandBoard/android-4.4.4/external/skia/include/core/SkUserConfig.h:47:0: warning: "SK_FONTHOST_DOES_NOT_USE_FONTMGR" redefined [enabled by default]
  256. <command-line>:0:0: note: this is the location of the previous definition
  257. Can't exec "/home/hm/WandBoard/android-4.4.4/gcc-linaro-arm-linux-gnueabihf-4.9-2014.09_linux/bin/arm-linux-gnueabihf-": Datei oder Verzeichnis nicht gefunden at /usr/share/perl/5.18/IPC/Open3.pm line 173.
  258. open2: exec of /home/hm/WandBoard/android-4.4.4/gcc-linaro-arm-linux-gnueabihf-4.9-2014.09_linux/bin/arm-linux-gnueabihf- -E -P -x c++ -DENABLE_CUSTOM_SCHEME_HANDLER=0 -DENABLE_SVG_FONTS=1 -DENABLE_GDI_FONTS_ON_WINDOWS=0 -DENABLE_HARFBUZZ_ON_WINDOWS=1 -DWTF_USE_CONCATENATED_IMPULSE_RESPONSES=1 -DENABLE_FAST_MOBILE_SCROLLING=1 -DENABLE_INPUT_SPEECH=0 -DENABLE_LEGACY_NOTIFICATIONS=0 -DENABLE_MEDIA_CAPTURE=1 -DENABLE_ORIENTATION_EVENTS=1 -DENABLE_TOUCH_ICON_LOADING=1 -DENABLE_NAVIGATOR_CONTENT_UTILS=0 -DENABLE_OPENTYPE_VERTICAL=1 css/html.css failed at ../build/scripts/preprocessor.pm line 80.
  259. Traceback (most recent call last):
  260. File "../build/scripts/action_useragentstylesheets.py", line 124, in <module>
  261. sys.exit(main(sys.argv))
  262. File "../build/scripts/action_useragentstylesheets.py", line 118, in main
  263. assert returnCode == 0
  264. AssertionError
  265. make: *** [out/target/product/armv7-a-neon/obj/GYP/shared_intermediates/blink/UserAgentStyleSheets.h] Fehler 1
  266. make: *** Datei »out/target/product/armv7-a-neon/obj/GYP/shared_intermediates/blink/UserAgentStyleSheets.h« wird gelöscht
  267. make: *** Warte auf noch nicht beendete Prozesse...
RAW Paste Data